Raspbian Package Auto-Building

Buildd status for cpl-plugin-xsh (jessie-staging)

Debian PTSTrackerChangelogBugspackages.d.obuildd.d.o

Package(s): Suite:
Compact mode Co-maintainers

ArchitectureVersionStatusForBuilddStateMiscLogs
Buildd exposure stats armhf  2.3.0+dfsg-3Build-Attempted122d 4h 10mmb-lxc-01uncompiledmisc:sourceold | all (20)

Tail of log for cpl-plugin-xsh on armhf:

Makefile:1718: recipe for target 'check-TESTS' failed
make[4]: *** [check-TESTS] Error 1
make[4]: Leaving directory '/<<BUILDDIR>>/cpl-plugin-xsh-2.3.0+dfsg/xsh/tests'
Makefile:1841: recipe for target 'check-am' failed
make[3]: *** [check-am] Error 2
make[3]: Leaving directory '/<<BUILDDIR>>/cpl-plugin-xsh-2.3.0+dfsg/xsh/tests'
Makefile:874: recipe for target 'check-recursive' failed
make[2]: *** [check-recursive] Error 1
make[2]: Leaving directory '/<<BUILDDIR>>/cpl-plugin-xsh-2.3.0+dfsg/xsh'
Makefile:518: recipe for target 'check-recursive' failed
make[1]: *** [check-recursive] Error 1
make[1]: Leaving directory '/<<BUILDDIR>>/cpl-plugin-xsh-2.3.0+dfsg'
dh_auto_test: make -j1 check returned exit code 2
debian/rules:14: recipe for target 'build-arch' failed
make: *** [build-arch] Error 2