Raspbian Package Auto-Building

Buildd status for colmap (bullseye-staging)

Debian PTSTrackerChangelogBugspackages.d.obuildd.d.o

Package(s): Suite:
Compact mode Co-maintainers

ArchitectureVersionStatusForBuilddStateMiscLogs
Buildd exposure stats armhf  3.6+dev2+git20191105-1Build-Attempted8d 3h 53mmb-lxc-02uncompiledmisc:sourceold | all (2)

Tail of log for colmap on armhf:

make[3]: *** [src/CMakeFiles/colmap.dir/build.make:1008: src/CMakeFiles/colmap.dir/ui/automatic_reconstruction_widget.cc.o] Error 1
make[3]: *** Waiting for unfinished jobs....
In file included from /<<BUILDDIR>>/colmap-3.6+dev2+git20191105/src/ui/main_window.h:50,
                 from /<<BUILDDIR>>/colmap-3.6+dev2+git20191105/src/ui/bundle_adjustment_widget.cc:35:
/<<BUILDDIR>>/colmap-3.6+dev2+git20191105/src/ui/model_viewer_widget.h:55:63: error: expected class-name before '{' token
   55 |                           protected QOpenGLFunctions_3_2_Core {
      |                                                               ^
make[3]: *** [src/CMakeFiles/colmap.dir/build.make:1021: src/CMakeFiles/colmap.dir/ui/bundle_adjustment_widget.cc.o] Error 1
make[3]: Leaving directory '/<<BUILDDIR>>/colmap-3.6+dev2+git20191105/obj-arm-linux-gnueabihf'
make[2]: *** [CMakeFiles/Makefile2:672: src/CMakeFiles/colmap.dir/all] Error 2
make[2]: Leaving directory '/<<BUILDDIR>>/colmap-3.6+dev2+git20191105/obj-arm-linux-gnueabihf'
make[1]: *** [Makefile:133: all] Error 2
make[1]: Leaving directory '/<<BUILDDIR>>/colmap-3.6+dev2+git20191105/obj-arm-linux-gnueabihf'
dh_auto_build: cd obj-arm-linux-gnueabihf && make -j4 "INSTALL=install --strip-program=true" returned exit code 2
make: *** [debian/rules:28: build-arch] Error 255