Raspbian Package Auto-Building

Buildd status for ck (stretch-staging)

Debian PTSTrackerChangelogBugspackages.d.obuildd.d.o

Package(s): Suite:
Compact mode Co-maintainers

ArchitectureVersionStatusForBuilddStateMiscLogs
Buildd exposure stats armhf  0.5.2-2.1Build-Attempted906d 9h 33mtestwandboarduncompiledmisc:extraold | all (5)

Tail of log for ck on armhf:

{standard input}:773: Error: selected processor does not support `strexbeq r2,r8,[r5]' in ARM mode
Makefile:18: recipe for target 'ck_pr_cas' failed
make[4]: *** [ck_pr_cas] Error 1
make[4]: Leaving directory '/<<PKGBUILDDIR>>/regressions/ck_pr/validate'
Makefile:29: recipe for target 'all' failed
make[3]: *** [all] Error 2
make[3]: Leaving directory '/<<PKGBUILDDIR>>/regressions'
Makefile:27: recipe for target 'regressions' failed
make[2]: *** [regressions] Error 2
make[2]: Leaving directory '/<<PKGBUILDDIR>>'
debian/rules:15: recipe for target 'override_dh_auto_test' failed
make[1]: *** [override_dh_auto_test] Error 2
make[1]: Leaving directory '/<<PKGBUILDDIR>>'
debian/rules:18: recipe for target 'build-arch' failed
make: *** [build-arch] Error 2