Raspbian Package Auto-Building

Buildd status for cde (jessie-staging)

Debian PTSTrackerChangelogBugspackages.d.obuildd.d.o

Package(s): Suite:
Compact mode Co-maintainers

ArchitectureVersionStatusForBuilddStateMiscLogs
Buildd exposure stats armhf  0.1+git9-g551e54d-1Build-Attempted183d 13h 58mmb-lxc-01uncompiledutils:sourceold | all (23)

Tail of log for cde on armhf:

Makefile:543: recipe for target 'strace.o' failed
make[4]: *** [strace.o] Error 1
make[4]: Leaving directory '/<<BUILDDIR>>/cde-0.1+git9-g551e54d/strace-4.6'
Makefile:601: recipe for target 'all-recursive' failed
make[3]: *** [all-recursive] Error 1
make[3]: Leaving directory '/<<BUILDDIR>>/cde-0.1+git9-g551e54d/strace-4.6'
Makefile:375: recipe for target 'all' failed
make[2]: *** [all] Error 2
make[2]: Leaving directory '/<<BUILDDIR>>/cde-0.1+git9-g551e54d/strace-4.6'
Makefile:6: recipe for target 'all' failed
make[1]: *** [all] Error 2
make[1]: Leaving directory '/<<BUILDDIR>>/cde-0.1+git9-g551e54d'
dh_auto_build: make -j1 returned exit code 2
debian/rules:38: recipe for target 'build-arch' failed
make: *** [build-arch] Error 2