Raspbian Package Auto-Building

Buildd status for bbhash (bullseye-staging)

Debian PTSTrackerChangelogBugspackages.d.obuildd.d.o

Package(s): Suite:
Compact mode Co-maintainers

ArchitectureVersionStatusForBuilddStateMiscLogs
Buildd exposure stats armhf  1.0.0-3Build-Attempted65d 15h 43mtest2019uncompiledmisc:sourceold | all (2)

Tail of log for bbhash on armhf:

BooPHF.h:817:35: error: expected ‘)’ before ‘word’
  817 |   return (uint64_t)(((__uint128_t)word * (__uint128_t)p) >> 64);
      |                     ~             ^~~~
      |                                   )
BooPHF.h:817:64: error: expected ‘)’ before ‘;’ token
  817 |   return (uint64_t)(((__uint128_t)word * (__uint128_t)p) >> 64);
      |                    ~                                           ^
      |                                                                )
make[1]: *** [makefile:22: example] Error 1
make[1]: *** Waiting for unfinished jobs....
make[1]: *** [makefile:25: example_custom_hash] Error 1
make[1]: *** [makefile:29: Bootest] Error 1
make[1]: Leaving directory '/<<PKGBUILDDIR>>'
dh_auto_build: error: make -j4 "INSTALL=install --strip-program=true" returned exit code 2
make: *** [debian/rules:21: binary-arch] Error 25