Raspbian Package Auto-Building

Buildd status for selected packages (buster-staging)

Bugs

Package(s): Suite:
Compact mode Co-maintainers

Package armhf
Buildd exposure stats
✔ bagelBuild-Attempted
✔ highwayhashBuild-Attempted
✔ libundeadBuild-Attempted
✔ kvmtoolBuild-Attempted
✔ mrsBuild-Attempted
✔ haskell-protobufBuild-Attempted
✔ reprozipBuild-Attempted
✔ qca-cyrus-saslBuild-Attempted
✔ qca2-plugin-osslBuild-Attempted
✔ gfccoreBuild-Attempted
✔ libsoundioBuild-Attempted
✔ ngs-sdkBuild-Attempted
✔ libqglviewerBuild-Attempted
✔ acoveaBuild-Attempted
✔ apfBuild-Attempted
✔ ocamlgslBuild-Attempted
✔ asterisk-chan-capiBuild-Attempted
✔ libqt4pasBuild-Attempted
✔ mingw32-binutilsBuild-Attempted
Package armhf
Buildd exposure stats
✔ criuBuild-Attempted
✔ debimanBuild-Attempted
✔ djbdnsBuild-Attempted
✔ poclBuild-Attempted
✔ audacious-analog-vumeter-pluginBuild-Attempted
✔ blastemBuild-Attempted
✔ dustracBuild-Attempted
✔ fuse-umfuse-iso9660Build-Attempted
✔ cryptominisatBuild-Attempted
✔ consul-migrateBuild-Attempted
✔ dxvkBuild-Attempted
✔ ezquakeBuild-Attempted
✔ gammapyBuild-Attempted
✔ ioappsBuild-Attempted
✔ jellyfishBuild-Attempted
✔ jocamlBuild-Attempted
✔ ibamBuild-Attempted
✔ haskell-type-levelBuild-Attempted
✔ freefoamBuild-Attempted
✔ haskell-pretty-simpleBuild-Attempted
Package armhf
Buildd exposure stats
✔ haskell-heterocephalusBuild-Attempted
✔ kpkpassBuild-Attempted
✔ libmath-int128-perlBuild-Attempted
✔ libnunc-stansBuild-Attempted
✔ libmlx5Build-Attempted
✔ lib3mfBuild-Attempted
✔ libsis-jhdf5-javaBuild-Attempted
✔ libretro-mupen64plusBuild-Attempted
✔ libtangoBuild-Attempted
✔ libxsmmBuild-Attempted
✔ listallerBuild-Attempted
✔ kubernetes-addon-heapsterBuild-Attempted
✔ leela-zeroBuild-Attempted
✔ mpqc3Build-Attempted
✔ nsd3Build-Attempted
✔ msrtoolBuild-Attempted
✔ lz4toolsBuild-Attempted
✔ octave-tiseanBuild-Attempted
✔ open-axiomBuild-Attempted
✔ minimap2Build-Attempted
Package armhf
Buildd exposure stats
✔ mensisBuild-Attempted
✔ openmpi1.6Build-Attempted
✔ oliveBuild-Attempted
✔ orpieBuild-Attempted
✔ neuronBuild-Attempted
✔ percona-xtradb-cluster-galera-2.xBuild-Attempted
✔ qutecsoundBuild-Attempted
✔ perftestBuild-Attempted
✔ qwinffBuild-Attempted
✔ rpm2htmlBuild-Attempted
✔ olive-editorBuild-Attempted
✔ prboomBuild-Attempted
✔ qtjsbackend-opensource-srcBuild-Attempted
✔ ruby2.1Build-Attempted
✔ tlsdateBuild-Attempted
✔ tarantoolBuild-Attempted
✔ traildbBuild-Attempted
✔ slang-slirpBuild-Attempted
✔ osrmBuild-Attempted
✔ tendermintBuild-Attempted
Package armhf
Buildd exposure stats
✔ tulipBuild-Attempted
✔ wmmailBuild-Attempted
✔ varnish-agentBuild-Attempted
✔ sdrangeloveBuild-Attempted
✔ trilinosBuild-Attempted
✔ xf86-video-msmBuild-Attempted
✔ unanimityBuild-Attempted
✔ wesnoth-1.8Build-Attempted
✔ qtoxBuild-Attempted
✔ iem-plugin-suiteBuild-Attempted
✔ coneBuild-Attempted
✔ pyfftwBuild-Attempted
✔ valentinaBuild-Attempted
✔ rheolefBuild-Attempted
✔ colmapBuild-Attempted
✔ gatb-coreBuild-Attempted
✔ agdaBuild-Attempted
✔ flangBuild-Attempted
✔ chromium-browserBuild-Attempted

Tail of log for bagel on armhf:

mpi_interface.cc:267:32: error: static assertion failed: size_t is assumed to be the same size as unsigned long long
   static_assert(sizeof(size_t) == sizeof(unsigned long long), "size_t is assumed to be the same size as unsigned long long");
                 ~~~~~~~~~~~~~~~^~~~~~~~~~~~~~~~~~~~~~~~~~~~~
make[5]: *** [Makefile:408: mpi_interface.lo] Error 1
make[5]: Leaving directory '/<<PKGBUILDDIR>>/src/util/parallel'
make[4]: *** [Makefile:462: all-recursive] Error 1
make[4]: Leaving directory '/<<PKGBUILDDIR>>/src/util'
make[3]: *** [Makefile:625: all-recursive] Error 1
make[3]: Leaving directory '/<<PKGBUILDDIR>>/src'
make[2]: *** [Makefile:422: all-recursive] Error 1
make[2]: Leaving directory '/<<PKGBUILDDIR>>'
make[1]: *** [Makefile:354: all] Error 2
make[1]: Leaving directory '/<<PKGBUILDDIR>>'
dh_auto_build: make -j1 returned exit code 2
make: *** [debian/rules:12: build-arch] Error 2

Tail of log for highwayhash on armhf:

./highwayhash/profiler.h: In member function 'void highwayhash::Results::UpdateOrAdd(size_t, uint64_t, uint64_t)':
./highwayhash/profiler.h:424:54: warning: left shift count >= width of type [-Wshift-count-overflow]
     zone->num_calls = (biased_offset << Accumulator::kNumCallBits) + num_calls;
                                                      ^~~~~~~~~~~~
./highwayhash/profiler.h: In member function 'void highwayhash::Results::MergeDuplicates()':
./highwayhash/profiler.h:458:42: warning: left shift count >= width of type [-Wshift-count-overflow]
           (biased_offset << Accumulator::kNumCallBits) + num_calls;
                                          ^~~~~~~~~~~~
make[1]: *** [Makefile:52: obj/profiler_example.o] Error 1
make[1]: *** Waiting for unfinished jobs....
make[1]: *** [Makefile:51: obj/nanobenchmark.o] Error 1
rm obj/nanobenchmark_example.o
make[1]: Leaving directory '/<<PKGBUILDDIR>>'
dh_auto_build: make -j4 "INSTALL=install --strip-program=true" returned exit code 2
make: *** [debian/rules:22: build-arch] Error 2

Tail of log for libundead on armhf:

LLVM ERROR: failed to perform tail call elimination on a call site marked musttail
[6/29] ldc2 -I=undead@sha -I=. -I=.. -I=../src/ -enable-color -O -g -release -wi -mattr=-neon -relocation-model=pic   -of='undead@sha/src_undead_dateparse.d.o' -c ../src/undead/dateparse.d
[7/29] ldc2 -I=undead@sha -I=. -I=.. -I=../src/ -enable-color -O -g -release -wi -mattr=-neon -relocation-model=pic   -of='undead@sha/src_undead_date.d.o' -c ../src/undead/date.d
[8/29] ldc2 -I=undead@sha -I=. -I=.. -I=../src/ -enable-color -O -g -release -wi -mattr=-neon -relocation-model=pic   -of='undead@sha/src_undead_regexp.d.o' -c ../src/undead/regexp.d
../src/undead/regexp.d(211): Deprecation: The `delete` keyword has been deprecated.  Use `object.destroy()` (and `core.memory.GC.free()` if applicable) instead.
../src/undead/regexp.d(293): Deprecation: The `delete` keyword has been deprecated.  Use `object.destroy()` (and `core.memory.GC.free()` if applicable) instead.
../src/undead/regexp.d(370): Deprecation: The `delete` keyword has been deprecated.  Use `object.destroy()` (and `core.memory.GC.free()` if applicable) instead.
../src/undead/regexp.d(460): Deprecation: The `delete` keyword has been deprecated.  Use `object.destroy()` (and `core.memory.GC.free()` if applicable) instead.
../src/undead/regexp.d(544): Deprecation: The `delete` keyword has been deprecated.  Use `object.destroy()` (and `core.memory.GC.free()` if applicable) instead.
../src/undead/regexp.d(597): Deprecation: The `delete` keyword has been deprecated.  Use `object.destroy()` (and `core.memory.GC.free()` if applicable) instead.
../src/undead/regexp.d(939): Deprecation: The `delete` keyword has been deprecated.  Use `object.destroy()` (and `core.memory.GC.free()` if applicable) instead.
../src/undead/regexp.d(3021): Deprecation: integral promotion not done for `~prog[i + 1u + 4u + b]`, use '-transition=intpromote' switch or `~cast(int)(prog[i + 1u + 4u + b])`
ninja: build stopped: subcommand failed.
dh_auto_build: cd obj-arm-linux-gnueabihf && LC_ALL=C.UTF-8 ninja -j4 -v returned exit code 1
make: *** [debian/rules:9: build-arch] Error 1

Tail of log for kvmtool on armhf:

gcc -c -Wp,-MD,./.guest_compat.o.d  -march=armv7-a -DCONFIG_GUEST_INIT -Wdate-time -D_FORTIFY_SOURCE=2 -DCONFIG_ARM -D_FILE_OFFSET_BITS=64 -D_GNU_SOURCE -DKVMTOOLS_VERSION='""' -DBUILD_ARCH='"arm"' -Iinclude -Iarm/include -Iarm/aarch32/include -O2 -fno-strict-aliasing -g -Wall -Wformat=2 -Winit-self -Wmissing-declarations -Wmissing-prototypes -Wnested-externs -Wno-system-headers -Wold-style-definition -Wredundant-decls -Wsign-compare -Wstrict-prototypes -Wundef -Wvolatile-register-var -Wwrite-strings -Wno-format-nonliteral -Werror -DCONFIG_HAS_ZLIB -DCONFIG_HAS_AIO -DCONFIG_HAS_LIBFDT guest_compat.c -o guest_compat.o
gcc -c -Wp,-MD,hw/.rtc.o.d  -march=armv7-a -DCONFIG_GUEST_INIT -Wdate-time -D_FORTIFY_SOURCE=2 -DCONFIG_ARM -D_FILE_OFFSET_BITS=64 -D_GNU_SOURCE -DKVMTOOLS_VERSION='""' -DBUILD_ARCH='"arm"' -Iinclude -Iarm/include -Iarm/aarch32/include -O2 -fno-strict-aliasing -g -Wall -Wformat=2 -Winit-self -Wmissing-declarations -Wmissing-prototypes -Wnested-externs -Wno-system-headers -Wold-style-definition -Wredundant-decls -Wsign-compare -Wstrict-prototypes -Wundef -Wvolatile-register-var -Wwrite-strings -Wno-format-nonliteral -Werror -DCONFIG_HAS_ZLIB -DCONFIG_HAS_AIO -DCONFIG_HAS_LIBFDT hw/rtc.c -o hw/rtc.o
gcc -c -Wp,-MD,hw/.serial.o.d  -march=armv7-a -DCONFIG_GUEST_INIT -Wdate-time -D_FORTIFY_SOURCE=2 -DCONFIG_ARM -D_FILE_OFFSET_BITS=64 -D_GNU_SOURCE -DKVMTOOLS_VERSION='""' -DBUILD_ARCH='"arm"' -Iinclude -Iarm/include -Iarm/aarch32/include -O2 -fno-strict-aliasing -g -Wall -Wformat=2 -Winit-self -Wmissing-declarations -Wmissing-prototypes -Wnested-externs -Wno-system-headers -Wold-style-definition -Wredundant-decls -Wsign-compare -Wstrict-prototypes -Wundef -Wvolatile-register-var -Wwrite-strings -Wno-format-nonliteral -Werror -DCONFIG_HAS_ZLIB -DCONFIG_HAS_AIO -DCONFIG_HAS_LIBFDT hw/serial.c -o hw/serial.o
gcc -c -Wp,-MD,./.ioport.o.d  -march=armv7-a -DCONFIG_GUEST_INIT -Wdate-time -D_FORTIFY_SOURCE=2 -DCONFIG_ARM -D_FILE_OFFSET_BITS=64 -D_GNU_SOURCE -DKVMTOOLS_VERSION='""' -DBUILD_ARCH='"arm"' -Iinclude -Iarm/include -Iarm/aarch32/include -O2 -fno-strict-aliasing -g -Wall -Wformat=2 -Winit-self -Wmissing-declarations -Wmissing-prototypes -Wnested-externs -Wno-system-headers -Wold-style-definition -Wredundant-decls -Wsign-compare -Wstrict-prototypes -Wundef -Wvolatile-register-var -Wwrite-strings -Wno-format-nonliteral -Werror -DCONFIG_HAS_ZLIB -DCONFIG_HAS_AIO -DCONFIG_HAS_LIBFDT ioport.c -o ioport.o
gcc -c -Wp,-MD,./.irq.o.d  -march=armv7-a -DCONFIG_GUEST_INIT -Wdate-time -D_FORTIFY_SOURCE=2 -DCONFIG_ARM -D_FILE_OFFSET_BITS=64 -D_GNU_SOURCE -DKVMTOOLS_VERSION='""' -DBUILD_ARCH='"arm"' -Iinclude -Iarm/include -Iarm/aarch32/include -O2 -fno-strict-aliasing -g -Wall -Wformat=2 -Winit-self -Wmissing-declarations -Wmissing-prototypes -Wnested-externs -Wno-system-headers -Wold-style-definition -Wredundant-decls -Wsign-compare -Wstrict-prototypes -Wundef -Wvolatile-register-var -Wwrite-strings -Wno-format-nonliteral -Werror -DCONFIG_HAS_ZLIB -DCONFIG_HAS_AIO -DCONFIG_HAS_LIBFDT irq.c -o irq.o
gcc -c -Wp,-MD,./.kvm-cpu.o.d  -march=armv7-a -DCONFIG_GUEST_INIT -Wdate-time -D_FORTIFY_SOURCE=2 -DCONFIG_ARM -D_FILE_OFFSET_BITS=64 -D_GNU_SOURCE -DKVMTOOLS_VERSION='""' -DBUILD_ARCH='"arm"' -Iinclude -Iarm/include -Iarm/aarch32/include -O2 -fno-strict-aliasing -g -Wall -Wformat=2 -Winit-self -Wmissing-declarations -Wmissing-prototypes -Wnested-externs -Wno-system-headers -Wold-style-definition -Wredundant-decls -Wsign-compare -Wstrict-prototypes -Wundef -Wvolatile-register-var -Wwrite-strings -Wno-format-nonliteral -Werror -DCONFIG_HAS_ZLIB -DCONFIG_HAS_AIO -DCONFIG_HAS_LIBFDT kvm-cpu.c -o kvm-cpu.o
gcc -c -Wp,-MD,./.kvm.o.d  -march=armv7-a -DCONFIG_GUEST_INIT -Wdate-time -D_FORTIFY_SOURCE=2 -DCONFIG_ARM -D_FILE_OFFSET_BITS=64 -D_GNU_SOURCE -DKVMTOOLS_VERSION='""' -DBUILD_ARCH='"arm"' -Iinclude -Iarm/include -Iarm/aarch32/include -O2 -fno-strict-aliasing -g -Wall -Wformat=2 -Winit-self -Wmissing-declarations -Wmissing-prototypes -Wnested-externs -Wno-system-headers -Wold-style-definition -Wredundant-decls -Wsign-compare -Wstrict-prototypes -Wundef -Wvolatile-register-var -Wwrite-strings -Wno-format-nonliteral -Werror -DCONFIG_HAS_ZLIB -DCONFIG_HAS_AIO -DCONFIG_HAS_LIBFDT kvm.c -o kvm.o
gcc -c -Wp,-MD,./.main.o.d  -march=armv7-a -DCONFIG_GUEST_INIT -Wdate-time -D_FORTIFY_SOURCE=2 -DCONFIG_ARM -D_FILE_OFFSET_BITS=64 -D_GNU_SOURCE -DKVMTOOLS_VERSION='""' -DBUILD_ARCH='"arm"' -Iinclude -Iarm/include -Iarm/aarch32/include -O2 -fno-strict-aliasing -g -Wall -Wformat=2 -Winit-self -Wmissing-declarations -Wmissing-prototypes -Wnested-externs -Wno-system-headers -Wold-style-definition -Wredundant-decls -Wsign-compare -Wstrict-prototypes -Wundef -Wvolatile-register-var -Wwrite-strings -Wno-format-nonliteral -Werror -DCONFIG_HAS_ZLIB -DCONFIG_HAS_AIO -DCONFIG_HAS_LIBFDT main.c -o main.o
gcc -c -Wp,-MD,./.mmio.o.d  -march=armv7-a -DCONFIG_GUEST_INIT -Wdate-time -D_FORTIFY_SOURCE=2 -DCONFIG_ARM -D_FILE_OFFSET_BITS=64 -D_GNU_SOURCE -DKVMTOOLS_VERSION='""' -DBUILD_ARCH='"arm"' -Iinclude -Iarm/include -Iarm/aarch32/include -O2 -fno-strict-aliasing -g -Wall -Wformat=2 -Winit-self -Wmissing-declarations -Wmissing-prototypes -Wnested-externs -Wno-system-headers -Wold-style-definition -Wredundant-decls -Wsign-compare -Wstrict-prototypes -Wundef -Wvolatile-register-var -Wwrite-strings -Wno-format-nonliteral -Werror -DCONFIG_HAS_ZLIB -DCONFIG_HAS_AIO -DCONFIG_HAS_LIBFDT mmio.c -o mmio.o
cc1: all warnings being treated as errors
make[1]: *** [Makefile:435: builtin-run.o] Error 1
make[1]: *** Waiting for unfinished jobs....
make[1]: Leaving directory '/<<PKGBUILDDIR>>'
dh_auto_build: make -j4 returned exit code 2
make: *** [debian/rules:3: build-arch] Error 2

Tail of log for mrs on armhf:

/usr/bin/ld: obj/M6Progress.o: in function `M6Progress::Progress(long long)':
/usr/include/c++/8/bits/atomic_base.h:374: undefined reference to `__atomic_store_8'
/usr/bin/ld: obj/M6Progress.o: in function `M6Progress::~M6Progress()':
/usr/include/c++/8/bits/atomic_base.h:374: undefined reference to `__atomic_store_8'
/usr/bin/ld: obj/M6Progress.o: in function `M6ProgressImpl::PrintProgress()':
/usr/include/c++/8/bits/atomic_base.h:396: undefined reference to `__atomic_load_8'
/usr/bin/ld: obj/M6Progress.o: in function `M6ProgressImpl::Run()':
/usr/include/c++/8/bits/atomic_base.h:396: undefined reference to `__atomic_load_8'
/usr/bin/ld: /usr/include/c++/8/bits/atomic_base.h:396: undefined reference to `__atomic_load_8'
/usr/bin/ld: /usr/include/c++/8/bits/atomic_base.h:396: undefined reference to `__atomic_load_8'
collect2: error: ld returned 1 exit status
make[1]: *** [GNUmakefile:101: mrs] Error 1
make[1]: Leaving directory '/<<BUILDDIR>>/mrs-6.0.5+dfsg'
dh_auto_build: make -j4 returned exit code 2
make: *** [debian/rules:12: build-arch] Error 2

Tail of log for haskell-protobuf on armhf:

    fixed32:                                     OK
      +++ OK, passed 100 tests (100% prop_wire :: Fixed Word32).
    fixed64:                                     OK
      +++ OK, passed 100 tests (100% prop_wire :: Fixed Word64).
    sfixed32:                                    OK
      +++ OK, passed 100 tests (100% prop_wire :: Fixed Int32).
    sfixed64:                                    OK
      +++ OK, passed 100 tests (100% prop_wire :: Fixed Int64).
    float:                                       OK (0.01s)
      +++ OK, passed 100 tests (100% prop_wire :: Float).
    double:                                      protobuf-test: SignalException 7
Test suite protobuf-test: FAIL
Test suite logged to: dist-ghc/test/protobuf-0.2.1.2-protobuf-test.log
0 of 1 test suites (0 of 1 test cases) passed.
make: *** [/usr/share/cdbs/1/class/hlibrary.mk:154: check-ghc-stamp] Error 1

Tail of log for reprozip on armhf:

running build_ext
building 'reprozip._pytracer' extension
creating build
creating build/temp.linux-armhf-3.7
creating build/temp.linux-armhf-3.7/native
arm-linux-gnueabihf-gcc -pthread -DNDEBUG -g -fwrapv -O2 -Wall -g -O2 -fdebug-prefix-map=/<<PKGBUILDDIR>>=. -fstack-protector-strong -Wformat -Werror=format-security -Wdate-time -D_FORTIFY_SOURCE=2 -fPIC -I/usr/include/python3.7m -c native/pytracer.c -o build/temp.linux-armhf-3.7/native/pytracer.o
In file included from native/tracer.h:4,
                 from native/pytracer.c:5:
native/config.h:12:9: error: #error Unrecognized architecture!
 #       error Unrecognized architecture!
         ^~~~~
error: command 'arm-linux-gnueabihf-gcc' failed with exit status 1
E: pybuild pybuild:341: build: plugin distutils failed with: exit code=1: /usr/bin/python3 setup.py build 
dh_auto_build: pybuild --build -i python{version} -p 3.7 returned exit code 13
make: *** [debian/rules:13: build-arch] Error 25

Tail of log for qca-cyrus-sasl on armhf:

dh_auto_test: Compatibility levels before 9 are deprecated (level 7 in use)
 fakeroot debian/rules binary-arch
dh binary-arch 
dh: Compatibility levels before 9 are deprecated (level 7 in use)
   dh_testroot -a
   dh_prep -a
   dh_auto_install -a
dh_auto_install: Compatibility levels before 9 are deprecated (level 7 in use)
	make -j1 install DESTDIR=/<<PKGBUILDDIR>>/debian/libqca2-plugin-cyrus-sasl AM_UPDATE_INFO_DIR=no
make[1]: Entering directory '/<<PKGBUILDDIR>>'
mkdir: cannot create directory '/usr/lib/arm-linux-gnueabihf/qt4/plugins/crypto/': Permission denied
make[1]: *** [Makefile:232: install_target] Error 1
make[1]: Leaving directory '/<<PKGBUILDDIR>>'
dh_auto_install: make -j1 install DESTDIR=/<<PKGBUILDDIR>>/debian/libqca2-plugin-cyrus-sasl AM_UPDATE_INFO_DIR=no returned exit code 2
make: *** [debian/rules:21: binary-arch] Error 2

Tail of log for qca2-plugin-ossl on armhf:

    return new opensslPbkdf2Context( this, type );
                                                ^
qca-ossl.cpp: At global scope:
qca-ossl.cpp:4521:16: warning: 'QString opensslQCAPlugin::cipherIDtoString(const QCA::TLS::Version&, const long unsigned int&)' defined but not used [-Wunused-function]
 static QString cipherIDtoString( const TLS::Version &version, const unsigned long &cipherID)
                ^~~~~~~~~~~~~~~~
qca-ossl.cpp:86:19: warning: 'QCA::BigInteger opensslQCAPlugin::bn2bi(BIGNUM*)' defined but not used [-Wunused-function]
 static BigInteger bn2bi(BIGNUM *n)
                   ^~~~~
make[2]: *** [Makefile:223: qca-ossl.o] Error 1
make[2]: Leaving directory '/<<PKGBUILDDIR>>'
dh_auto_build: make -j4 returned exit code 2
make[1]: *** [/usr/share/pkg-kde-tools/qt-kde-team/2/dhmk.mk:97: pre_build-arch_dh_auto_build] Error 2
make[1]: Leaving directory '/<<PKGBUILDDIR>>'
make: *** [/usr/share/pkg-kde-tools/qt-kde-team/2/dhmk.mk:110: debian/dhmk_build-arch] Error 2

Tail of log for gfccore on armhf:

set -e;    
make[1]: Leaving directory '/<<PKGBUILDDIR>>'
if [ "reverse-patches" = "reverse-patches" ]; then rm -f debian/stamp-patched; fi
patches: 
if [ "reverse-patches" != "reverse-patches" ]; then touch debian/stamp-patched; fi
if [ "reverse-patches" != "reverse-patches" ] ; then \
	/usr/bin/make -f debian/rules update-config ; \
fi
for dir in debian/patches ; do \
    rm -f $dir/*.log ; \
done
set -e;    
dh_clean 
dh_clean: Compatibility levels before 5 are no longer supported (level 4 requested)
make: *** [/usr/share/cdbs/1/rules/debhelper.mk:210: clean] Error 25

Tail of log for libsoundio on armhf:

                                                            ^
In file included from /<<PKGBUILDDIR>>/src/soundio.cpp:8:
/<<PKGBUILDDIR>>/src/soundio.hpp:36:7: note: 'union SoundIoBackendData' declared here
 union SoundIoBackendData {
       ^~~~~~~~~~~~~~~~~~
At global scope:
cc1plus: warning: unrecognized command line option '-Wno-c99-extensions'
make[3]: *** [CMakeFiles/libsoundio_shared.dir/build.make:66: CMakeFiles/libsoundio_shared.dir/src/soundio.cpp.o] Error 1
make[3]: Leaving directory '/<<PKGBUILDDIR>>/obj-arm-linux-gnueabihf'
make[2]: *** [CMakeFiles/Makefile2:113: CMakeFiles/libsoundio_shared.dir/all] Error 2
make[2]: Leaving directory '/<<PKGBUILDDIR>>/obj-arm-linux-gnueabihf'
make[1]: *** [Makefile:133: all] Error 2
make[1]: Leaving directory '/<<PKGBUILDDIR>>/obj-arm-linux-gnueabihf'
dh_auto_build: cd obj-arm-linux-gnueabihf && make -j1 returned exit code 2
make: *** [debian/rules:8: build-arch] Error 2

Tail of log for ngs-sdk on armhf:

   debian/rules override_dh_auto_build
make[1]: Entering directory '/<<PKGBUILDDIR>>'
#dh_auto_build --sourcedirectory=ngs-sdk
echo "DEBPKGNAME: EBPKGNAME"
DEBPKGNAME: EBPKGNAME
dh_auto_build --sourcedirectory=ngs-sdk
	cd ngs-sdk && make -j4
make[2]: Entering directory '/<<PKGBUILDDIR>>/ngs-sdk'
*** File 'Makefile.config.linux.armv7l' is missing. Please run ./configure
make[2]: *** [/<<PKGBUILDDIR>>/ngs-sdk/Makefile.rules:72: Makefile.config.linux.armv7l] Error 1
make[2]: Leaving directory '/<<PKGBUILDDIR>>/ngs-sdk'
dh_auto_build: cd ngs-sdk && make -j4 returned exit code 2
make[1]: *** [debian/rules:43: override_dh_auto_build] Error 2
make[1]: Leaving directory '/<<PKGBUILDDIR>>'
make: *** [debian/rules:19: build-arch] Error 2

Tail of log for libqglviewer on armhf:

/usr/lib/qt5/bin/qmake -install qinstall /<<BUILDDIR>>/libqglviewer-2.6.3+dfsg2/doc/refManual/tabs.css /<<BUILDDIR>>/libqglviewer-2.6.3+dfsg2/debian/tmp/usr/share/doc/QGLViewer/refManual/tabs.css
/usr/lib/qt5/bin/qmake -install qinstall /<<BUILDDIR>>/libqglviewer-2.6.3+dfsg2/doc/refManual/vec_8cpp.html /<<BUILDDIR>>/libqglviewer-2.6.3+dfsg2/debian/tmp/usr/share/doc/QGLViewer/refManual/vec_8cpp.html
/usr/lib/qt5/bin/qmake -install qinstall /<<BUILDDIR>>/libqglviewer-2.6.3+dfsg2/doc/refManual/vec_8h.html /<<BUILDDIR>>/libqglviewer-2.6.3+dfsg2/debian/tmp/usr/share/doc/QGLViewer/refManual/vec_8h.html
make[2]: Leaving directory '/<<BUILDDIR>>/libqglviewer-2.6.3+dfsg2/QGLViewer'
mv debian/qt4/* debian/tmp/usr/lib/arm-linux-gnueabihf/
make[1]: Leaving directory '/<<BUILDDIR>>/libqglviewer-2.6.3+dfsg2'
   dh_install -a -O--parallel -O--sourcedirectory=/<<BUILDDIR>>/libqglviewer-2.6.3\+dfsg2/QGLViewer
dh_install: Cannot find (any matches for) "usr/lib/*/libQGLViewer-qt4.so.*" (tried in ., debian/tmp)

dh_install: libqglviewer2-qt4 missing files: usr/lib/*/libQGLViewer-qt4.so.*
dh_install: Cannot find (any matches for) "usr/lib/*/libQGLViewer-qt4.so" (tried in ., debian/tmp)

dh_install: libqglviewer-dev-qt4 missing files: usr/lib/*/libQGLViewer-qt4.so
dh_install: missing files, aborting
make: *** [debian/rules:4: binary-arch] Error 25

Tail of log for acovea on armhf:

 fakeroot debian/rules clean
dh_testdir
dh_testroot
rm -f build-stamp 
# Add here commands to clean up after the build process.
/usr/bin/make distclean
make[1]: Entering directory '/<<PKGBUILDDIR>>'
make[1]: *** No rule to make target 'distclean'.  Stop.
make[1]: Leaving directory '/<<PKGBUILDDIR>>'
make: [debian/rules:49: clean] Error 2 (ignored)
cp -f /usr/share/misc/config.sub config.sub
cp -f /usr/share/misc/config.guess config.guess
dh_clean 
dh_clean: Compatibility levels before 5 are no longer supported (level 4 requested)
make: *** [debian/rules:52: clean] Error 25

Tail of log for apf on armhf:

checking for suffix of executables... 
checking for suffix of object files... o
checking whether we are using the GNU C compiler... yes
checking whether arm-linux-gnueabihf-gcc accepts -g... yes
checking for arm-linux-gnueabihf-gcc option to accept ISO C89... none needed
checking for style of include used by make... GNU
checking dependency style of arm-linux-gnueabihf-gcc... gcc3
checking how to run the C preprocessor... arm-linux-gnueabihf-gcc -E
checking for grep that handles long lines and -e... /bin/grep
checking for egrep... /bin/grep -E
checking whether arm-linux-gnueabihf-gcc needs -traditional... no
checking for openssl... no
checking for SSL_library_init in -lssl... no
configure: error: "lib ssl not found!"
make: *** [debian/rules:29: config.status] Error 1

Tail of log for ocamlgsl on armhf:

lib/mlgsl_blas.h:29:28: warning: type of 'v' defaults to 'int' [-Wimplicit-int]
 static inline CBLAS_SIDE_t CBLAS_SIDE_val(v)
                            ^~~~~~~~~~~~~~
Command exited with code 2.
+ /usr/bin/ocamlopt.opt unix.cmxa -I /usr/lib/ocaml/ocamlbuild /usr/lib/ocaml/ocamlbuild/ocamlbuildlib.cmxa myocamlbuild.ml /usr/lib/ocaml/ocamlbuild/ocamlbuild.cmx -o myocamlbuild
File "myocamlbuild.ml", line 518, characters 43-62:
Warning 3: deprecated: Ocamlbuild_plugin.String.uncapitalize
Use String.uncapitalize_ascii instead.
File "myocamlbuild.ml", line 531, characters 51-70:
Warning 3: deprecated: Ocamlbuild_plugin.String.uncapitalize
Use String.uncapitalize_ascii instead.
E: Failure("Command ''/usr/bin/ocamlbuild' lib/libgsl_stubs.a lib/dllgsl_stubs.so lib/gsl.cma lib/gsl.cmxa lib/gsl.a lib/gsl.cmxs examples/blas_ex.native examples/blas_speed_test.native examples/bspline_ex.native examples/cheb_ex.native examples/combi_ex.native examples/const_ex.native examples/deriv_ex.native examples/eigen_ex.native examples/fft_c.native examples/fft_c2.native examples/fft_hc.native examples/fit_ex.native examples/histo_ex.native examples/integration_ex.native examples/interp_ex.native examples/linalg_ex.native examples/min_ex.native examples/monte_ex.native examples/multifit_data_ex.native examples/multifit_nlin_ex.native examples/multimin_ex.native examples/multiroot_ex.native examples/odeiv_ex.native examples/permut_ex.native examples/qrng_ex.native examples/rng_ex.native examples/root_ex.native examples/siman_ex.native examples/siman_tsp_ex.native examples/stats_ex.native examples/sum_ex.native examples/wavelet_ex.native -tag debug -tag tests' terminated with error code 10")
make[1]: *** [debian/rules:22: override_dh_auto_build] Error 1
make[1]: Leaving directory '/<<PKGBUILDDIR>>'
make: *** [debian/rules:9: build-arch] Error 2

Tail of log for asterisk-chan-capi on armhf:

  ^~~~~~~~~~~~~~~~~~~~~~~~~~
chan_capi.c:8883:4: warning: implicit declaration of function 'ast_smoother_free'; did you mean 'ast_std_free'? [-Wimplicit-function-declaration]
    ast_smoother_free(i->smoother);
    ^~~~~~~~~~~~~~~~~
    ast_std_free
In file included from chan_capi.h:27,
                 from chan_capi.c:32:
chan_capi.c: In function 'load_module':
chan_capi.c:9009:2: error: 'AST_MODULE_SELF' undeclared (first use in this function); did you mean 'AST_MODULE_INFO'?
  ast_register_application(commandapp, pbx_capicommand_exec, commandsynopsis, commandtdesc);
  ^~~~~~~~~~~~~~~~~~~~~~~~
make[1]: *** [Makefile:198: chan_capi.o] Error 1
make[1]: Leaving directory '/<<PKGBUILDDIR>>'
dh_auto_build: make -j1 returned exit code 2
make: *** [debian/rules:3: build-arch] Error 2

Tail of log for libqt4pas on armhf:

+#MISSING: 2.5-15# (optional=templinst|arch=armel armhf i386 powerpc|subst)_ZN5QListI{qreal}E6appendERK{qreal}@Base 2.5
  (optional=templinst|arch=arm64 armel armhf powerpc ppc64|subst)_ZN5QListI{qreal}ED1Ev@Base 2.5
  (optional=templinst|arch=arm64 armel armhf powerpc ppc64|subst)_ZN5QListI{qreal}ED2Ev@Base 2.5
  (arch=arm64 armel armhf powerpc ppc64)_ZN7QStringD1Ev@Base 2.5
@@ -8570,7 +8570,7 @@
  _ZNK12QDialog_hook10metaObjectEv@Base 2.4
  _ZNK12QLayout_hook10metaObjectEv@Base 2.4
  _ZNK12QObject_hook10metaObjectEv@Base 2.4
- (arch=amd64 arm64 i386 powerpc ppc64 sparc)_ZNK12QPaintDevice7devTypeEv@Base 2.5
+ _ZNK12QPaintDevice7devTypeEv@Base 2.5
  _ZNK12QSlider_hook10metaObjectEv@Base 2.4
  _ZNK12QTabBar_hook10metaObjectEv@Base 2.4
  _ZNK12QThread_hook10metaObjectEv@Base 2.4
dh_makeshlibs: failing due to earlier errors
make: *** [debian/rules:13: binary-arch] Error 2

Tail of log for mingw32-binutils on armhf:

dpkg-buildpackage
-----------------

dpkg-buildpackage: info: source package mingw32-binutils
dpkg-buildpackage: info: source version 2.20-0.2
dpkg-buildpackage: info: source distribution unstable
 dpkg-source --before-build .
dpkg-buildpackage: info: host architecture armhf
 fakeroot debian/rules clean
dh_testdir
dh_testroot
rm -rf /<<PKGBUILDDIR>>/build_dir *-stamp
dh_clean
dh_clean: Compatibility levels before 5 are no longer supported (level 4 requested)
make: *** [debian/rules:123: clean] Error 25

Tail of log for criu on armhf:

arch/arm/include/asm/atomic.h: At top level:
arch/arm/include/asm/atomic.h:60:2: error: #error ARM architecture version (CONFIG_ARMV*) not set or unsupported.
 #error ARM architecture version (CONFIG_ARMV*) not set or unsupported.
  ^~~~~
arch/arm/include/asm/atomic.h: In function 'atomic_add_return':
arch/arm/include/asm/atomic.h:81:2: error: implicit declaration of function 'smp_mb' [-Werror=implicit-function-declaration]
  smp_mb();
  ^~~~~~
cc1: all warnings being treated as errors
make[2]: *** [scripts/Makefile.build:185: arch/arm/crtools.o] Error 1
make[2]: Leaving directory '/<<PKGBUILDDIR>>'
make[1]: *** [Makefile:208: arch/arm] Error 2
make[1]: Leaving directory '/<<PKGBUILDDIR>>'
dh_auto_build: make -j4 returned exit code 2
make: *** [debian/rules:6: build-arch] Error 2

Tail of log for debiman on armhf:

2019/06/30 15:59:09 path "/cron" -> suite = "", binarypkg = "", name = "cron", section = "", lang = ""
--- PASS: TestCronSection (0.00s)
    --- PASS: TestCronSection/cron (0.00s)
PASS
ok  	github.com/Debian/debiman/internal/redirect	0.018s
=== RUN   TestSitemap
--- PASS: TestSitemap (0.00s)
=== RUN   TestSitemapIndex
--- PASS: TestSitemapIndex (0.00s)
PASS
ok  	github.com/Debian/debiman/internal/sitemap	0.005s
?   	github.com/Debian/debiman/internal/tag	[no test files]
?   	github.com/Debian/debiman/internal/write	[no test files]
dh_auto_test: cd obj-arm-linux-gnueabihf && go test -vet=off -v -p 4 github.com/Debian/debiman github.com/Debian/debiman/cmd/debiman github.com/Debian/debiman/cmd/debiman-auxserver github.com/Debian/debiman/cmd/debiman-idx2rwmap github.com/Debian/debiman/cmd/debiman-minisrv github.com/Debian/debiman/internal/aux github.com/Debian/debiman/internal/bundled github.com/Debian/debiman/internal/commontmpl github.com/Debian/debiman/internal/convert github.com/Debian/debiman/internal/manpage github.com/Debian/debiman/internal/proto github.com/Debian/debiman/internal/recode github.com/Debian/debiman/internal/redirect github.com/Debian/debiman/internal/sitemap github.com/Debian/debiman/internal/tag github.com/Debian/debiman/internal/write returned exit code 1
make: *** [debian/rules:4: binary-arch] Error 1

Tail of log for djbdns on armhf:

 dpkg-source --before-build .
dpkg-buildpackage: info: host architecture armhf
 fakeroot debian/rules clean
rm -f `cat TARGETS`
for i in dbndns/*; do test -d $i || rm -f $i; done
test ! -e patch-stamp || \
  for i in `ls -1r debian/diff/*.diff || :`; do patch -p1 -R <$i; done
rm -f configure-stamp patch-stamp build-stamp \
  dbndns/patch-stamp dbndns/build-stamp
rm -rf '/<<PKGBUILDDIR>>/debian/djbdns' '/<<PKGBUILDDIR>>/debian/dbndns' '/<<PKGBUILDDIR>>/debian/dnscache-run'
rm -f debian/files debian/substvars changelog
test ! -r conf-home'{orig}' || mv -f conf-home'{orig}' conf-home
test ! -r conf-cc'{orig}' || mv conf-cc'{orig}' conf-cc
 debian/rules build-arch
make: *** No rule to make target 'build-arch'.  Stop.

Tail of log for pocl on armhf:

- (arch=armel)_ZTVSt23_Sp_counted_ptr_inplaceIN5clang22PCHContainerOperationsESaIS1_ELN9__gnu_cxx12_Lock_policyE1EE@Base 0.12-5~llvm3.7
- (arch=!armel)_ZTVSt23_Sp_counted_ptr_inplaceIN5clang22PCHContainerOperationsESaIS1_ELN9__gnu_cxx12_Lock_policyE2EE@Base 0.12-5~llvm3.7
+ _ZTVSt23_Sp_counted_ptr_inplaceIN4llvm3sys2fs6detail12DirIterStateESaIS4_ELN9__gnu_cxx12_Lock_policyE1EE@Base 0.14-7~llvm4.0
+#MISSING: 1.2-5# (arch=!armel)_ZTVSt23_Sp_counted_ptr_inplaceIN4llvm3sys2fs6detail12DirIterStateESaIS4_ELN9__gnu_cxx12_Lock_policyE2EE@Base 0.14-7~llvm4.0
+ _ZTVSt23_Sp_counted_ptr_inplaceIN4llvm3sys2fs6detail15RecDirIterStateESaIS4_ELN9__gnu_cxx12_Lock_policyE1EE@Base 0.14-7~llvm4.0
+#MISSING: 1.2-5# (arch=!armel)_ZTVSt23_Sp_counted_ptr_inplaceIN4llvm3sys2fs6detail15RecDirIterStateESaIS4_ELN9__gnu_cxx12_Lock_policyE2EE@Base 0.14-7~llvm4.0
+ _ZTVSt23_Sp_counted_ptr_inplaceIN5clang22PCHContainerOperationsESaIS1_ELN9__gnu_cxx12_Lock_policyE1EE@Base 0.12-5~llvm3.7
+#MISSING: 1.2-5# (arch=!armel)_ZTVSt23_Sp_counted_ptr_inplaceIN5clang22PCHContainerOperationsESaIS1_ELN9__gnu_cxx12_Lock_policyE2EE@Base 0.12-5~llvm3.7
  (arch=!powerpcspe)_ZZNSt19_Sp_make_shared_tag5_S_tiEvE5__tag@Base 1.1-8~llvm6.0+gcc8.2
 #MISSING: 0.14# check_compiler_cache@Base 0.10
  clGetExtensionFunctionAddress@Base 0.10
dh_makeshlibs: failing due to earlier errors
make[1]: *** [debian/rules:106: run_dh_makeshlibs] Error 2
make[1]: Leaving directory '/<<PKGBUILDDIR>>'
make: *** [debian/rules:57: binary-arch] Error 2

Tail of log for audacious-analog-vumeter-plugin on armhf:

make[3]: Entering directory '/<<PKGBUILDDIR>>/src'
/bin/bash ../libtool --tag=CC   --mode=compile gcc -DHAVE_CONFIG_H -I. -I..    -Wall -ggdb  -g -O2 -DSKINDIR=\"/usr/share/audacious\" -g -O2 -c -o plugin_main.lo plugin_main.c
libtool: compile:  gcc -DHAVE_CONFIG_H -I. -I.. -Wall -ggdb -g -O2 -DSKINDIR=\"/usr/share/audacious\" -g -O2 -c plugin_main.c  -fPIC -DPIC -o .libs/plugin_main.o
plugin_main.c:1:10: fatal error: gtk/gtk.h: No such file or directory
 #include <gtk/gtk.h>
          ^~~~~~~~~~~
compilation terminated.
make[3]: *** [Makefile:321: plugin_main.lo] Error 1
make[3]: Leaving directory '/<<PKGBUILDDIR>>/src'
make[2]: *** [Makefile:365: all-recursive] Error 1
make[2]: Leaving directory '/<<PKGBUILDDIR>>'
make[1]: *** [Makefile:254: all] Error 2
make[1]: Leaving directory '/<<PKGBUILDDIR>>'
dh_auto_build: make -j1 returned exit code 2
make: *** [debian/rules:8: build-arch] Error 2

Tail of log for blastem on armhf:

dpkg-buildpackage: info: source package blastem
dpkg-buildpackage: info: source version 0.6.2.1-1
dpkg-buildpackage: info: source distribution unstable
 dpkg-source --before-build .
dpkg-buildpackage: info: host architecture armhf
 fakeroot debian/rules clean
dh clean
   dh_auto_clean
	make -j4 distclean
make[1]: Entering directory '/<<PKGBUILDDIR>>'
Makefile:196: *** armv7l is not a supported architecture.  Stop.
make[1]: Leaving directory '/<<PKGBUILDDIR>>'
dh_auto_clean: make -j4 distclean returned exit code 2
make: *** [debian/rules:7: clean] Error 2

Tail of log for dustrac on armhf:

    Feature record: CXX_FEATURE:0cxx_strong_enums
    Feature record: CXX_FEATURE:1cxx_template_template_parameters
    Feature record: CXX_FEATURE:0cxx_thread_local
    Feature record: CXX_FEATURE:0cxx_trailing_return_types
    Feature record: CXX_FEATURE:0cxx_unicode_literals
    Feature record: CXX_FEATURE:0cxx_uniform_initialization
    Feature record: CXX_FEATURE:0cxx_unrestricted_unions
    Feature record: CXX_FEATURE:0cxx_user_literals
    Feature record: CXX_FEATURE:0cxx_variable_templates
    Feature record: CXX_FEATURE:0cxx_variadic_macros
    Feature record: CXX_FEATURE:0cxx_variadic_templates
dh_auto_configure: cd obj-arm-linux-gnueabihf && cmake -DCMAKE_INSTALL_PREFIX=/usr -DCMAKE_BUILD_TYPE=None -DCMAKE_INSTALL_SYSCONFDIR=/etc -DCMAKE_INSTALL_LOCALSTATEDIR=/var -DCMAKE_EXPORT_NO_PACKAGE_REGISTRY=ON -DCMAKE_FIND_PACKAGE_NO_PACKAGE_REGISTRY=ON "-GUnix Makefiles" -DCMAKE_VERBOSE_MAKEFILE=ON -DCMAKE_INSTALL_LIBDIR=lib/arm-linux-gnueabihf -DReleaseBuild=ON -DBIN_PATH=/usr/games/ -DDOC_PATH=/usr/share/doc/dustracing2d/ -DDATA_PATH=/usr/share/games/dustracing2d/ .. returned exit code 1
make[1]: *** [debian/rules:9: override_dh_auto_configure] Error 2
make[1]: Leaving directory '/<<PKGBUILDDIR>>'
make: *** [debian/rules:6: build-arch] Error 2

Tail of log for fuse-umfuse-iso9660 on armhf:

checking whether the gcc linker (/usr/bin/ld) supports shared libraries... yes
checking whether -lc should be explicitly linked in... no
checking dynamic linker characteristics... GNU/Linux ld.so
checking how to hardcode library paths into programs... immediate
checking whether stripping libraries is possible... yes
checking if libtool supports shared libraries... yes
checking whether to build shared libraries... yes
checking whether to build static libraries... yes
checking for fuse_main in -lfuse... yes
checking for iso9660_open_ext in -liso9660... yes
checking for _cdio_list_begin in -lcdio... yes
checking for uncompress in -lz... yes
checking for um_add_service in -lumlib... no
configure: error: Can't find libumlib, please install it
make: *** [/usr/share/cdbs/1/class/autotools.mk:46: debian/stamp-autotools] Error 1

Tail of log for cryptominisat on armhf:

- _ZSt22__final_insertion_sortIN9__gnu_cxx17__normal_iteratorIPN5CMSat3LitESt6vectorIS3_SaIS3_EEEENS0_5__ops15_Iter_comp_iterINS2_5Stamp14StampSorterInvEEEEvT_SE_T0_@Base 5.6.3
+#MISSING: 5.6.4+dfsg.1-1# _ZSt22__final_insertion_sortIN9__gnu_cxx17__normal_iteratorIPN5CMSat3LitESt6vectorIS3_SaIS3_EEEENS0_5__ops15_Iter_comp_iterINS2_5Stamp11StampSorterEEEEvT_SE_T0_@Base 5.6.3
+#MISSING: 5.6.4+dfsg.1-1# _ZSt22__final_insertion_sortIN9__gnu_cxx17__normal_iteratorIPN5CMSat3LitESt6vectorIS3_SaIS3_EEEENS0_5__ops15_Iter_comp_iterINS2_5Stamp14StampSorterInvEEEEvT_SE_T0_@Base 5.6.3
  _ZSt22__final_insertion_sortIN9__gnu_cxx17__normal_iteratorIPN5CMSat3LitESt6vectorIS3_SaIS3_EEEENS0_5__ops15_Iter_less_iterEEvT_SB_T0_@Base 5.6.3
  _ZSt22__final_insertion_sortIN9__gnu_cxx17__normal_iteratorIPjSt6vectorIjSaIjEEEENS0_5__ops15_Iter_less_iterEEvT_S9_T0_@Base 5.6.3
  _ZSt22__move_median_to_firstIN9__gnu_cxx17__normal_iteratorIPN5CMSat3BVA15PotentialClauseESt6vectorIS4_SaIS4_EEEENS0_5__ops15_Iter_less_iterEEvT_SC_SC_SC_T0_@Base 5.6.3
- _ZSt22__move_median_to_firstIPN5CMSat7WatchedEN9__gnu_cxx5__ops15_Iter_comp_iterINS0_13OccSimplifier25watch_sort_smallest_firstEEEEvT_S9_S9_S9_T0_@Base 5.6.3
+ _ZSt22__move_median_to_firstIPN5CMSat7WatchedEN9__gnu_cxx5__ops15_Iter_comp_iterI11MyOccSorterEEEvT_S8_S8_S8_T0_@Base 5.6.4+dfsg.1-1
+#MISSING: 5.6.4+dfsg.1-1# _ZSt22__move_median_to_firstIPN5CMSat7WatchedEN9__gnu_cxx5__ops15_Iter_comp_iterINS0_13OccSimplifier25watch_sort_smallest_firstEEEEvT_S9_S9_S9_T0_@Base 5.6.3
+ _ZSt22__move_median_to_firstIPN5CMSat7WatchedEN9__gnu_cxx5__ops15_Iter_comp_iterINS0_21WatchSorterBinTriLongEEEEvT_S8_S8_S8_T0_@Base 5.6.4+dfsg.1-1
  _ZSt25__unguarded_linear_insertIN9__gnu_cxx17__normal_iteratorIPN5CMSat11OccurClauseESt6vectorIS3_SaIS3_EEEENS0_5__ops14_Val_comp_iterISt8functionIFbRKS3_SD_EEEEEvT_T0_@Base 5.6.3
  _ZSt25__unguarded_linear_insertIN9__gnu_cxx17__normal_iteratorIPN5CMSat3BVA15PotentialClauseESt6vectorIS4_SaIS4_EEEENS0_5__ops14_Val_less_iterEEvT_T0_@Base 5.6.3
  _ZSt25__unguarded_linear_insertIN9__gnu_cxx17__normal_iteratorIPN5CMSat3LitESt6vectorIS3_SaIS3_EEEENS0_5__ops14_Val_comp_iterINS2_5Stamp11StampSorterEEEEvT_T0_@Base 5.6.3
dh_makeshlibs: failing due to earlier errors
make: *** [debian/rules:8: binary-arch] Error 2

Tail of log for consul-migrate on armhf:

--- FAIL: TestMigrator_data (0.01s)
    migrator_test.go:60: err: MDB_INVALID: File is not an LMDB file
=== RUN   TestMigrator_new
--- PASS: TestMigrator_new (0.00s)
=== RUN   TestMigrator_migrate
--- FAIL: TestMigrator_migrate (0.00s)
    migrator_test.go:130: err: Failed to connect MDB: MDB_INVALID: File is not an LMDB file %!s(MISSING)
=== RUN   TestMigrator_migrate_fails
--- PASS: TestMigrator_migrate_fails (0.63s)
=== RUN   TestMigrator_migrate_noop
--- PASS: TestMigrator_migrate_noop (0.00s)
FAIL
FAIL	github.com/hashicorp/consul-migrate/migrator	0.690s
dh_auto_test: cd obj-arm-linux-gnueabihf && go test -vet=off -v -p 1 github.com/hashicorp/consul-migrate github.com/hashicorp/consul-migrate/migrator returned exit code 1
make: *** [debian/rules:7: build-arch] Error 1

Tail of log for dxvk on armhf:

Source dir: /<<BUILDDIR>>/dxvk-0.96+ds1
Build dir: /<<BUILDDIR>>/dxvk-0.96+ds1/build-wine32
Build type: cross build
Project name: dxvk
Project version: v0.96
Appending CFLAGS from environment: '-g -O2 -fdebug-prefix-map=/<<BUILDDIR>>/dxvk-0.96+ds1=. -fstack-protector-strong -Wformat -Werror=format-security'
Appending LDFLAGS from environment: '-Wl,-z,relro'
Appending CPPFLAGS from environment: '-Wdate-time -D_FORTIFY_SOURCE=2'

meson.build:1:0: ERROR:  Compiler /usr/lib/wine-development/winegcc can not compile programs.

A full log can be found at /<<BUILDDIR>>/dxvk-0.96+ds1/build-wine32/meson-logs/meson-log.txt
make[1]: *** [debian/rules:32: override_dh_auto_configure] Error 1
make[1]: Leaving directory '/<<BUILDDIR>>/dxvk-0.96+ds1'
make: *** [debian/rules:4: build-arch] Error 2

Tail of log for ezquake on armhf:

  snprintf(name, MAX_OSPATH, "%s/%s.log", fs_gamedir, G_STRING(OFS_PARM0));
                                   ^~~~
In file included from /usr/include/stdio.h:873,
                 from q_shared.h:30,
                 from common.h:35,
                 from qwsvdef.h:26,
                 from pr_cmds.c:22:
/usr/include/arm-linux-gnueabihf/bits/stdio2.h:67:10: note: '__builtin___snprintf_chk' output 6 or more bytes (assuming 133) into a destination of size 128
   return __builtin___snprintf_chk (__s, __n, __USE_FORTIFY_LEVEL - 1,
          ^~~~~~~~~~~~~~~~~~~~~~~~~~~~~~~~~~~~~~~~~~~~~~~~~~~~~~~~~~~~
        __bos (__s), __fmt, __va_arg_pack ());
        ~~~~~~~~~~~~~~~~~~~~~~~~~~~~~~~~~~~~~
make[1]: Leaving directory '/<<BUILDDIR>>/ezquake-2.2+git20150324'
dh_auto_build: make -j4 returned exit code 2
make: *** [debian/rules:14: build-arch] Error 2

Tail of log for gammapy on armhf:

mode = 'interp', order = 1

    def _reproject_to_hpx(self, geom, mode="interp", order=1):
        from reproject import reproject_to_healpix
    
>       data = np.empty(geom.data_shape)
E       ValueError: negative dimensions are not allowed

gammapy/maps/wcsnd.py:289: ValueError
======= 45 failed, 896 passed, 447 skipped, 8 xfailed in 269.34 seconds ========
/usr/lib/python3/dist-packages/astropy/config/configuration.py:536: ConfigurationMissingWarning: Configuration defaults will be used due to FileNotFoundError:2 on None
  warn(ConfigurationMissingWarning(msg))
make[1]: *** [debian/rules:21: test-python3.7] Error 1
make[1]: Leaving directory '/<<PKGBUILDDIR>>'
make: *** [debian/rules:9: build-arch] Error 2

Tail of log for ioapps on armhf:

                                    ^
replicate.c:1397:11: note: 'first_call_orig' was declared here
  uint64_t first_call_orig; ///< when was the first original call made
           ^~~~~~~~~~~~~~~
replicate.c:104:36: warning: 'last_call_orig' may be used uninitialized in this function [-Wmaybe-uninitialized]
      diff_orig = CALL_TIME(x##_it) - last_call_orig; \
                                    ^
replicate.c:1396:11: note: 'last_call_orig' was declared here
  uint64_t last_call_orig; ///< when was the last original call made
           ^~~~~~~~~~~~~~
make[2]: *** [Makefile:46: replicate.o] Error 1
make[2]: Leaving directory '/<<PKGBUILDDIR>>'
make[1]: *** [debian/rules:18: override_dh_auto_build] Error 2
make[1]: Leaving directory '/<<PKGBUILDDIR>>'
make: *** [debian/rules:14: build-arch] Error 2

Tail of log for jellyfish on armhf:

                 from ./include/jellyfish/hash_counter.hpp:22,
                 from sub_commands/count_main.cc:38:
./include/jellyfish/rectangular_binary_matrix.hpp: In member function 'bool jellyfish::RectangularBinaryMatrix::is_zero() const':
./include/jellyfish/rectangular_binary_matrix.hpp:127:29: error: comparison of integer expressions of different signedness: 'int' and 'const unsigned int' [-Werror=sign-compare]
       return (p - _columns) == _c;
              ~~~~~~~~~~~~~~~^~~~~
cc1plus: all warnings being treated as errors
make[3]: *** [Makefile:1749: sub_commands/count_main.o] Error 1
make[3]: Leaving directory '/<<PKGBUILDDIR>>'
make[2]: *** [Makefile:1029: all] Error 2
make[2]: Leaving directory '/<<PKGBUILDDIR>>'
dh_auto_build: make -j1 all bin/generate_sequence bin/test_all bin/fastq2sam returned exit code 2
make[1]: *** [debian/rules:68: override_dh_auto_build] Error 2
make[1]: Leaving directory '/<<PKGBUILDDIR>>'
make: *** [debian/rules:19: build-arch] Error 2

Tail of log for jocaml on armhf:

Importing patch ocaml-4.05.0/debian-patches/0005-Avoid-multiple-declarations-in-generated-.c-files-in.patch (stored as debian/patches/0005-Avoid-multiple-declarations-in-generated-.c-files-in.patch)
Skipping ocaml-4.05.0/debian-patches/0004-Put-manpages-in-section-3o-instead-of-3.patch
Importing patch ocaml-4.05.0/debian-patches/0003-Don-t-use-rpath.patch (stored as debian/patches/0003-Don-t-use-rpath.patch)
Importing patch ocaml-4.05.0/debian-patches/0002-Call-ld-with-proper-flags.patch (stored as debian/patches/0002-Call-ld-with-proper-flags.patch)
Importing patch ocaml-4.05.0/debian-patches/0001-Pass-no-relax-to-ld-on-alpha.patch (stored as debian/patches/0001-Pass-no-relax-to-ld-on-alpha.patch)
quilt push -a
Applying patch debian/patches/0001-Pass-no-relax-to-ld-on-alpha.patch
patching file configure
Hunk #1 FAILED at 448.
Hunk #2 FAILED at 982.
2 out of 2 hunks FAILED -- rejects in file configure
Patch debian/patches/0001-Pass-no-relax-to-ld-on-alpha.patch does not apply (enforce with -f)
make[1]: *** [debian/rules:22: override_dh_auto_configure] Error 1
make[1]: Leaving directory '/<<PKGBUILDDIR>>'
make: *** [debian/rules:85: build-arch] Error 2

Tail of log for ibam on armhf:

make[1]: Entering directory '/<<PKGBUILDDIR>>'
make[1]: 'ibam-krell.so' is up to date.
make[1]: Leaving directory '/<<PKGBUILDDIR>>'
touch build-stamp
dh_testdir
dh_testroot
dh_clean
dh_clean: Compatibility levels before 9 are deprecated (level 7 in use)
dh_installdirs
dh_installdirs: Compatibility levels before 9 are deprecated (level 7 in use)
# Add here commands to install the package into debian/tmp.
install -m0755 ibam `pwd`/debian/ibam/usr/bin
install -m0644 ibam-krell.so `pwd`/debian/gkrellm-ibam/usr/lib/gkrellm2/plugins
install: cannot create regular file '/<<PKGBUILDDIR>>/debian/gkrellm-ibam/usr/lib/gkrellm2/plugins': No such file or directory
make: *** [debian/rules:58: install] Error 1

Tail of log for haskell-type-level on armhf:

    |
266 | instance (DivMod x y q r) => Div x y q
    |          ^^^^^^^^^^^^^^^^^^^^^^^^^^^^^

src/Data/TypeLevel/Num/Ops.hs:336:10: error:
    * Illegal instance declaration for `Div10 x q'
        The liberal coverage condition fails in class `Div10'
          for functional dependency: `q -> x'
        Reason: lhs type `q' does not determine rhs type `x'
        Un-determined variable: x
    * In the instance declaration for `Div10 x q'
    |
336 | instance DivMod10 x q r => Div10 x q
    |          ^^^^^^^^^^^^^^^^^^^^^^^^^^^
make: *** [/usr/share/cdbs/1/class/hlibrary.mk:147: build-ghc-stamp] Error 1

Tail of log for freefoam on armhf:

/usr/bin/cmake -E cmake_link_script CMakeFiles/cmTC_b1d57.dir/link.txt --verbose=1
/usr/bin/cc -g -O2 -fdebug-prefix-map=/<<BUILDDIR>>/freefoam-0.1.0+dfsg+1=. -fstack-protector-strong -Wformat -Werror=format-security -Wdate-time -D_FORTIFY_SOURCE=2 -DCHECK_FUNCTION_EXISTS=handle_sigfpes  -Wl,-z,relro  -rdynamic CMakeFiles/cmTC_b1d57.dir/CheckFunctionExists.c.o  -o cmTC_b1d57 
/usr/bin/ld: CMakeFiles/cmTC_b1d57.dir/CheckFunctionExists.c.o: in function `main':
/usr/share/cmake-3.13/Modules/CheckFunctionExists.c:17: undefined reference to `handle_sigfpes'
collect2: error: ld returned 1 exit status
make[3]: *** [CMakeFiles/cmTC_b1d57.dir/build.make:87: cmTC_b1d57] Error 1
make[3]: Leaving directory '/<<BUILDDIR>>/freefoam-0.1.0+dfsg+1/obj-arm-linux-gnueabihf/CMakeFiles/CMakeTmp'
make[2]: *** [Makefile:121: cmTC_b1d57/fast] Error 2
make[2]: Leaving directory '/<<BUILDDIR>>/freefoam-0.1.0+dfsg+1/obj-arm-linux-gnueabihf/CMakeFiles/CMakeTmp'


dh_auto_configure: cd obj-arm-linux-gnueabihf && cmake -DCMAKE_INSTALL_PREFIX=/usr -DCMAKE_BUILD_TYPE=None -DCMAKE_INSTALL_SYSCONFDIR=/etc -DCMAKE_INSTALL_LOCALSTATEDIR=/var -DCMAKE_EXPORT_NO_PACKAGE_REGISTRY=ON -DCMAKE_FIND_PACKAGE_NO_PACKAGE_REGISTRY=ON "-GUnix Makefiles" -DCMAKE_VERBOSE_MAKEFILE=ON -DCMAKE_INSTALL_LIBDIR=lib/arm-linux-gnueabihf -DFOAM_EXE_PREFIX=freefoam- -DFOAM_ENABLE_METIS=OFF -DFOAM_ENABLE_MGRIDGEN=OFF -DFOAM_USE_MPI=ON -DFOAM_DEFAULT_PSTREAM=mpi -DFOAM_DOUBLE_PRECISION=ON -DFOAM_ENABLE_PARMETIS=OFF -DCMAKE_SKIP_RPATH=OFF -DFOAM_ENABLE_CCMIO=OFF -DBUILD_TESTING=OFF -DFOAM_ENABLE_FULL_TUTORIAL_TEST=OFF -DFOAM_BUILD_PRIVATE_METIS=OFF -DFOAM_BUILD_PRIVATE_PARMETIS=OFF -DFOAM_BUILD_PRIVATE_SCOTCH=OFF -DFOAM_BUILD_PRIVATE_ZLIB=OFF -DFOAM_ENABLE_PDF_GUIDES=OFF -DFOAM_ENABLE_XHTML_GUIDES=OFF -DFOAM_ENABLE_XHTML_HELP=OFF -DFOAM_ENABLE_MATHJAX=OFF -DFOAM_ENABLE_MANPAGE_HELP=OFF -DFOAM_DOCS_FOR_SF=OFF -DFOAM_INSTALL_BIN_PATH=/usr/bin -DFOAM_INSTALL_CMAKE_PATH=/usr/share/freefoam/CMake -DFOAM_INSTALL_CONFIG_PATH=/etc/freefoam -DFOAM_INSTALL_DATA_PATH=/usr/share/freefoam -DFOAM_INSTALL_DOC_PATH=/usr/share/doc/freefoam -DFOAM_INSTALL_HEADER_PATH=/usr/include/freefoam -DFOAM_INSTALL_LIBEXEC_PATH=/usr/bin -DFOAM_INSTALL_LIBRARY_PATH=/usr/lib/freefoam -DFOAM_INSTALL_MAN_PATH=/usr/share/man -DFOAM_INSTALL_PLUGIN_PATH=/usr/lib/freefoam/plugins1 -DFOAM_INSTALL_TUTORIALS_PATH=/usr/share/doc/freefoam -DFOAM_INSTALL_USERDFOAM_PATH=/usr/lib/freefoam/plugins1/ensightReader -DFOAM_ENABLE_DOXYGEN_DOCS=OFF .. returned exit code 1
make[1]: *** [debian/rules:68: override_dh_auto_configure] Error 2
make[1]: Leaving directory '/<<BUILDDIR>>/freefoam-0.1.0+dfsg+1'
make: *** [debian/rules:3: build-arch] Error 2

Tail of log for haskell-pretty-simple on armhf:

pretty-simple-doctest:   -Mgrace=<n>
pretty-simple-doctest:             The amount of allocation after the program receives a
pretty-simple-doctest:             HeapOverflow exception before the exception is thrown again, if
pretty-simple-doctest:             the program is still exceeding the heap limit.
pretty-simple-doctest: 
pretty-simple-doctest: RTS options may also be specified using the GHCRTS environment variable.
pretty-simple-doctest: 
pretty-simple-doctest: Other RTS options may be available for programs compiled a different way.
pretty-simple-doctest: The GHC User's Guide has full details.
pretty-simple-doctest: 
Test suite pretty-simple-doctest: FAIL
Test suite logged to:
dist-ghc/test/pretty-simple-2.1.0.1-pretty-simple-doctest.log
0 of 1 test suites (0 of 1 test cases) passed.
make: *** [/usr/share/cdbs/1/class/hlibrary.mk:154: check-ghc-stamp] Error 1

Tail of log for haskell-heterocephalus on armhf:

doctest: 
doctest:   -Mgrace=<n>
doctest:             The amount of allocation after the program receives a
doctest:             HeapOverflow exception before the exception is thrown again, if
doctest:             the program is still exceeding the heap limit.
doctest: 
doctest: RTS options may also be specified using the GHCRTS environment variable.
doctest: 
doctest: Other RTS options may be available for programs compiled a different way.
doctest: The GHC User's Guide has full details.
doctest: 
Test suite doctest: FAIL
Test suite logged to: dist-ghc/test/heterocephalus-1.0.5.2-doctest.log
0 of 2 test suites (0 of 2 test cases) passed.
make: *** [/usr/share/cdbs/1/class/hlibrary.mk:154: check-ghc-stamp] Error 1

Tail of log for kpkpass on armhf:

  _ZTSN7KPkPass12BoardingPassE@Base 18.07.90
  _ZTSN7KPkPass4PassE@Base 18.07.90
- (arch=alpha amd64 arm64 armhf hppa hurd-i386 i386 ia64 m68k mips mips64el mipsel powerpc powerpcspe ppc64 ppc64el s390x sh4 sparc64 x32)_ZTSSt11_Mutex_baseILN9__gnu_cxx12_Lock_policyE2EE@Base 18.08.3
- (arch=alpha amd64 arm64 armhf hppa hurd-i386 i386 ia64 m68k mips mips64el mipsel powerpc powerpcspe ppc64 ppc64el s390x sh4 sparc64 x32)_ZTSSt16_Sp_counted_baseILN9__gnu_cxx12_Lock_policyE2EE@Base 18.08.3
+ _ZTSN9__gnu_cxx7__mutexE@Base 18.08.3-2
+ _ZTSSt11_Mutex_baseILN9__gnu_cxx12_Lock_policyE1EE@Base 18.08.3-2
+#MISSING: 18.08.3-2# (arch=alpha amd64 arm64 armhf hppa hurd-i386 i386 ia64 m68k mips mips64el mipsel powerpc powerpcspe ppc64 ppc64el s390x sh4 sparc64 x32)_ZTSSt11_Mutex_baseILN9__gnu_cxx12_Lock_policyE2EE@Base 18.08.3
+ _ZTSSt16_Sp_counted_baseILN9__gnu_cxx12_Lock_policyE1EE@Base 18.08.3-2
+#MISSING: 18.08.3-2# (arch=alpha amd64 arm64 armhf hppa hurd-i386 i386 ia64 m68k mips mips64el mipsel powerpc powerpcspe ppc64 ppc64el s390x sh4 sparc64 x32)_ZTSSt16_Sp_counted_baseILN9__gnu_cxx12_Lock_policyE2EE@Base 18.08.3
  _ZTVN7KPkPass12BoardingPassE@Base 18.07.90
  _ZTVN7KPkPass4PassE@Base 18.07.90
dh_makeshlibs: failing due to earlier errors
make[1]: *** [/usr/share/pkg-kde-tools/qt-kde-team/3/dhmk.mk:97: pre_binary-arch_dh_makeshlibs] Error 2
make[1]: Leaving directory '/<<PKGBUILDDIR>>'
make: *** [/usr/share/pkg-kde-tools/qt-kde-team/3/dhmk.mk:112: debian/dhmk_binary-arch] Error 2

Tail of log for libmath-int128-perl on armhf:

Checking for strings.h... yes
Checking for inttypes.h... yes
Checking for stdint.h... yes
Checking for unistd.h... yes
Checking for uint64_t... yes
Checking for __int128... no
Checking for uint64_t... (cached) yes
Checking for int __attribute__ ((__mode__ (TI)))... 
  It looks like your compiler doesn't support a 128-bit integer type (one of
  "int __attribute__ ((__mode__ (TI)))" or "__int128"). One of these types is
  necessary to compile the Math::Int128 module.

no
dh_auto_configure: perl Makefile.PL INSTALLDIRS=vendor "OPTIMIZE=-g -O2 -fdebug-prefix-map=/<<PKGBUILDDIR>>=. -fstack-protector-strong -Wformat -Werror=format-security -Wdate-time -D_FORTIFY_SOURCE=2" "LD=arm-linux-gnueabihf-gcc -g -O2 -fdebug-prefix-map=/<<PKGBUILDDIR>>=. -fstack-protector-strong -Wformat -Werror=format-security -Wl,-z,relro -Wl,-z,now" returned exit code 1
make: *** [debian/rules:6: build-arch] Error 1

Tail of log for libnunc-stans on armhf:

mkdir -p bin
mkdir -p obj
gcc -MM -std=c99 -I"src" -I"inc" src/abstraction/abstraction_dcas.c >obj/abstraction_dcas.d
gcc -g -O2 -fdebug-prefix-map=/<<PKGBUILDDIR>>=. -fstack-protector-strong -Wformat -Werror=format-security  -c -fpic -Wno-unknown-pragmas -std=c99 -I"src" -I"inc"  -o obj/abstraction_dcas.o src/abstraction/abstraction_dcas.c
/tmp/ccGpCjrq.s: Assembler messages:
/tmp/ccGpCjrq.s:61: Error: selected processor does not support `ldrexd r6,r7,[lr]' in ARM mode
/tmp/ccGpCjrq.s:61: Error: selected processor does not support `strexd r0,r2,r3,[lr]' in ARM mode
make[3]: *** [makefile.linux:79: obj/abstraction_dcas.o] Error 1
make[3]: Leaving directory '/<<PKGBUILDDIR>>/liblfds'
make[2]: *** [Makefile:921: all-recursive] Error 1
make[2]: Leaving directory '/<<PKGBUILDDIR>>'
make[1]: *** [Makefile:646: all] Error 2
make[1]: Leaving directory '/<<PKGBUILDDIR>>'
dh_auto_build: make -j1 returned exit code 2
make: *** [debian/rules:21: build-arch] Error 2

Tail of log for libmlx5 on armhf:

#define HAVE_STDLIB_H 1
#define HAVE_STRING_H 1
#define HAVE_MEMORY_H 1
#define HAVE_STRINGS_H 1
#define HAVE_INTTYPES_H 1
#define HAVE_STDINT_H 1
#define HAVE_UNISTD_H 1
#define HAVE_DLFCN_H 1
#define LT_OBJDIR ".libs/"
#define NVALGRIND 1
#define HAVE_LIBIBVERBS 1

configure: exit 1
dh_auto_configure: ./configure --build=arm-linux-gnueabihf --prefix=/usr --includedir=\${prefix}/include --mandir=\${prefix}/share/man --infodir=\${prefix}/share/info --sysconfdir=/etc --localstatedir=/var --disable-silent-rules --libdir=\${prefix}/lib/arm-linux-gnueabihf --libexecdir=\${prefix}/lib/arm-linux-gnueabihf --disable-maintainer-mode --disable-dependency-tracking returned exit code 1
make: *** [debian/rules:6: build-arch] Error 2

Tail of log for lib3mf on armhf:

+ _ZTVSt23_Sp_counted_ptr_inplaceIN3NMR5CUUIDESaIS1_ELN9__gnu_cxx12_Lock_policyE1EE@Base 1.8.0
+#MISSING: 1.8.1+ds-3# (arch=!armel !riscv64)_ZTVSt23_Sp_counted_ptr_inplaceIN3NMR5CUUIDESaIS1_ELN9__gnu_cxx12_Lock_policyE2EE@Base 1.8.0
+ _ZTVSt23_Sp_counted_ptr_inplaceIN3NMR6CModelESaIS1_ELN9__gnu_cxx12_Lock_policyE1EE@Base 1.8.0
+#MISSING: 1.8.1+ds-3# (arch=!armel !riscv64)_ZTVSt23_Sp_counted_ptr_inplaceIN3NMR6CModelESaIS1_ELN9__gnu_cxx12_Lock_policyE2EE@Base 1.8.0
+ _ZTVSt23_Sp_counted_ptr_inplaceIN3NMR6CSliceESaIS1_ELN9__gnu_cxx12_Lock_policyE1EE@Base 1.8.0
+#MISSING: 1.8.1+ds-3# (arch=!armel !riscv64)_ZTVSt23_Sp_counted_ptr_inplaceIN3NMR6CSliceESaIS1_ELN9__gnu_cxx12_Lock_policyE2EE@Base 1.8.0
+ _ZTVSt23_Sp_counted_ptr_inplaceIN3NMR7BEAMSETESaIS1_ELN9__gnu_cxx12_Lock_policyE1EE@Base 1.8.0
+#MISSING: 1.8.1+ds-3# (arch=!armel !riscv64)_ZTVSt23_Sp_counted_ptr_inplaceIN3NMR7BEAMSETESaIS1_ELN9__gnu_cxx12_Lock_policyE2EE@Base 1.8.0
  (arch=!ia64 !powerpcspe)_ZZNSt19_Sp_make_shared_tag5_S_tiEvE5__tag@Base 1.8.0
  lib3mf_attachment_getpath@Base 1.8.0+ds
  lib3mf_attachment_getpathutf8@Base 1.8.0+ds
	mv debian/.debhelper/generated/lib3mf1/triggers.new debian/.debhelper/generated/lib3mf1/triggers
	rm -f debian/lib3mf-dev/DEBIAN/shlibs
dh_makeshlibs: failing due to earlier errors
make: *** [debian/rules:9: binary-arch] Error 2

Tail of log for libsis-jhdf5-java on armhf:

[Utils] Attempting to create /<<PKGBUILDDIR>>/test-output/old/All/classes.html
[Utils]   Directory /<<PKGBUILDDIR>>/test-output/old/All exists: true
[Utils] Attempting to create /<<PKGBUILDDIR>>/test-output/old/All/reporter-output.html
[Utils]   Directory /<<PKGBUILDDIR>>/test-output/old/All exists: true
[Utils] Attempting to create /<<PKGBUILDDIR>>/test-output/old/All/methods-not-run.html
[Utils]   Directory /<<PKGBUILDDIR>>/test-output/old/All exists: true
[Utils] Attempting to create /<<PKGBUILDDIR>>/test-output/old/All/testng.xml.html
[Utils]   Directory /<<PKGBUILDDIR>>/test-output/old/All exists: true
[Utils] Attempting to create test-output/old/index.html
[Utils]   Directory test-output/old exists: true
[TestNG] Time taken by org.testng.reporters.SuiteHTMLReporter@79c292: 252 ms
[TestNG] Time taken by org.testng.reporters.jq.Main@1606c0b: 483 ms
make[1]: *** [debian/rules:53: override_dh_auto_test] Error 1
make[1]: Leaving directory '/<<PKGBUILDDIR>>'
make: *** [debian/rules:16: build-arch] Error 2

Tail of log for libretro-mupen64plus on armhf:

                 from ./libretro/opengl_state_machine.h:4,
                 from ./libretro/SDL_opengles2.h:29,
                 from gles2rice/src/osal_opengl.h:33,
                 from gles2rice/src/DeviceBuilder.cpp:21:
/usr/include/GLES2/gl2ext.h:2947:16: note: previous declaration as 'typedef double GLdouble'
 typedef double GLdouble;
                ^~~~~~~~
g++ -Wdate-time -D_FORTIFY_SOURCE=2 -g -fdebug-prefix-map=/<<BUILDDIR>>/libretro-mupen64plus-2.0+git20160207+dfsg2=. -fstack-protector-strong -Wformat -Werror=format-security -std=gnu++98 -MMD -O2 -DNDEBUG  -DHAVE_NEON -D__LIBRETRO__ -DINLINE="inline" -DM64P_PLUGIN_API -DM64P_CORE_PROTOTYPES -D_ENDUSER_RELEASE -DSDL_VIDEO_OPENGL_ES2=1 -DSINC_LOWER_QUALITY -DHAVE_COMBINE_EXT  -I./mupen64plus-core/src -I./mupen64plus-core/src/api -I./mupen64plus-core/src/plugin/audio_libretro -I./glide2gl/src/Glitch64/inc -I./libretro-common/include -I./libretro -DARM -fPIC -DARM  -DNO_ASM -DARM -D__arm__ -DARM_ASM -DNOSSE -marm -D__NEON_OPT -mfpu=neon -mfloat-abi=hard -DGLES -DHAVE_OPENGLES2 -DDISABLE_3POINT -DUSE_GLES  -DNEW_DYNAREC=3 -DDYNAREC -c gles2rice/src/FrameBuffer.cpp -o gles2rice/src/FrameBuffer.o
make[2]: *** [Makefile:408: gles2rice/src/DeviceBuilder.o] Error 1
make[2]: *** Waiting for unfinished jobs....
make[2]: Leaving directory '/<<BUILDDIR>>/libretro-mupen64plus-2.0+git20160207+dfsg2'
dh_auto_build: make -j4 "platform=armv gles neon hardfloat" returned exit code 2
make[1]: *** [debian/rules:19: override_dh_auto_build] Error 2
make[1]: Leaving directory '/<<BUILDDIR>>/libretro-mupen64plus-2.0+git20160207+dfsg2'
make: *** [debian/rules:16: build-arch] Error 2

Tail of log for libtango on armhf:

dpkg-buildpackage: info: host architecture armhf
 fakeroot debian/rules clean
QUILT_PATCHES=debian/patches \
	quilt --quiltrc /dev/null pop -a -R || test $? = 2
No patch removed
rm -rf .pc debian/stamp-patched
dh_testdir
dh_testroot
rm -rf stamps objs
find build -type d -name "objs-*" | xargs rm -rf
rm -f build-stamp-*
dh_clean
dh_clean: Compatibility levels before 9 are deprecated (level 7 in use)
 debian/rules build-arch
make: *** No rule to make target 'build-arch'.  Stop.

Tail of log for libxsmm on armhf:

   ^~~~~
In file included from include/libxsmm.h:65,
                 from ./src/libxsmm_gemm_diff.h:34,
                 from ./src/libxsmm_main.c:31:
./src/libxsmm_main.c: In function 'libxsmm_init':
include/libxsmm_sync.h:70:29: warning: implicit declaration of function '__builtin_ia32_pause'; did you mean '__builtin_isspace'? [-Wimplicit-function-declaration]
 # define LIBXSMM_SYNC_PAUSE __builtin_ia32_pause()
                             ^~~~~~~~~~~~~~~~~~~~
./src/libxsmm_main.c:719:36: note: in expansion of macro 'LIBXSMM_SYNC_PAUSE'
       if (0 != once) break; else { LIBXSMM_SYNC_PAUSE; }
                                    ^~~~~~~~~~~~~~~~~~
make[1]: *** [Makefile:721: build/intel64/libxsmm_main.o] Error 1
make[1]: Leaving directory '/<<PKGBUILDDIR>>'
dh_auto_build: make -j1 returned exit code 2
make: *** [debian/rules:7: build-arch] Error 2

Tail of log for listaller on armhf:

  Command-line option `--thread` is deprecated and will be ignored

  Compilation failed: 1 error(s), 12 warning(s)



make[3]: *** [src/CMakeFiles/listaller-glib_precompile.dir/build.make:107: src/CMakeFiles/listaller-glib_precompile.dir/precompile.stamp] Error 1
make[3]: Leaving directory '/<<PKGBUILDDIR>>/obj-arm-linux-gnueabihf'
make[2]: *** [CMakeFiles/Makefile2:161: src/CMakeFiles/listaller-glib_precompile.dir/all] Error 2
make[2]: Leaving directory '/<<PKGBUILDDIR>>/obj-arm-linux-gnueabihf'
make[1]: *** [Makefile:144: all] Error 2
make[1]: Leaving directory '/<<PKGBUILDDIR>>/obj-arm-linux-gnueabihf'
dh_auto_build: cd obj-arm-linux-gnueabihf && make -j1 returned exit code 2
make: *** [debian/rules:15: build-arch] Error 2

Tail of log for kubernetes-addon-heapster on armhf:

rm -f -rv `perl -0nE 'say $1 if m{^Files\-Excluded\:\s*(.*?)(?:\n\n|Files:|Comment:)}sm;' debian/copyright`
make[1]: Leaving directory '/<<BUILDDIR>>/kubernetes-addon-heapster-1.2.0+dfsg'
 debian/rules build-arch
I: _1.2.0+dfsg
dh build-arch --buildsystem=golang --with=golang
   dh_update_autotools_config -a -O--buildsystem=golang
   dh_auto_configure -a -O--buildsystem=golang
   dh_auto_build -a -O--buildsystem=golang
	cd obj-arm-linux-gnueabihf && go install -gcflags=all=\"-trimpath=/<<BUILDDIR>>/kubernetes-addon-heapster-1.2.0\+dfsg/obj-arm-linux-gnueabihf/src\" -asmflags=all=\"-trimpath=/<<BUILDDIR>>/kubernetes-addon-heapster-1.2.0\+dfsg/obj-arm-linux-gnueabihf/src\" -v -p 1 k8s.io/heapster/common/elasticsearch k8s.io/heapster/common/flags k8s.io/heapster/common/gce k8s.io/heapster/common/influxdb k8s.io/heapster/common/kubernetes k8s.io/heapster/events k8s.io/heapster/events/core k8s.io/heapster/events/manager k8s.io/heapster/events/sinks k8s.io/heapster/events/sinks/elasticsearch k8s.io/heapster/events/sinks/gcl k8s.io/heapster/events/sinks/influxdb k8s.io/heapster/events/sinks/log k8s.io/heapster/events/sources k8s.io/heapster/events/sources/kubernetes k8s.io/heapster/events/util k8s.io/heapster/integration k8s.io/heapster/metrics k8s.io/heapster/metrics/api/v1 k8s.io/heapster/metrics/api/v1/types k8s.io/heapster/metrics/apis/metrics k8s.io/heapster/metrics/apis/metrics/v1alpha1 k8s.io/heapster/metrics/core k8s.io/heapster/metrics/manager k8s.io/heapster/metrics/processors k8s.io/heapster/metrics/sinks k8s.io/heapster/metrics/sinks/elasticsearch k8s.io/heapster/metrics/sinks/gcm k8s.io/heapster/metrics/sinks/hawkular k8s.io/heapster/metrics/sinks/influxdb k8s.io/heapster/metrics/sinks/kafka k8s.io/heapster/metrics/sinks/log k8s.io/heapster/metrics/sinks/metric k8s.io/heapster/metrics/sinks/monasca k8s.io/heapster/metrics/sinks/opentsdb k8s.io/heapster/metrics/sinks/riemann k8s.io/heapster/metrics/sources k8s.io/heapster/metrics/sources/kubelet k8s.io/heapster/metrics/sources/summary k8s.io/heapster/metrics/util k8s.io/heapster/metrics/util/metrics k8s.io/heapster/version
src/k8s.io/heapster/vendor/k8s.io/kubernetes/pkg/api/validation/schema.go:26:2: cannot find package "github.com/emicklei/go-restful/swagger" in any of:
	/<<BUILDDIR>>/kubernetes-addon-heapster-1.2.0+dfsg/obj-arm-linux-gnueabihf/src/k8s.io/heapster/vendor/github.com/emicklei/go-restful/swagger (vendor tree)
	/usr/lib/go-1.11/src/github.com/emicklei/go-restful/swagger (from $GOROOT)
	/<<BUILDDIR>>/kubernetes-addon-heapster-1.2.0+dfsg/obj-arm-linux-gnueabihf/src/github.com/emicklei/go-restful/swagger (from $GOPATH)
dh_auto_build: cd obj-arm-linux-gnueabihf && go install -gcflags=all=\"-trimpath=/<<BUILDDIR>>/kubernetes-addon-heapster-1.2.0\+dfsg/obj-arm-linux-gnueabihf/src\" -asmflags=all=\"-trimpath=/<<BUILDDIR>>/kubernetes-addon-heapster-1.2.0\+dfsg/obj-arm-linux-gnueabihf/src\" -v -p 1 k8s.io/heapster/common/elasticsearch k8s.io/heapster/common/flags k8s.io/heapster/common/gce k8s.io/heapster/common/influxdb k8s.io/heapster/common/kubernetes k8s.io/heapster/events k8s.io/heapster/events/core k8s.io/heapster/events/manager k8s.io/heapster/events/sinks k8s.io/heapster/events/sinks/elasticsearch k8s.io/heapster/events/sinks/gcl k8s.io/heapster/events/sinks/influxdb k8s.io/heapster/events/sinks/log k8s.io/heapster/events/sources k8s.io/heapster/events/sources/kubernetes k8s.io/heapster/events/util k8s.io/heapster/integration k8s.io/heapster/metrics k8s.io/heapster/metrics/api/v1 k8s.io/heapster/metrics/api/v1/types k8s.io/heapster/metrics/apis/metrics k8s.io/heapster/metrics/apis/metrics/v1alpha1 k8s.io/heapster/metrics/core k8s.io/heapster/metrics/manager k8s.io/heapster/metrics/processors k8s.io/heapster/metrics/sinks k8s.io/heapster/metrics/sinks/elasticsearch k8s.io/heapster/metrics/sinks/gcm k8s.io/heapster/metrics/sinks/hawkular k8s.io/heapster/metrics/sinks/influxdb k8s.io/heapster/metrics/sinks/kafka k8s.io/heapster/metrics/sinks/log k8s.io/heapster/metrics/sinks/metric k8s.io/heapster/metrics/sinks/monasca k8s.io/heapster/metrics/sinks/opentsdb k8s.io/heapster/metrics/sinks/riemann k8s.io/heapster/metrics/sources k8s.io/heapster/metrics/sources/kubelet k8s.io/heapster/metrics/sources/summary k8s.io/heapster/metrics/util k8s.io/heapster/metrics/util/metrics k8s.io/heapster/version returned exit code 1
make: *** [debian/rules:4: build-arch] Error 1

Tail of log for leela-zero on armhf:

/usr/include/c++/8/bits/atomic_base.h:396: undefined reference to `__atomic_load_8'
/usr/bin/ld: CMakeFiles/objs.dir/src/UCTNodePointer.cpp.o: in function `UCTNodePointer::active() const':
/usr/include/c++/8/bits/atomic_base.h:396: undefined reference to `__atomic_load_8'
/usr/bin/ld: CMakeFiles/objs.dir/src/UCTNodePointer.cpp.o: in function `UCTNodePointer::get_eval(int) const':
/usr/include/c++/8/bits/atomic_base.h:396: undefined reference to `__atomic_load_8'
/usr/bin/ld: CMakeFiles/objs.dir/src/UCTNodePointer.cpp.o:/usr/include/c++/8/bits/atomic_base.h:396: more undefined references to `__atomic_load_8' follow
collect2: error: ld returned 1 exit status
make[3]: *** [CMakeFiles/tests.dir/build.make:159: tests] Error 1
make[3]: Leaving directory '/<<PKGBUILDDIR>>/obj-arm-linux-gnueabihf'
make[2]: *** [CMakeFiles/Makefile2:152: CMakeFiles/tests.dir/all] Error 2
make[2]: Leaving directory '/<<PKGBUILDDIR>>/obj-arm-linux-gnueabihf'
make[1]: *** [Makefile:155: all] Error 2
make[1]: Leaving directory '/<<PKGBUILDDIR>>/obj-arm-linux-gnueabihf'
dh_auto_build: cd obj-arm-linux-gnueabihf && make -j4 "INSTALL=install --strip-program=true" returned exit code 2
make: *** [debian/rules:15: build-arch] Error 2

Tail of log for mpqc3 on armhf:

Source file was:

      #include <libpsio/psio.hpp>
      extern "C" char *gprgid() { return "test"; }
      int main(int argc, char** argv) {
        psi::PSIO psio;
        psio.purge(1);
        return 0;
      }
      
dh_auto_configure: cd obj-arm-linux-gnueabihf && cmake -DCMAKE_INSTALL_PREFIX=/usr -DCMAKE_BUILD_TYPE=None -DCMAKE_INSTALL_SYSCONFDIR=/etc -DCMAKE_INSTALL_LOCALSTATEDIR=/var -DCMAKE_EXPORT_NO_PACKAGE_REGISTRY=ON -DCMAKE_FIND_PACKAGE_NO_PACKAGE_REGISTRY=ON "-GUnix Makefiles" -DCMAKE_VERBOSE_MAKEFILE=ON -DCMAKE_INSTALL_LIBDIR=lib/arm-linux-gnueabihf -DMPI_C_COMPILER=mpicc -DMPQC_NEW_FEATURES=1 -DBOOST=/usr .. returned exit code 1
make[1]: *** [debian/rules:21: override_dh_auto_configure] Error 2
make[1]: Leaving directory '/<<PKGBUILDDIR>>'
make: *** [debian/rules:18: build-arch] Error 2

Tail of log for nsd3 on armhf:

#define FACILITY LOG_DAEMON
#define MAX_INTERFACES 8
#define TCP_TIMEOUT 120
#define ROOT_SERVER /**/
#define INET6 /**/
#define BIND8_STATS /**/
#define NDEBUG /**/
#define RATELIMIT /**/
#define HAVE_SSL /**/

configure: exit 1
dh_auto_configure: ./configure --build=arm-linux-gnueabihf --prefix=/usr --includedir=\${prefix}/include --mandir=\${prefix}/share/man --infodir=\${prefix}/share/info --sysconfdir=/etc --localstatedir=/var --disable-silent-rules --libexecdir=\${prefix}/lib/nsd3 --disable-maintainer-mode --disable-dependency-tracking --with-configdir=/etc/nsd3 --with-nsd_conf_file=/etc/nsd3/nsd.conf --with-pidfile=/var/run/nsd3/nsd.pid --with-dbfile=/var/lib/nsd3/nsd.db --with-zonesdir=/etc/nsd3 --with-difffile=/var/lib/nsd3/ixfr.db --with-xfrdfile=/var/lib/nsd3/xfrd.state --disable-largefile --enable-root-server --enable-mmap --enable-ratelimit returned exit code 1
make[1]: *** [debian/rules:32: override_dh_auto_configure] Error 2
make[1]: Leaving directory '/<<PKGBUILDDIR>>'
make: *** [debian/rules:26: build-arch] Error 2

Tail of log for msrtool on armhf:

gcc -g -O2 -fdebug-prefix-map=/<<PKGBUILDDIR>>=. -fstack-protector-strong -Wformat -Werror=format-security -Os -Wall -Werror   -c -o msrutils.o msrutils.c
gcc -g -O2 -fdebug-prefix-map=/<<PKGBUILDDIR>>=. -fstack-protector-strong -Wformat -Werror=format-security -Os -Wall -Werror   -c -o sys.o sys.c
sys.c: In function 'cpuid':
sys.c:40:2: error: unknown register name '%edx' in 'asm'
  asm ("cpuid" : "=b" (outebx) : "a" (0) : "%ecx", "%edx");
  ^~~
sys.c:40:2: error: unknown register name '%ecx' in 'asm'
sys.c:54:2: error: unknown register name '%edx' in 'asm'
  asm ("cpuid" : "=a" (outeax) : "a" (1) : "%ebx", "%ecx", "%edx");
  ^~~
sys.c:54:2: error: unknown register name '%ecx' in 'asm'
sys.c:54:2: error: unknown register name '%ebx' in 'asm'
make[1]: *** [<builtin>: sys.o] Error 1
make[1]: Leaving directory '/<<PKGBUILDDIR>>'
make: *** [/usr/share/cdbs/1/class/makefile.mk:77: debian/stamp-makefile-build] Error 2

Tail of log for lz4tools on armhf:

                          ^
arm-linux-gnueabihf-gcc -pthread -DNDEBUG -g -fwrapv -O2 -Wall -g -O2 -fdebug-prefix-map=/<<PKGBUILDDIR>>=. -fstack-protector-strong -Wformat -Werror=format-security -Wdate-time -D_FORTIFY_SOURCE=2 -fPIC -I/usr/include/python3.7m -c src/xxhash.c -o build/temp.linux-armhf-3.7/src/xxhash.o -std=c99 -O3 -Wall -W -Wundef -DVERSION="1.3.1.1" -DLZ4_VERSION="r123"
arm-linux-gnueabihf-gcc -pthread -shared -Wl,-O1 -Wl,-Bsymbolic-functions -Wl,-z,relro -Wl,-z,relro -g -O2 -fdebug-prefix-map=/<<PKGBUILDDIR>>=. -fstack-protector-strong -Wformat -Werror=format-security -Wdate-time -D_FORTIFY_SOURCE=2 build/temp.linux-armhf-3.7/src/lz4.o build/temp.linux-armhf-3.7/src/lz4hc.o build/temp.linux-armhf-3.7/src/lz4frame.o build/temp.linux-armhf-3.7/src/python-lz4f.o build/temp.linux-armhf-3.7/src/xxhash.o -o /<<PKGBUILDDIR>>/.pybuild/cpython3_3.7_lz4tools/build/lz4f.cpython-37m-arm-linux-gnueabihf.so
running build_scripts
creating build/scripts-3.7
copying and adjusting lz4toolsCli -> build/scripts-3.7
changing mode of build/scripts-3.7/lz4toolsCli from 664 to 775
   dh_auto_test -a -O--buildsystem=pybuild
I: pybuild pybuild:272: cp -r /<<PKGBUILDDIR>>/tests /<<PKGBUILDDIR>>/.pybuild/cpython3_3.7_lz4tools/build/;cp -r /<<PKGBUILDDIR>>/src /<<PKGBUILDDIR>>/.pybuild/cpython3_3.7_lz4tools/build/
I: pybuild base:217: cd /<<PKGBUILDDIR>>/.pybuild/cpython3_3.7_lz4tools/build; python3.7 -m nose -v tests
test_1_write (test.TestLZ4File) ... ok
test_2_file (test.TestLZ4File) ... Segmentation fault
E: pybuild pybuild:341: test: plugin distutils failed with: exit code=139: cd /<<PKGBUILDDIR>>/.pybuild/cpython3_3.7_lz4tools/build; python3.7 -m nose -v tests
dh_auto_test: pybuild --test --test-nose -i python{version} -p 3.7 returned exit code 13
make: *** [debian/rules:14: build-arch] Error 13

Tail of log for octave-tisean on armhf:

***** ###############################################################
***** fail("lazy([(1:10);(1:10)],7,-0.06)");
***** fail("lazy((1:10),0,0.04)");
***** fail("[a,b,c] = lazy((1:10),1,0.05)");
***** test
 "In is generated from Octave using 'in = 1 + 0.5 * rand(10,1);'";
 in = [1.47007925526322;1.168775342017635;1.10943000146922; 1.174293926353764;  1.075741574572656; 1.373465364407417; 1.089417388489702; 1.403669883669071;1.452726826806777;  1.016960990335037];
 "res was generated using 'lazy -m1 -v0.06 in.dat' from TISEAN 'lazy'";
 res = [1.47007930, 0.00000000; 1.17153454, -2.75921822E-03; 1.10942996, 0.00000000; 1.17153454, 2.75933743E-03; 1.07574153, 0.00000000; 1.37346542, 0.00000000; 1.08941734, 0.00000000; 1.40366983, 0.00000000; 1.45272684, 0.00000000; 1.01696098, 0.00000000];
 [al,bl] = lazy(in, 1, -0.06);
 assert([al,bl],res,1e-6);
4 tests, 4 passed, 0 known failure, 0 skipped
Summary: 162 tests, 150 passed, 0 known failures, 0 skipped
Some tests failed.  Giving up...
make: *** [debian/rules:5: binary-arch] Error 1

Tail of log for open-axiom on armhf:

/* confdefs.h */
#define PACKAGE_NAME "OpenAxiom"
#define PACKAGE_TARNAME "openaxiom"
#define PACKAGE_VERSION "1.5.0-2013-06-21"
#define PACKAGE_STRING "OpenAxiom 1.5.0-2013-06-21"
#define PACKAGE_BUGREPORT "open-axiom-bugs@lists.sf.net"
#define PACKAGE_URL ""
#define PACKAGE "openaxiom"
#define VERSION "1.5.0-2013-06-21"
#define OPENAXIOM_BASE_RTS Runtime::sbcl

configure: exit 1
dh_auto_configure: cd build-tree && ../configure --build=arm-linux-gnueabihf --prefix=/usr --includedir=\${prefix}/include --mandir=\${prefix}/share/man --infodir=\${prefix}/share/info --sysconfdir=/etc --localstatedir=/var --disable-silent-rules --libexecdir=\${prefix}/lib/open-axiom --disable-maintainer-mode --disable-dependency-tracking --with-lisp=sbcl --with-x --disable-gcl returned exit code 1
make: *** [debian/rules:50: configure-stamp] Error 2

Tail of log for minimap2 on armhf:

                                                           ~~^                                                   ~~~~~~~~~~~~
                                                           %d
cc -c -g -O2 -fdebug-prefix-map=/<<BUILDDIR>>/minimap2-2.15+dfsg=. -fstack-protector-strong -Wformat -Werror=format-security -g -Wall -O2 -Wc++-compat  -Wdate-time -D_FORTIFY_SOURCE=2 -DHAVE_KALLOC  format.c -o format.o
cc -c -g -O2 -fdebug-prefix-map=/<<BUILDDIR>>/minimap2-2.15+dfsg=. -fstack-protector-strong -Wformat -Werror=format-security -g -Wall -O2 -Wc++-compat  -Wdate-time -D_FORTIFY_SOURCE=2 -DHAVE_KALLOC  pe.c -o pe.o
cc -c -g -O2 -fdebug-prefix-map=/<<BUILDDIR>>/minimap2-2.15+dfsg=. -fstack-protector-strong -Wformat -Werror=format-security -g -Wall -O2 -Wc++-compat  -Wdate-time -D_FORTIFY_SOURCE=2 -DHAVE_KALLOC  esterr.c -o esterr.o
cc -c -g -O2 -fdebug-prefix-map=/<<BUILDDIR>>/minimap2-2.15+dfsg=. -fstack-protector-strong -Wformat -Werror=format-security -g -Wall -O2 -Wc++-compat  -Wdate-time -D_FORTIFY_SOURCE=2 -DHAVE_KALLOC  splitidx.c -o splitidx.o
cc -c -g -O2 -fdebug-prefix-map=/<<BUILDDIR>>/minimap2-2.15+dfsg=. -fstack-protector-strong -Wformat -Werror=format-security -g -Wall -O2 -Wc++-compat  -msse2 -Wdate-time -D_FORTIFY_SOURCE=2 -DHAVE_KALLOC  ksw2_ll_sse.c -o ksw2_ll_sse.o
cc: error: unrecognized command line option '-msse2'
make[2]: *** [Makefile:51: ksw2_ll_sse.o] Error 1
make[2]: *** Waiting for unfinished jobs....
make[2]: Leaving directory '/<<BUILDDIR>>/minimap2-2.15+dfsg'
dh_auto_build: make -j4 "INSTALL=install --strip-program=true" returned exit code 2
make[1]: *** [debian/rules:13: override_dh_auto_build] Error 2
make[1]: Leaving directory '/<<BUILDDIR>>/minimap2-2.15+dfsg'
make: *** [debian/rules:6: build-arch] Error 2

Tail of log for mensis on armhf:

checking for remove... yes
checking for shmat... yes
checking for IceConnectionNumber in -lICE... yes
checking for XOpenDevice in -lXi... no
checking for XkbQueryExtension in -lxkbui... no
checking for pthread_create in -lpthread... yes
checking for u_strcpy in -lgdraw... yes
checking fontforge/basics.h usability... no
checking fontforge/basics.h presence... no
checking for fontforge/basics.h... no
You must install the include files for fontforge
before building mensis.
make[1]: *** [debian/rules:29: override_dh_auto_configure] Error 1
make[1]: Leaving directory '/<<PKGBUILDDIR>>'
make: *** [debian/rules:22: build-arch] Error 2

Tail of log for openmpi1.6 on armhf:

atomic-asm.S:107: Error: selected processor does not support `ldrexd r4,r5,[r0]' in ARM mode
atomic-asm.S:112: Error: selected processor does not support `strexd r1,r6,r7,[r0]' in ARM mode
atomic-asm.S:115: Error: selected processor does not support `dmb' in ARM mode
atomic-asm.S:130: Error: selected processor does not support `ldrexd r4,r5,[r0]' in ARM mode
atomic-asm.S:135: Error: selected processor does not support `dmb' in ARM mode
atomic-asm.S:136: Error: selected processor does not support `strexd r1,r6,r7,[r0]' in ARM mode
make[3]: *** [Makefile:1345: atomic-asm.lo] Error 1
make[3]: *** Waiting for unfinished jobs....
make[3]: Leaving directory '/<<PKGBUILDDIR>>/opal/asm'
make[2]: *** [Makefile:2084: all-recursive] Error 1
make[2]: Leaving directory '/<<PKGBUILDDIR>>/opal'
make[1]: *** [Makefile:1383: all-recursive] Error 1
make[1]: Leaving directory '/<<PKGBUILDDIR>>'
dh_auto_build: make -j4 returned exit code 2
make: *** [debian/rules:32: build-arch] Error 2

Tail of log for olive on armhf:

                 glPopMatrix();
                 ^~~~~~~~~~~
                 QMatrix
ui/viewerwidget.cpp:899:17: error: 'glColor4f' was not declared in this scope
                 glColor4f(color[0], color[1], color[2], color[3]);
                 ^~~~~~~~~
ui/viewerwidget.cpp:899:17: note: suggested alternative: 'glColorMask'
                 glColor4f(color[0], color[1], color[2], color[3]);
                 ^~~~~~~~~
                 glColorMask
make[1]: *** [Makefile:1461: viewerwidget.o] Error 1
make[1]: *** Waiting for unfinished jobs....
make[1]: Leaving directory '/<<PKGBUILDDIR>>'
dh_auto_build: make -j4 returned exit code 2
make: *** [debian/rules:17: build-arch] Error 25

Tail of log for orpie on armhf:

mlgsl_blas.h: In function 'CBLAS_UPLO_val':
mlgsl_blas.h:17:28: warning: type of 'v' defaults to 'int' [-Wimplicit-int]
 static inline CBLAS_UPLO_t CBLAS_UPLO_val(v)
                            ^~~~~~~~~~~~~~
mlgsl_blas.h: In function 'CBLAS_DIAG_val':
mlgsl_blas.h:23:28: warning: type of 'v' defaults to 'int' [-Wimplicit-int]
 static inline CBLAS_DIAG_t CBLAS_DIAG_val(v)
                            ^~~~~~~~~~~~~~
mlgsl_blas.h: In function 'CBLAS_SIDE_val':
mlgsl_blas.h:29:28: warning: type of 'v' defaults to 'int' [-Wimplicit-int]
 static inline CBLAS_SIDE_t CBLAS_SIDE_val(v)
                            ^~~~~~~~~~~~~~
make[1]: *** [Makefile:219: gsl/mlgsl_blas.o] Error 2
make[1]: Leaving directory '/<<PKGBUILDDIR>>'
make: *** [debian/rules:23: build-stamp] Error 2

Tail of log for neuron on armhf:

libtool: link: (cd ".libs" && rm -f "libocxt.so" && ln -s "libocxt.so.0.0.0" "libocxt.so")
libtool: link: ( cd ".libs" && rm -f "libocxt.la" && ln -s "../libocxt.la" "libocxt.la" )
make[6]: Leaving directory '/<<PKGBUILDDIR>>/src/oc'
make[5]: *** [Makefile:562: all] Error 2
make[5]: Leaving directory '/<<PKGBUILDDIR>>/src/oc'
make[4]: *** [Makefile:519: all-recursive] Error 1
make[4]: Leaving directory '/<<PKGBUILDDIR>>/src'
make[3]: *** [Makefile:656: all-recursive] Error 1
make[3]: Leaving directory '/<<PKGBUILDDIR>>'
make[2]: *** [Makefile:514: all] Error 2
make[2]: Leaving directory '/<<PKGBUILDDIR>>'
dh_auto_build: make -j4 returned exit code 2
make[1]: *** [debian/rules:32: override_dh_auto_build] Error 2
make[1]: Leaving directory '/<<PKGBUILDDIR>>'
make: *** [debian/rules:15: build-arch] Error 2

Tail of log for percona-xtradb-cluster-galera-2.x on armhf:

Checking for C library rt... yes
Checking for C header file sys/epoll.h... yes
Checking for C header file byteswap.h... yes
Checking for C header file endian.h... yes
Checking for C++ header file boost/shared_ptr.hpp... yes
Checking for C++ header file tr1/unordered_map... yes
Checking for C++ library boost_program_options... yes
Checking for __sync_fetch_and_add_8() in C library atomic... yes
Checking for C++ header file asio.hpp... yes
Checking for C++ header file asio/ssl.hpp... no
ssl support required but asio/ssl.hpp not found or not usable
compile with ssl=0 or check that openssl devel headers are usable
make[1]: *** [debian/rules:15: override_dh_auto_build] Error 1
make[1]: Leaving directory '/<<PKGBUILDDIR>>'
make: *** [debian/rules:18: build-arch] Error 2

Tail of log for qutecsound on armhf:

src/csoundengine.cpp:67:35:   required from here
/usr/include/qt4/QtCore/qvector.h:503:25: warning: 'void* memcpy(void*, const void*, size_t)' writing to an object of type 'QVector<QString>::Data' {aka 'struct QVectorTypedData<QString>'} with no trivial copy-assignment; use copy-assignment or copy-initialization instead [-Wclass-memaccess]
                 ::memcpy(x.p, p, sizeOfTypedData() + (qMin(aalloc, d->alloc) - 1) * sizeof(T));
                 ~~~~~~~~^~~~~~~~~~~~~~~~~~~~~~~~~~~~~~~~~~~~~~~~~~~~~~~~~~~~~~~~~~~~~~~~~~~~~~
In file included from /usr/include/qt4/QtCore/qxmlstream.h:50,
                 from /usr/include/qt4/QtCore/QtCore:3,
                 from src/csoundengine.h:26,
                 from src/csoundengine.cpp:23:
/usr/include/qt4/QtCore/qvector.h:94:8: note: 'QVector<QString>::Data' {aka 'struct QVectorTypedData<QString>'} declared here
 struct QVectorTypedData : private QVectorData
        ^~~~~~~~~~~~~~~~
make[1]: *** [Makefile:785: build/doubles/release/obj/csoundengine.o] Error 1
make[1]: *** Waiting for unfinished jobs....
make[1]: Leaving directory '/<<PKGBUILDDIR>>'
make: *** [/usr/share/cdbs/1/class/makefile.mk:77: debian/stamp-makefile-build] Error 2

Tail of log for perftest on armhf:

                 from src/perftest_communication.h:45,
                 from src/perftest_communication.c:17:
src/get_clock.h:109:2: warning: #warning get_cycles not implemented for this architecture: attempt asm/timex.h [-Wcpp]
 #warning get_cycles not implemented for this architecture: attempt asm/timex.h
  ^~~~~~~
src/get_clock.h:110:10: fatal error: asm/timex.h: No such file or directory
 #include <asm/timex.h>
          ^~~~~~~~~~~~~
compilation terminated.
make[2]: *** [Makefile:844: src/perftest_communication.o] Error 1
make[2]: Leaving directory '/<<BUILDDIR>>/perftest-4.4+0.5'
make[1]: *** [Makefile:571: all] Error 2
make[1]: Leaving directory '/<<BUILDDIR>>/perftest-4.4+0.5'
dh_auto_build: make -j4 returned exit code 2
make: *** [debian/rules:7: build-arch] Error 2

Tail of log for qwinff on armhf:

src/qmpwidget/qmpwidget.cpp:166:25: note: suggested alternative: 'glVertexAttrib2f'
     glTexCoord2f(0, 0); glVertex2f(-1, -1);
                         ^~~~~~~~~~
                         glVertexAttrib2f
src/qmpwidget/qmpwidget.cpp:170:5: error: 'glEnd' was not declared in this scope
     glEnd();
     ^~~~~
src/qmpwidget/qmpwidget.cpp:170:5: note: suggested alternative: 'glInit'
     glEnd();
     ^~~~~
     glInit
make[1]: *** [Makefile:1155: qmpwidget.o] Error 1
make[1]: Leaving directory '/<<PKGBUILDDIR>>'
dh_auto_build: make -j4 "INSTALL=install --strip-program=true" returned exit code 2
make: *** [debian/rules:17: build-arch] Error 2

Tail of log for rpm2html on armhf:

              headerNextIterator(sIter, &tag, &type, (void *) &p, &count);) {
              ^~~~~~~~~~~~~~~~~~
              headerInitIterator
rpmopen.c: In function 'rpmOpen':
rpmopen.c:1052:20: error: storage size of 'lead' isn't known
     struct rpmlead lead;
                    ^~~~
rpmopen.c:1140:9: warning: implicit declaration of function 'fdClose'; did you mean 'fclose'? [-Wimplicit-function-declaration]
         fdClose(fd);
         ^~~~~~~
         fclose
make[1]: *** [Makefile:514: rpmopen.o] Error 1
make[1]: Leaving directory '/<<PKGBUILDDIR>>'
dh_auto_build: make -j1 returned exit code 2
make: *** [debian/rules:7: build-arch] Error 2

Tail of log for olive-editor on armhf:

                 glPopMatrix();
                 ^~~~~~~~~~~
                 QMatrix
ui/viewerwidget.cpp:899:17: error: 'glColor4f' was not declared in this scope
                 glColor4f(color[0], color[1], color[2], color[3]);
                 ^~~~~~~~~
ui/viewerwidget.cpp:899:17: note: suggested alternative: 'glColorMask'
                 glColor4f(color[0], color[1], color[2], color[3]);
                 ^~~~~~~~~
                 glColorMask
make[1]: *** [Makefile:1461: viewerwidget.o] Error 1
make[1]: *** Waiting for unfinished jobs....
make[1]: Leaving directory '/<<PKGBUILDDIR>>'
dh_auto_build: make -j4 returned exit code 2
make: *** [debian/rules:17: build-arch] Error 25

Tail of log for prboom on armhf:

                                png_error_ptr
i_sshot.c:234:32: note: each undeclared identifier is reported only once for each function it appears in
i_sshot.c:282:43: error: 'png_infopp_NULL' undeclared (first use in this function); did you mean 'png_infopp'?
       png_destroy_write_struct(&png_ptr,  png_infopp_NULL);
                                           ^~~~~~~~~~~~~~~
                                           png_infopp
make[4]: *** [Makefile:242: i_sshot.o] Error 1
make[4]: Leaving directory '/<<BUILDDIR>>/prboom-2.5.0+dfsg1/src/SDL'
make[3]: *** [Makefile:460: all-recursive] Error 1
make[3]: Leaving directory '/<<BUILDDIR>>/prboom-2.5.0+dfsg1/src'
make[2]: *** [Makefile:285: all-recursive] Error 1
make[2]: Leaving directory '/<<BUILDDIR>>/prboom-2.5.0+dfsg1'
make[1]: *** [Makefile:205: all] Error 2
make[1]: Leaving directory '/<<BUILDDIR>>/prboom-2.5.0+dfsg1'
make: *** [debian/rules:28: build-stamp] Error 2

Tail of log for qtjsbackend-opensource-src on armhf:

../3rdparty/v8/src/objects.h:7486:36: error: left operand of shift expression '(-8 << 26)' is negative [-fpermissive]
       (~kMaxCachedArrayIndexLength << kArrayIndexHashLengthShift) |
       ~~~~~~~~~~~~~~~~~~~~~~~~~~~~~^~~~~~~~~~~~~~~~~~~~~~~~~~~~~~
make[3]: *** [Makefile:910: .obj/accessors.o] Error 1
make[3]: *** Waiting for unfinished jobs....
make[3]: *** [Makefile:1230: .obj/assembler.o] Error 1
make[3]: *** [Makefile:1348: .obj/ast.o] Error 1
make[3]: *** [Makefile:1083: .obj/api.o] Error 1
make[3]: Leaving directory '/<<PKGBUILDDIR>>/src/v8'
make[2]: *** [Makefile:89: sub-v8-make_first-ordered] Error 2
make[2]: Leaving directory '/<<PKGBUILDDIR>>/src'
make[1]: *** [Makefile:46: sub-src-make_first] Error 2
make[1]: Leaving directory '/<<PKGBUILDDIR>>'
dh_auto_build: make -j4 returned exit code 2
make: *** [debian/rules:14: build-arch] Error 25

Tail of log for ruby2.1 on armhf:

make[4]: Leaving directory '/<<PKGBUILDDIR>>/ext/objspace'
gcc -I. -I../../../.ext/include/arm-linux-gnueabihf -I../../.././include -I../../.././ext/dl/callback -I../../.././ext/dl/callback/.. -DRUBY_EXTCONF_H=\"extconf.h\" -Wdate-time -D_FORTIFY_SOURCE=2 -D_FILE_OFFSET_BITS=64  -fPIC -g -O2 -fdebug-prefix-map=/<<PKGBUILDDIR>>=. -fstack-protector-strong -Wformat -Werror=format-security -fPIC  -o callback-8.o -c callback-8.c
rm -f ../../.ext/arm-linux-gnueabihf/nkf.so
gcc -shared -o ../../.ext/arm-linux-gnueabihf/nkf.so nkf.o -L. -L../.. -L. -Wl,-z,relro -L/<<PKGBUILDDIR>>/debian/lib -fstack-protector -rdynamic -Wl,-export-dynamic    -lruby-2.1  -lpthread -lgmp -ldl -lcrypt -lm   -lc
make[4]: Leaving directory '/<<PKGBUILDDIR>>/ext/nkf'
rm -f ../../../.ext/arm-linux-gnueabihf/dl/callback.so
gcc -shared -o ../../../.ext/arm-linux-gnueabihf/dl/callback.so callback.o callback-0.o callback-1.o callback-2.o callback-3.o callback-4.o callback-5.o callback-6.o callback-7.o callback-8.o -L. -L../../.. -L. -Wl,-z,relro -L/<<PKGBUILDDIR>>/debian/lib -fstack-protector -rdynamic -Wl,-export-dynamic    -lruby-2.1  -lpthread -lgmp -ldl -lcrypt -lm   -lc
make[4]: Leaving directory '/<<PKGBUILDDIR>>/ext/dl/callback'
make[3]: Leaving directory '/<<PKGBUILDDIR>>'
make[2]: *** [uncommon.mk:180: build-ext] Error 2
make[2]: Leaving directory '/<<PKGBUILDDIR>>'
dh_auto_build: make -j4 main V=1 returned exit code 2
make[1]: *** [debian/rules:67: override_dh_auto_build-arch] Error 2
make[1]: Leaving directory '/<<PKGBUILDDIR>>'
make: *** [debian/rules:49: build-arch] Error 2

Tail of log for tlsdate on armhf:

                 from /usr/include/openssl/bio.h:13,
                 from ./src/tlsdate-helper.h:37,
                 from src/tlsdate-helper.c:78:
/usr/include/openssl/ssl.h:1879:1: note: declared here
 DEPRECATEDIN_1_1_0(__owur const SSL_METHOD *TLSv1_client_method(void))
 ^~~~~~~~~~~~~~~~~~
src/tlsdate-helper.c:1207:27: error: dereferencing pointer to incomplete type 'SSL' {aka 'struct ssl_st'}
   memcpy(&result_time, ssl->s3->server_random, sizeof (uint32_t));
                           ^~
make[2]: *** [Makefile:2037: src/tlsdate_helper-tlsdate-helper.o] Error 1
make[2]: Leaving directory '/<<PKGBUILDDIR>>'
make[1]: *** [Makefile:1428: all] Error 2
make[1]: Leaving directory '/<<PKGBUILDDIR>>'
dh_auto_build: make -j1 returned exit code 2
make: *** [debian/rules:25: build-arch] Error 2

Tail of log for tarantool on armhf:

    ^~~~~
/<<PKGBUILDDIR>>/third_party/coro/coro.c:480:14: error: 'NUM_SAVED' undeclared (first use in this function)
   ctx->sp -= NUM_SAVED;
              ^~~~~~~~~
/<<PKGBUILDDIR>>/third_party/coro/coro.c:480:14: note: each undeclared identifier is reported only once for each function it appears in
/<<PKGBUILDDIR>>/third_party/coro/coro.c:494:4: error: #error unsupported architecture
   #error unsupported architecture
    ^~~~~
make[3]: *** [CMakeFiles/coro.dir/build.make:66: CMakeFiles/coro.dir/third_party/coro/coro.c.o] Error 1
make[3]: Leaving directory '/<<PKGBUILDDIR>>/obj-arm-linux-gnueabihf'
make[2]: *** [CMakeFiles/Makefile2:283: CMakeFiles/coro.dir/all] Error 2
make[2]: Leaving directory '/<<PKGBUILDDIR>>/obj-arm-linux-gnueabihf'
make[1]: *** [Makefile:155: all] Error 2
make[1]: Leaving directory '/<<PKGBUILDDIR>>/obj-arm-linux-gnueabihf'
make: *** [/usr/share/cdbs/1/class/makefile.mk:77: debian/stamp-makefile-build] Error 2

Tail of log for traildb on armhf:

#define HAVE_INTTYPES_H 1
#define HAVE_STDINT_H 1
#define HAVE_UNISTD_H 1
#define HAVE_DLFCN_H 1
#define LT_OBJDIR ".libs/"
#define DSFMT_MEXP 521
#define HAVE_SSE2 1
#define HAVE_LIBJUDY 1
#define HAVE_JUDY_H 1
#define HAVE_ARCHIVE_H 1
#define HAVE_LIBARCHIVE 1

configure: exit 1
dh_auto_configure: ./configure --build=arm-linux-gnueabihf --prefix=/usr --includedir=\${prefix}/include --mandir=\${prefix}/share/man --infodir=\${prefix}/share/info --sysconfdir=/etc --localstatedir=/var --disable-silent-rules --libdir=\${prefix}/lib/arm-linux-gnueabihf --libexecdir=\${prefix}/lib/arm-linux-gnueabihf --disable-maintainer-mode --disable-dependency-tracking returned exit code 1
make: *** [debian/rules:10: build-arch] Error 2

Tail of log for slang-slirp on armhf:

checking for dlfcn.h... yes
checking for dlopen in -ldl... yes
checking for g++... g++
checking whether we are using the GNU C++ compiler... yes
checking whether g++ accepts -g... yes
checking for gfortran... gfortran
checking whether we are using the GNU Fortran compiler... yes
checking whether gfortran accepts -g... yes
checking how to get verbose linking output from gfortran... -v
checking for Fortran libraries of gfortran...  -L/usr/lib/gcc/arm-linux-gnueabihf/8 -L/usr/lib/gcc/arm-linux-gnueabihf/8/../../../arm-linux-gnueabihf -L/usr/lib/gcc/arm-linux-gnueabihf/8/../../.. -L/lib/arm-linux-gnueabihf -L/usr/lib/arm-linux-gnueabihf -lgfortran -lm
checking for dummy main to link with Fortran libraries... none
checking for Fortran name-mangling scheme... lower case, underscore, no extra underscore
checking for the slang library and header files ... no
configure: error: unable to find the slang library and header file slang.h
make: *** [/usr/share/cdbs/1/class/autotools.mk:46: debian/stamp-autotools] Error 1

Tail of log for osrm on armhf:

/usr/bin/c++  -DBOOST_TEST_DYN_LINK -I/<<PKGBUILDDIR>>/include -I/<<PKGBUILDDIR>>/third_party -I/<<PKGBUILDDIR>>/third_party/libosmium/include -I/usr/include/luabind -I/usr/include/lua5.2 -I/usr/include/osmpbf -I/usr/include/gdal  -g -O2 -fdebug-prefix-map=/<<PKGBUILDDIR>>=. -fstack-protector-strong -Wformat -Werror=format-security -Wdate-time -D_FORTIFY_SOURCE=2 -flto -Wall -pedantic -fPIC -fdiagnostics-color=auto -std=c++11  -fopenmp -O3 -DNDEBUG   -o CMakeFiles/OSRM.dir/algorithms/polyline_formatter.cpp.o -c /<<PKGBUILDDIR>>/algorithms/polyline_formatter.cpp
[ 54%] Building CXX object CMakeFiles/OSRM.dir/server/http/reply.cpp.o
/usr/bin/c++  -DBOOST_TEST_DYN_LINK -I/<<PKGBUILDDIR>>/include -I/<<PKGBUILDDIR>>/third_party -I/<<PKGBUILDDIR>>/third_party/libosmium/include -I/usr/include/luabind -I/usr/include/lua5.2 -I/usr/include/osmpbf -I/usr/include/gdal  -g -O2 -fdebug-prefix-map=/<<PKGBUILDDIR>>=. -fstack-protector-strong -Wformat -Werror=format-security -Wdate-time -D_FORTIFY_SOURCE=2 -flto -Wall -pedantic -fPIC -fdiagnostics-color=auto -std=c++11  -fopenmp -O3 -DNDEBUG   -o CMakeFiles/OSRM.dir/server/http/reply.cpp.o -c /<<PKGBUILDDIR>>/server/http/reply.cpp
[ 56%] Linking CXX static library libOSRM.a
/usr/bin/cmake -P CMakeFiles/OSRM.dir/cmake_clean_target.cmake
/usr/bin/cmake -E cmake_link_script CMakeFiles/OSRM.dir/link.txt --verbose=1
/usr/bin/gcc-ar qc libOSRM.a  CMakeFiles/OSRM.dir/library/osrm_impl.cpp.o CMakeFiles/OSRM.dir/descriptors/description_factory.cpp.o CMakeFiles/OSRM.dir/data_structures/route_parameters.cpp.o CMakeFiles/OSRM.dir/data_structures/search_engine_data.cpp.o CMakeFiles/OSRM.dir/util/bearing.cpp.o CMakeFiles/OSRM.dir/algorithms/douglas_peucker.cpp.o CMakeFiles/OSRM.dir/algorithms/polyline_compressor.cpp.o CMakeFiles/OSRM.dir/algorithms/polyline_formatter.cpp.o CMakeFiles/OSRM.dir/server/http/reply.cpp.o CMakeFiles/ANGLE.dir/util/compute_angle.cpp.o CMakeFiles/COORDINATE.dir/data_structures/coordinate.cpp.o CMakeFiles/COORDINATE.dir/data_structures/coordinate_calculation.cpp.o CMakeFiles/GITDESCRIPTION.dir/util/git_sha.cpp.o CMakeFiles/FINGERPRINT.dir/util/fingerprint.cpp.o CMakeFiles/LOGGER.dir/util/simple_logger.cpp.o CMakeFiles/PHANTOMNODE.dir/data_structures/phantom_node.cpp.o CMakeFiles/EXCEPTION.dir/util/osrm_exception.cpp.o CMakeFiles/MERCATOR.dir/util/mercator.cpp.o CMakeFiles/IMPORT.dir/data_structures/external_memory_node.cpp.o CMakeFiles/IMPORT.dir/data_structures/import_edge.cpp.o
/usr/bin/gcc-ranlib libOSRM.a
make[3]: Leaving directory '/<<PKGBUILDDIR>>/obj-arm-linux-gnueabihf'
[ 56%] Built target OSRM
make[2]: Leaving directory '/<<PKGBUILDDIR>>/obj-arm-linux-gnueabihf'
make[1]: *** [Makefile:133: all] Error 2
make[1]: Leaving directory '/<<PKGBUILDDIR>>/obj-arm-linux-gnueabihf'
dh_auto_build: cd obj-arm-linux-gnueabihf && make -j4 returned exit code 2
make: *** [debian/rules:6: build-arch] Error 2

Tail of log for tendermint on armhf:

=== RUN   TestBadVotes
--- PASS: TestBadVotes (0.05s)
=== RUN   TestConflicts
--- PASS: TestConflicts (0.07s)
=== RUN   TestMakeCommit
--- PASS: TestMakeCommit (0.09s)
=== RUN   TestVoteSignable
--- PASS: TestVoteSignable (0.00s)
PASS
ok  	github.com/tendermint/tendermint/types	8.716s
?   	github.com/tendermint/tendermint/version	[no test files]
dh_auto_test: cd obj-arm-linux-gnueabihf && go test -vet=off -v -p 1 github.com/tendermint/tendermint/benchmarks github.com/tendermint/tendermint/benchmarks/proto github.com/tendermint/tendermint/benchmarks/simu github.com/tendermint/tendermint/blockchain github.com/tendermint/tendermint/cmd/tendermint github.com/tendermint/tendermint/config/tendermint github.com/tendermint/tendermint/config/tendermint_test github.com/tendermint/tendermint/consensus github.com/tendermint/tendermint/fail-test github.com/tendermint/tendermint/mempool github.com/tendermint/tendermint/node github.com/tendermint/tendermint/proxy github.com/tendermint/tendermint/rpc/core github.com/tendermint/tendermint/rpc/core/types github.com/tendermint/tendermint/rpc/grpc github.com/tendermint/tendermint/rpc/test github.com/tendermint/tendermint/state github.com/tendermint/tendermint/test/app github.com/tendermint/tendermint/types github.com/tendermint/tendermint/version returned exit code 1
make[1]: *** [debian/rules:9: override_dh_auto_test] Error 1
make[1]: Leaving directory '/<<BUILDDIR>>/tendermint-0.8.0+git20170113.0.764091d'
make: *** [debian/rules:6: build-arch] Error 2

Tail of log for tulip on armhf:

     memcpy(this->siblings,siblings,sizeof(int)*this->maxNumberOfElements);
     ^~~~~~
[ 26%] Building CXX object thirdparty/OGDF/CMakeFiles/OGDF-tulip-4.8.dir/src/ogdf/basic/EdgeComparerSimple.cpp.o
cd /<<PKGBUILDDIR>>/obj-arm-linux-gnueabihf/thirdparty/OGDF && /usr/bin/c++  -DOGDF_tulip_4_8_EXPORTS -DQT_CORE_LIB -DQT_GUI_LIB -DQT_NETWORK_LIB -DQT_OPENGL_LIB -DQT_WEBKITWIDGETS_LIB -DQT_WEBKIT_LIB -DQT_WIDGETS_LIB -DQT_XMLPATTERNS_LIB -DQT_XML_LIB -D_LINUX -I/usr/include/arm-linux-gnueabihf/qt5 -I/usr/include/arm-linux-gnueabihf/qt5/QtWidgets -I/usr/include/arm-linux-gnueabihf/qt5/QtGui -I/usr/include/arm-linux-gnueabihf/qt5/QtCore -I/usr/lib/arm-linux-gnueabihf/qt5/mkspecs/linux-g++ -I/usr/include/arm-linux-gnueabihf/qt5/QtOpenGL -I/usr/include/arm-linux-gnueabihf/qt5/QtXml -I/usr/include/arm-linux-gnueabihf/qt5/QtXmlPatterns -I/usr/include/arm-linux-gnueabihf/qt5/QtNetwork -I/usr/include/arm-linux-gnueabihf/qt5/QtWebKit -I/usr/include/arm-linux-gnueabihf/qt5/QtWebKitWidgets -I/<<PKGBUILDDIR>>/thirdparty/OGDF/include -I/<<PKGBUILDDIR>>/thirdparty/OGDF/include/coin -I/<<PKGBUILDDIR>>/thirdparty/OGDF/config/coinstuff  -g -O2 -fdebug-prefix-map=/<<PKGBUILDDIR>>=. -fstack-protector-strong -Wformat -Werror=format-security -Wdate-time -D_FORTIFY_SOURCE=2 -Wall -Wextra -Wunused -Wno-long-long -pedantic -w  -DOGDF_DLL -DOGDF_INSTALL -DCLP_BUILD -DCOINUTILS_BUILD -DOSI_BUILD -DSYMPHONY_BUILD -D__OSI_CLP__ -DCOMPILE_IN_CG -DCOMPILE_IN_CP -DCOMPILE_IN_LP -DCOMPILE_IN_TM -DUSE_CGL_CUTS -DHAVE_CONFIG_H -fPIC   -o CMakeFiles/OGDF-tulip-4.8.dir/src/ogdf/basic/EdgeComparerSimple.cpp.o -c /<<PKGBUILDDIR>>/thirdparty/OGDF/src/ogdf/basic/EdgeComparerSimple.cpp
make[4]: *** [thirdparty/OGDF/CMakeFiles/OGDF-tulip-4.8.dir/build.make:3108: thirdparty/OGDF/CMakeFiles/OGDF-tulip-4.8.dir/src/ogdf/basic/DisjointSets.cpp.o] Error 1
make[4]: *** Waiting for unfinished jobs....
make[4]: Leaving directory '/<<PKGBUILDDIR>>/obj-arm-linux-gnueabihf'
make[3]: *** [CMakeFiles/Makefile2:220: thirdparty/OGDF/CMakeFiles/OGDF-tulip-4.8.dir/all] Error 2
make[3]: Leaving directory '/<<PKGBUILDDIR>>/obj-arm-linux-gnueabihf'
make[2]: *** [Makefile:133: all] Error 2
make[2]: Leaving directory '/<<PKGBUILDDIR>>/obj-arm-linux-gnueabihf'
dh_auto_build: cd obj-arm-linux-gnueabihf && make -j4 returned exit code 2
make[1]: *** [debian/rules:13: override_dh_auto_build-arch] Error 2
make[1]: Leaving directory '/<<PKGBUILDDIR>>'
make: *** [debian/rules:7: build-arch] Error 2

Tail of log for wmmail on armhf:

/usr/bin/make
make[1]: Entering directory '/<<PKGBUILDDIR>>'
Making all in src
make[2]: Entering directory '/<<PKGBUILDDIR>>/src'
gcc -DPACKAGE=\"WMMail\" -DVERSION=\"0.64\" -DHAVE_LIBNSL=1 -DHAVE_LIBX11=1 -DHAVE_LIBXEXT=1 -DHAVE_LIBXT=1 -DHAVE_LIBXPM=1 -DHAVE_LIBWUTIL=1 -DSTDC_HEADERS=1 -DHAVE_LIMITS_H=1 -DHAVE_STRINGS_H=1 -DHAVE_UNISTD_H=1 -DRETSIGTYPE=int -DHAVE_VPRINTF=1 -DHAVE_SOCKET=1 -DHAVE_STRSTR=1  -I. -I.      -g -O2 -I  -c global.c
In file included from global.c:27:
wmmail.h:32:10: fatal error: WINGs/proplist-compat.h: No such file or directory
 #include <WINGs/proplist-compat.h>
          ^~~~~~~~~~~~~~~~~~~~~~~~~
compilation terminated.
make[2]: *** [Makefile:247: global.o] Error 1
make[2]: Leaving directory '/<<PKGBUILDDIR>>/src'
make[1]: *** [Makefile:125: all-recursive] Error 1
make[1]: Leaving directory '/<<PKGBUILDDIR>>'
make: *** [debian/rules:17: build-stamp] Error 2

Tail of log for varnish-agent on armhf:

src/Makefile.am:8: warning: source file 'modules/vlog.c' is in a subdirectory,
src/Makefile.am:8: but option 'subdir-objects' is disabled
src/Makefile.am:8: warning: source file 'modules/vban.c' is in a subdirectory,
src/Makefile.am:8: but option 'subdir-objects' is disabled
src/Makefile.am:8: warning: source file 'modules/curl.c' is in a subdirectory,
src/Makefile.am:8: but option 'subdir-objects' is disabled
src/Makefile.am:8: warning: source file 'modules/vdirect.c' is in a subdirectory,
src/Makefile.am:8: but option 'subdir-objects' is disabled
src/Makefile.am:8: warning: source file 'modules/vac_register.c' is in a subdirectory,
src/Makefile.am:8: but option 'subdir-objects' is disabled
src/Makefile.am: installing './depcomp'
parallel-tests: installing './test-driver'
autoreconf: automake failed with exit status: 1
dh_autoreconf: autoreconf -f -i returned exit code 1
make: *** [debian/rules:46: build-arch] Error 2

Tail of log for sdrangelove on armhf:

/<<PKGBUILDDIR>>/sdrbase/gui/glscope.cpp:284:12: error: 'GL_LINE_SMOOTH' was not declared in this scope
   glEnable(GL_LINE_SMOOTH);
            ^~~~~~~~~~~~~~
/<<PKGBUILDDIR>>/sdrbase/gui/glscope.cpp:284:12: note: suggested alternative: 'GL_LINE_LOOP'
   glEnable(GL_LINE_SMOOTH);
            ^~~~~~~~~~~~~~
            GL_LINE_LOOP
make[3]: *** [CMakeFiles/sdrbase.dir/build.make:439: CMakeFiles/sdrbase.dir/sdrbase/gui/glscope.cpp.o] Error 1
make[3]: Leaving directory '/<<PKGBUILDDIR>>/obj-arm-linux-gnueabihf'
make[2]: *** [CMakeFiles/Makefile2:76: CMakeFiles/sdrbase.dir/all] Error 2
make[2]: Leaving directory '/<<PKGBUILDDIR>>/obj-arm-linux-gnueabihf'
make[1]: *** [Makefile:87: all] Error 2
make[1]: Leaving directory '/<<PKGBUILDDIR>>/obj-arm-linux-gnueabihf'
dh_auto_build: cd obj-arm-linux-gnueabihf && make -j1 returned exit code 2
make: *** [debian/rules:14: build-arch] Error 2

Tail of log for trilinos on armhf:

[  0%] Built target TeuchosParameterList_BadXmlTestFiles
[  0%] Built target TeuchosParameterList_CopyExampleXmlFiles
[  0%] Linking CXX shared library libtrilinos_kokkos_gtest.so
cd /<<PKGBUILDDIR>>/obj-arm-linux-gnueabihf/packages/kokkos/core/unit_test && /usr/bin/cmake -E cmake_link_script CMakeFiles/trilinos_kokkos_gtest.dir/link.txt --verbose=1
/usr/bin/mpicxx -fPIC   -g -O2 -fdebug-prefix-map=/<<PKGBUILDDIR>>=. -fstack-protector-strong -Wformat -Werror=format-security -Wdate-time -D_FORTIFY_SOURCE=2 -std=c++11 -Wl,-z,relro -Wl,-z,now -Wl,--as-needed -shared -Wl,-soname,libtrilinos_kokkos_gtest.so.12 -o libtrilinos_kokkos_gtest.so.12.12.1 CMakeFiles/trilinos_kokkos_gtest.dir/__/__/tpls/gtest/gtest/gtest-all.cc.o /usr/lib/arm-linux-gnueabihf/libdl.so 
cd /<<PKGBUILDDIR>>/obj-arm-linux-gnueabihf/packages/kokkos/core/unit_test && /usr/bin/cmake -E cmake_symlink_library libtrilinos_kokkos_gtest.so.12.12.1 libtrilinos_kokkos_gtest.so.12 libtrilinos_kokkos_gtest.so
make[4]: Leaving directory '/<<PKGBUILDDIR>>/obj-arm-linux-gnueabihf'
[  0%] Built target trilinos_kokkos_gtest
make[3]: Leaving directory '/<<PKGBUILDDIR>>/obj-arm-linux-gnueabihf'
make[2]: *** [Makefile:166: all] Error 2
make[2]: Leaving directory '/<<PKGBUILDDIR>>/obj-arm-linux-gnueabihf'
dh_auto_build: cd obj-arm-linux-gnueabihf && make -j4 "INSTALL=install --strip-program=true" returned exit code 2
make[1]: *** [debian/rules:81: override_dh_auto_build-arch] Error 2
make[1]: Leaving directory '/<<PKGBUILDDIR>>'
make: *** [debian/rules:70: build-arch] Error 2

Tail of log for xf86-video-msm on armhf:

                 from neon_memsets.c:30:
/usr/include/xorg/servermd.h:51:2: error: #error Drivers must include xorg-server.h before any other xserver headers
 #error Drivers must include xorg-server.h before any other xserver headers
  ^~~~~
/usr/include/xorg/servermd.h:52:2: error: #error xserver code must include dix-config.h before any other headers
 #error xserver code must include dix-config.h before any other headers
  ^~~~~
make[3]: *** [Makefile:550: neon_memsets.lo] Error 1
make[3]: Leaving directory '/<<BUILDDIR>>/xf86-video-msm-1.0.1+git20100122.5f7df591/src'
make[2]: *** [Makefile:426: all-recursive] Error 1
make[2]: Leaving directory '/<<BUILDDIR>>/xf86-video-msm-1.0.1+git20100122.5f7df591'
make[1]: *** [Makefile:358: all] Error 2
make[1]: Leaving directory '/<<BUILDDIR>>/xf86-video-msm-1.0.1+git20100122.5f7df591'
dh_auto_build: make -j1 returned exit code 2
make: *** [debian/rules:8: build-arch] Error 2

Tail of log for unanimity on armhf:

/usr/include/c++/8/bits/stl_vector.h:1085:4: note: parameter passing for argument of type ‘__gnu_cxx::__normal_iterator<PacBio::Align::Seed*, std::vector<PacBio::Align::Seed> >’ changed in GCC 7.1
    _M_realloc_insert(end(), __x);
    ^~~~~~~~~~~~~~~~~
[ 50%] Linking CXX static library libunanimity.a
cd /<<BUILDDIR>>/unanimity-3.3.0+dfsg/build/src && /usr/bin/cmake -P CMakeFiles/unanimity.dir/cmake_clean_target.cmake
cd /<<BUILDDIR>>/unanimity-3.3.0+dfsg/build/src && /usr/bin/cmake -E cmake_link_script CMakeFiles/unanimity.dir/link.txt --verbose=1
/usr/bin/ar qc libunanimity.a  CMakeFiles/unanimity.dir/genomicconsensus/experimental/Consensus.cpp.o CMakeFiles/unanimity.dir/genomicconsensus/experimental/ConsensusModelFactory.cpp.o CMakeFiles/unanimity.dir/genomicconsensus/experimental/Filters.cpp.o CMakeFiles/unanimity.dir/genomicconsensus/experimental/GenomicConsensus.cpp.o CMakeFiles/unanimity.dir/genomicconsensus/experimental/IPoaModel.cpp.o CMakeFiles/unanimity.dir/genomicconsensus/experimental/Input.cpp.o CMakeFiles/unanimity.dir/genomicconsensus/experimental/Intervals.cpp.o CMakeFiles/unanimity.dir/genomicconsensus/experimental/Output.cpp.o CMakeFiles/unanimity.dir/genomicconsensus/experimental/Settings.cpp.o CMakeFiles/unanimity.dir/genomicconsensus/experimental/Sorting.cpp.o CMakeFiles/unanimity.dir/genomicconsensus/experimental/Workflow.cpp.o CMakeFiles/unanimity.dir/genomicconsensus/experimental/arrow/ArrowModel.cpp.o CMakeFiles/unanimity.dir/genomicconsensus/experimental/io/FastaWriter.cpp.o CMakeFiles/unanimity.dir/genomicconsensus/experimental/io/FastqWriter.cpp.o CMakeFiles/unanimity.dir/genomicconsensus/experimental/io/GffWriter.cpp.o CMakeFiles/unanimity.dir/genomicconsensus/experimental/io/VcfWriter.cpp.o CMakeFiles/unanimity.dir/genomicconsensus/experimental/plurality/PluralityModel.cpp.o CMakeFiles/unanimity.dir/genomicconsensus/experimental/poa/PoaModel.cpp.o CMakeFiles/unanimity.dir/ChemistryMapping.cpp.o CMakeFiles/unanimity.dir/ChemistryTriple.cpp.o CMakeFiles/unanimity.dir/Interval.cpp.o CMakeFiles/unanimity.dir/ReadId.cpp.o CMakeFiles/unanimity.dir/SparsePoa.cpp.o CMakeFiles/unanimity.dir/SubreadResultCounter.cpp.o CMakeFiles/unanimity.dir/Timer.cpp.o CMakeFiles/unanimity.dir/Utility.cpp.o CMakeFiles/unanimity.dir/ConsensusSettings.cpp.o
/usr/bin/ranlib libunanimity.a
make[3]: Leaving directory '/<<BUILDDIR>>/unanimity-3.3.0+dfsg/build'
[ 50%] Built target unanimity
make[2]: Leaving directory '/<<BUILDDIR>>/unanimity-3.3.0+dfsg/build'
make[1]: *** [Makefile:133: all] Error 2
make[1]: Leaving directory '/<<BUILDDIR>>/unanimity-3.3.0+dfsg/build'
dh_auto_build: cd build && make -j4 "INSTALL=install --strip-program=true" returned exit code 2
make: *** [debian/rules:28: build-arch] Error 2

Tail of log for wesnoth-1.8 on armhf:

	config/py-compile config.log
find po -name "*.gmo" -exec rm -f {} \;
find po -name "stamp-po" -exec rm -f {} \;
rm -f config.sub config.guess
/usr/bin/make -f /usr/share/quilt/quilt.make unpatch
make[1]: Entering directory '/<<PKGBUILDDIR>>'
QUILT_PATCHES=debian/patches \
	quilt --quiltrc /dev/null pop -a -R || test $? = 2
No patch removed
rm -rf .pc debian/stamp-patched
make[1]: Leaving directory '/<<PKGBUILDDIR>>'
dh_clean
dh_clean: Compatibility levels before 9 are deprecated (level 7 in use)
 debian/rules build-arch
make: *** No rule to make target 'build-arch'.  Stop.

Tail of log for qtox on armhf:

[ 84%] Built target test_textformatter
[ 84%] Linking CXX executable qtox
/usr/bin/cmake -E cmake_link_script CMakeFiles/qtox.dir/link.txt --verbose=1
/usr/bin/c++  -g -O2 -fdebug-prefix-map=/<<PKGBUILDDIR>>=. -fstack-protector-strong -Wformat -Werror=format-security -Wall -pedantic -Wdate-time -D_FORTIFY_SOURCE=2 -std=c++11 -fno-exceptions -fno-rtti -Wstrict-overflow -Wstrict-aliasing -fstack-protector-all -Wstack-protector -pthread -pthread  -Wl,-z,relro -Wl,-z,now -Wl,--as-needed -Wl,-z,now -Wl,-z,relro -rdynamic CMakeFiles/qtox.dir/qrc_res.cpp.o CMakeFiles/qtox.dir/qrc_translations.cpp.o CMakeFiles/qtox.dir/qrc_emojione.cpp.o CMakeFiles/qtox.dir/qrc_smileys.cpp.o CMakeFiles/qtox.dir/src/main.cpp.o CMakeFiles/qtox.dir/qtox_autogen/mocs_compilation.cpp.o  -o qtox libqtox_static.a /usr/lib/arm-linux-gnueabihf/libQt5Network.so.5.11.3 /usr/lib/arm-linux-gnueabihf/libQt5OpenGL.so.5.11.3 /usr/lib/arm-linux-gnueabihf/libQt5Svg.so.5.11.3 /usr/lib/arm-linux-gnueabihf/libQt5Widgets.so.5.11.3 /usr/lib/arm-linux-gnueabihf/libQt5Xml.so.5.11.3 -lavcodec -lavdevice -lavformat -lavutil -lexif -lqrencode -lsodium -lswscale -lsqlcipher -lvpx -lm -ltoxcore -lopenal -lX11 -lXss -lgdk_pixbuf-2.0 -lgobject-2.0 -lglib-2.0 -lglib-2.0 -lgtk-x11-2.0 -lgdk-x11-2.0 -lpangocairo-1.0 -latk-1.0 -lcairo -lgdk_pixbuf-2.0 -lgio-2.0 -lpangoft2-1.0 -lpango-1.0 -lgobject-2.0 -lglib-2.0 -lfontconfig -lfreetype /usr/lib/arm-linux-gnueabihf/libQt5Gui.so.5.11.3 /usr/lib/arm-linux-gnueabihf/libQt5Core.so.5.11.3 -lgdk_pixbuf-2.0 -lgtk-x11-2.0 -lgdk-x11-2.0 -lpangocairo-1.0 -latk-1.0 -lcairo -lgio-2.0 -lpangoft2-1.0 -lpango-1.0 -lfontconfig -lfreetype 
/usr/bin/ld: libqtox_static.a(camerasource.cpp.o): undefined reference to symbol '__atomic_fetch_add_8@@LIBATOMIC_1.0'
/usr/bin/ld: //usr/lib/arm-linux-gnueabihf/libatomic.so.1: error adding symbols: DSO missing from command line
collect2: error: ld returned 1 exit status
make[3]: *** [CMakeFiles/qtox.dir/build.make:3267: qtox] Error 1
make[3]: Leaving directory '/<<PKGBUILDDIR>>/obj-arm-linux-gnueabihf'
make[2]: *** [CMakeFiles/Makefile2:190: CMakeFiles/qtox.dir/all] Error 2
make[2]: Leaving directory '/<<PKGBUILDDIR>>/obj-arm-linux-gnueabihf'
make[1]: *** [Makefile:144: all] Error 2
make[1]: Leaving directory '/<<PKGBUILDDIR>>/obj-arm-linux-gnueabihf'
dh_auto_build: cd obj-arm-linux-gnueabihf && make -j4 "INSTALL=install --strip-program=true" returned exit code 2
make: *** [debian/rules:17: build-arch] Error 2

Tail of log for iem-plugin-suite on armhf:

/usr/bin/ld: /usr/include/c++/8/bits/atomic_base.h:374: undefined reference to `__atomic_store_8'
/usr/bin/ld: build/SimpleDecoder.a(include_juce_audio_formats_15f82001.o): in function `juce::BufferingAudioReader::readSamples(int**, int, int, long long, int)':
/usr/include/c++/8/bits/atomic_base.h:374: undefined reference to `__atomic_store_8'
/usr/bin/ld: build/SimpleDecoder.a(include_juce_audio_formats_15f82001.o): in function `juce::BufferingAudioReader::readNextBufferChunk()':
/usr/include/c++/8/bits/atomic_base.h:396: undefined reference to `__atomic_load_8'
collect2: error: ld returned 1 exit status
make[3]: *** [Makefile:133: build/SimpleDecoder.so] Error 1
make[3]: Leaving directory '/<<PKGBUILDDIR>>/SimpleDecoder/Builds/LinuxMakefile'
make[2]: *** [Makefile:119: SimpleDecoder-LinuxMakefile-build] Error 2
rm SimpleDecoder/Builds/LinuxMakefile/Makefile
make[2]: Leaving directory '/<<PKGBUILDDIR>>'
dh_auto_build: make -j1 "INSTALL=install --strip-program=true" returned exit code 2
make[1]: *** [debian/rules:42: override_dh_auto_build] Error 2
make[1]: Leaving directory '/<<PKGBUILDDIR>>'
make: *** [debian/rules:39: binary-arch] Error 2

Tail of log for cone on armhf:

myserverremoteconfig.C: In member function 'mail::account* myServer::remoteConfig::login2()':
myserverremoteconfig.C:145:11: error: cannot convert 'bool' to 'mail::account*' in return
    return false;
           ^~~~~
make[5]: *** [Makefile:849: myserverremoteconfig.o] Error 1
make[5]: Leaving directory '/<<PKGBUILDDIR>>/cone'
make[4]: *** [Makefile:970: all-recursive] Error 1
make[4]: Leaving directory '/<<PKGBUILDDIR>>/cone'
make[3]: *** [Makefile:617: all] Error 2
make[3]: Leaving directory '/<<PKGBUILDDIR>>/cone'
make[2]: *** [Makefile:370: all-recursive] Error 1
make[2]: Leaving directory '/<<PKGBUILDDIR>>'
make[1]: *** [Makefile:275: all] Error 2
make[1]: Leaving directory '/<<PKGBUILDDIR>>'
make: *** [/usr/share/cdbs/1/class/makefile.mk:77: debian/stamp-makefile-build] Error 2

Tail of log for pyfftw on armhf:

One run: 3.74 ms (versus 11.68 ms for singled threaded)
One run: 4.01 ms (versus 10.45 ms for singled threaded)
One run: 11.12 ms (versus 29.44 ms for numpy.fft)
One run: 11.25 ms (versus 28.59 ms for numpy.fft)
One run: 5.18 ms (versus 28.87 ms for numpy.fft)
One run: 5.16 ms (versus 28.91 ms for numpy.fft)
One run: 11.34 ms (versus 16.75 ms for numpy.fft)
One run: 11.19 ms (versus 16.73 ms for numpy.fft)
One run: 5.38 ms (versus 17.77 ms for numpy.fft)
One run: 5.47 ms (versus 17.65 ms for numpy.fft)
E: pybuild pybuild:341: test: plugin distutils failed with: exit code=1: cd /<<PKGBUILDDIR>>/.pybuild/cpython2_2.7_pyfftw/build; python2.7 -m unittest discover -v 
dh_auto_test: pybuild --test -i python{version} -p 2.7 returned exit code 13
make[1]: *** [debian/rules:36: override_dh_auto_test] Error 1
make[1]: Leaving directory '/<<PKGBUILDDIR>>'
make: *** [debian/rules:15: build-arch] Error 2

Tail of log for valentina on armhf:

PASS   : TST_ValentinaCommandLine::TestOpenCollection(PajamaTopWrap2)
PASS   : TST_ValentinaCommandLine::TestOpenCollection(Keiko_skirt)
PASS   : TST_ValentinaCommandLine::TestOpenCollection(pantalon_base_Eli)
PASS   : TST_ValentinaCommandLine::TestOpenCollection(modell_2)
PASS   : TST_ValentinaCommandLine::TestOpenCollection(IMK_Zhaketa)
PASS   : TST_ValentinaCommandLine::TestOpenCollection(Moulage_0.5_armhole_neckline)
PASS   : TST_ValentinaCommandLine::TestOpenCollection(0.7_Armhole_adjustment_0.10)
PASS   : TST_ValentinaCommandLine::cleanupTestCase()
Totals: 42 passed, 2 failed, 0 skipped, 0 blacklisted, 871802ms
********* Finished testing of TST_ValentinaCommandLine *********
make[2]: *** [Makefile:441: check] Error 2
make[2]: Leaving directory '/<<PKGBUILDDIR>>/src/test/CollectionTest'
make[1]: *** [debian/rules:34: override_dh_auto_test] Error 2
make[1]: Leaving directory '/<<PKGBUILDDIR>>'
make: *** [debian/rules:12: binary-arch] Error 2

Tail of log for rheolef on armhf:

/usr/bin/ld: ../plib/.libs/libfem.a(geo_nearest.o):(.data.rel.ro+0x0): multiple definition of `typeinfo for rheolef::geo_base_rep<double, rheolef::sequential>'; ../plib/.libs/libfem.a(geo.o):(.data.rel.ro+0x0): first defined here
/usr/bin/ld: ../plib/.libs/libfem.a(geo_nearest.o):(.rodata+0x2c): multiple definition of `typeinfo name for rheolef::geo_rep<double, rheolef::sequential>'; ../plib/.libs/libfem.a(geo.o):(.rodata+0x2c): first defined here
/usr/bin/ld: ../plib/.libs/libfem.a(geo_nearest.o):(.data.rel.ro+0xc): multiple definition of `typeinfo for rheolef::geo_rep<double, rheolef::sequential>'; ../plib/.libs/libfem.a(geo.o):(.data.rel.ro+0xc): first defined here
/usr/bin/ld: ../plib/.libs/libfem.a(geo_domain_indirect_seq.o):(.rodata+0x3c): multiple definition of `typeinfo name for rheolef::geo_domain_indirect_rep<double, rheolef::sequential>'; ../plib/.libs/libfem.a(geo_domain_indirect.o):(.rodata+0x0): first defined here
/usr/bin/ld: ../plib/.libs/libfem.a(geo_domain_indirect_seq.o):(.data.rel.ro+0xc): multiple definition of `typeinfo for rheolef::geo_domain_indirect_rep<double, rheolef::sequential>'; ../plib/.libs/libfem.a(geo_domain_indirect.o):(.data.rel.ro+0x0): first defined here
/usr/bin/ld: ../plib/.libs/libfem.a(geo_domain_seq.o):(.rodata+0x0): multiple definition of `typeinfo name for rheolef::geo_rep<double, rheolef::sequential>'; ../plib/.libs/libfem.a(geo.o):(.rodata+0x2c): first defined here
/usr/bin/ld: ../plib/.libs/libfem.a(geo_domain_seq.o):(.data.rel.ro+0x0): multiple definition of `typeinfo for rheolef::geo_rep<double, rheolef::sequential>'; ../plib/.libs/libfem.a(geo.o):(.data.rel.ro+0xc): first defined here
collect2: error: ld returned 1 exit status
make[4]: *** [Makefile:628: librheolef.la] Error 1
make[3]: *** [Makefile:544: all] Error 2
make[2]: *** [Makefile:471: all-recursive] Error 1
make[1]: *** [Makefile:554: all-recursive] Error 1
make[1]: Leaving directory '/<<PKGBUILDDIR>>'
dh_auto_build: make -j1 returned exit code 2
make: *** [debian/rules:30: build-arch] Error 2

Tail of log for colmap on armhf:

/<<PKGBUILDDIR>>/lib/FLANN/algorithms/autotuned_index.h:387:31: note: parameter passing for argument of type 'flann::L2<double>' changed in GCC 7.1
         KMeansIndex<Distance> kmeans(sampledDataset_, cost.params, distance_);
                               ^~~~~~
[ 81%] Linking CXX static library libflann.a
cd /<<PKGBUILDDIR>>/obj-arm-linux-gnueabihf/lib/FLANN && /usr/bin/cmake -P CMakeFiles/flann.dir/cmake_clean_target.cmake
cd /<<PKGBUILDDIR>>/obj-arm-linux-gnueabihf/lib/FLANN && /usr/bin/cmake -E cmake_link_script CMakeFiles/flann.dir/link.txt --verbose=1
/usr/bin/ar qc libflann.a  CMakeFiles/flann.dir/flann.cpp.o CMakeFiles/flann.dir/ext/lz4.c.o CMakeFiles/flann.dir/ext/lz4hc.c.o
/usr/bin/ranlib libflann.a
make[3]: Leaving directory '/<<PKGBUILDDIR>>/obj-arm-linux-gnueabihf'
[ 81%] Built target flann
make[2]: Leaving directory '/<<PKGBUILDDIR>>/obj-arm-linux-gnueabihf'
make[1]: *** [Makefile:133: all] Error 2
make[1]: Leaving directory '/<<PKGBUILDDIR>>/obj-arm-linux-gnueabihf'
dh_auto_build: cd obj-arm-linux-gnueabihf && make -j4 "INSTALL=install --strip-program=true" returned exit code 2
make: *** [debian/rules:28: build-arch] Error 2

Tail of log for gatb-core on armhf:

  ~~~~~~~~~~~~~~~~~~~~~^~~~~~~~~~~~~~~~~~~~~~~~~
[ 86%] Linking CXX static library ../lib/None/libgatbcore.a
cd /<<BUILDDIR>>/gatb-core-1.4.1+git20181225.44d5a44+dfsg/obj-arm-linux-gnueabihf/src && /usr/bin/cmake -P CMakeFiles/gatbcore-static.dir/cmake_clean_target.cmake
cd /<<BUILDDIR>>/gatb-core-1.4.1+git20181225.44d5a44+dfsg/obj-arm-linux-gnueabihf/src && /usr/bin/cmake -E cmake_link_script CMakeFiles/gatbcore-static.dir/link.txt --verbose=1
/usr/bin/ar qc ../lib/None/libgatbcore.a  CMakeFiles/gatbcore-static.dir/gatb/bank/impl/Bank.cpp.o CMakeFiles/gatbcore-static.dir/gatb/bank/impl/BankAlbum.cpp.o CMakeFiles/gatbcore-static.dir/gatb/bank/impl/BankBinary.cpp.o CMakeFiles/gatbcore-static.dir/gatb/bank/impl/BankConverterAlgorithm.cpp.o CMakeFiles/gatbcore-static.dir/gatb/bank/impl/BankFasta.cpp.o CMakeFiles/gatbcore-static.dir/gatb/bank/impl/BankHelpers.cpp.o CMakeFiles/gatbcore-static.dir/gatb/bank/impl/BankRandom.cpp.o CMakeFiles/gatbcore-static.dir/gatb/bank/impl/BankSplitter.cpp.o CMakeFiles/gatbcore-static.dir/gatb/bcalm2/bcalm_algo.cpp.o CMakeFiles/gatbcore-static.dir/gatb/bcalm2/bglue_algo.cpp.o CMakeFiles/gatbcore-static.dir/gatb/bcalm2/logging.cpp.o CMakeFiles/gatbcore-static.dir/gatb/bcalm2/ograph.cpp.o CMakeFiles/gatbcore-static.dir/gatb/debruijn/impl/BranchingAlgorithm.cpp.o CMakeFiles/gatbcore-static.dir/gatb/debruijn/impl/Frontline.cpp.o CMakeFiles/gatbcore-static.dir/gatb/debruijn/impl/Graph.cpp.o CMakeFiles/gatbcore-static.dir/gatb/debruijn/impl/GraphUnitigs.cpp.o CMakeFiles/gatbcore-static.dir/gatb/debruijn/impl/IterativeExtensions.cpp.o CMakeFiles/gatbcore-static.dir/gatb/debruijn/impl/LinkTigs.cpp.o CMakeFiles/gatbcore-static.dir/gatb/debruijn/impl/Simplifications.cpp.o CMakeFiles/gatbcore-static.dir/gatb/debruijn/impl/Terminator.cpp.o CMakeFiles/gatbcore-static.dir/gatb/debruijn/impl/Traversal.cpp.o CMakeFiles/gatbcore-static.dir/gatb/debruijn/impl/UnitigsConstructionAlgorithm.cpp.o CMakeFiles/gatbcore-static.dir/gatb/kmer/impl/BloomAlgorithm.cpp.o CMakeFiles/gatbcore-static.dir/gatb/kmer/impl/BloomBuilder.cpp.o CMakeFiles/gatbcore-static.dir/gatb/kmer/impl/Configuration.cpp.o CMakeFiles/gatbcore-static.dir/gatb/kmer/impl/ConfigurationAlgorithm.cpp.o CMakeFiles/gatbcore-static.dir/gatb/kmer/impl/DebloomAlgorithm.cpp.o CMakeFiles/gatbcore-static.dir/gatb/kmer/impl/DebloomMinimizerAlgorithm.cpp.o CMakeFiles/gatbcore-static.dir/gatb/kmer/impl/LinearCounter.cpp.o CMakeFiles/gatbcore-static.dir/gatb/kmer/impl/MPHFAlgorithm.cpp.o CMakeFiles/gatbcore-static.dir/gatb/kmer/impl/Model.cpp.o CMakeFiles/gatbcore-static.dir/gatb/kmer/impl/ModelData.cpp.o CMakeFiles/gatbcore-static.dir/gatb/kmer/impl/PartiInfo.cpp.o CMakeFiles/gatbcore-static.dir/gatb/kmer/impl/PartitionsCommand.cpp.o CMakeFiles/gatbcore-static.dir/gatb/kmer/impl/RepartitionAlgorithm.cpp.o CMakeFiles/gatbcore-static.dir/gatb/kmer/impl/SortingCountAlgorithm.cpp.o CMakeFiles/gatbcore-static.dir/gatb/system/impl/FileSystemCommon.cpp.o CMakeFiles/gatbcore-static.dir/gatb/system/impl/FileSystemLinux.cpp.o CMakeFiles/gatbcore-static.dir/gatb/system/impl/FileSystemMacos.cpp.o CMakeFiles/gatbcore-static.dir/gatb/system/impl/System.cpp.o CMakeFiles/gatbcore-static.dir/gatb/system/impl/SystemInfoCommon.cpp.o CMakeFiles/gatbcore-static.dir/gatb/system/impl/ThreadLinux.cpp.o CMakeFiles/gatbcore-static.dir/gatb/system/impl/ThreadMacos.cpp.o CMakeFiles/gatbcore-static.dir/gatb/tools/collections/impl/Bloom.cpp.o CMakeFiles/gatbcore-static.dir/gatb/tools/compression/DnaCoder.cpp.o CMakeFiles/gatbcore-static.dir/gatb/tools/compression/HeaderCoder.cpp.o CMakeFiles/gatbcore-static.dir/gatb/tools/compression/Leon.cpp.o CMakeFiles/gatbcore-static.dir/gatb/tools/compression/RangeCoder.cpp.o CMakeFiles/gatbcore-static.dir/gatb/tools/designpattern/impl/Command.cpp.o CMakeFiles/gatbcore-static.dir/gatb/tools/designpattern/impl/Observer.cpp.o CMakeFiles/gatbcore-static.dir/gatb/tools/misc/api/Data.cpp.o CMakeFiles/gatbcore-static.dir/gatb/tools/misc/impl/Algorithm.cpp.o CMakeFiles/gatbcore-static.dir/gatb/tools/misc/impl/Histogram.cpp.o CMakeFiles/gatbcore-static.dir/gatb/tools/misc/impl/OptionsParser.cpp.o CMakeFiles/gatbcore-static.dir/gatb/tools/misc/impl/Progress.cpp.o CMakeFiles/gatbcore-static.dir/gatb/tools/misc/impl/Property.cpp.o CMakeFiles/gatbcore-static.dir/gatb/tools/misc/impl/TimeInfo.cpp.o CMakeFiles/gatbcore-static.dir/gatb/tools/misc/impl/Tokenizer.cpp.o CMakeFiles/gatbcore-static.dir/gatb/tools/misc/impl/Tool.cpp.o CMakeFiles/gatbcore-static.dir/gatb/tools/misc/impl/XmlReader.cpp.o CMakeFiles/gatbcore-static.dir/gatb/tools/storage/impl/Storage.cpp.o CMakeFiles/gatbcore-static.dir/gatb/tools/storage/impl/StorageTools.cpp.o CMakeFiles/gatbcore-static.dir/gatb/template/TemplateSpecialization1.cpp.in_128.cpp.o CMakeFiles/gatbcore-static.dir/gatb/template/TemplateSpecialization1.cpp.in_32.cpp.o CMakeFiles/gatbcore-static.dir/gatb/template/TemplateSpecialization1.cpp.in_64.cpp.o CMakeFiles/gatbcore-static.dir/gatb/template/TemplateSpecialization1.cpp.in_96.cpp.o CMakeFiles/gatbcore-static.dir/gatb/template/TemplateSpecialization10.cpp.in_128.cpp.o CMakeFiles/gatbcore-static.dir/gatb/template/TemplateSpecialization10.cpp.in_32.cpp.o CMakeFiles/gatbcore-static.dir/gatb/template/TemplateSpecialization10.cpp.in_64.cpp.o CMakeFiles/gatbcore-static.dir/gatb/template/TemplateSpecialization10.cpp.in_96.cpp.o CMakeFiles/gatbcore-static.dir/gatb/template/TemplateSpecialization2.cpp.in_128.cpp.o CMakeFiles/gatbcore-static.dir/gatb/template/TemplateSpecialization2.cpp.in_32.cpp.o CMakeFiles/gatbcore-static.dir/gatb/template/TemplateSpecialization2.cpp.in_64.cpp.o CMakeFiles/gatbcore-static.dir/gatb/template/TemplateSpecialization2.cpp.in_96.cpp.o CMakeFiles/gatbcore-static.dir/gatb/template/TemplateSpecialization3.cpp.in_128.cpp.o CMakeFiles/gatbcore-static.dir/gatb/template/TemplateSpecialization3.cpp.in_32.cpp.o CMakeFiles/gatbcore-static.dir/gatb/template/TemplateSpecialization3.cpp.in_64.cpp.o CMakeFiles/gatbcore-static.dir/gatb/template/TemplateSpecialization3.cpp.in_96.cpp.o CMakeFiles/gatbcore-static.dir/gatb/template/TemplateSpecialization4.cpp.in_128.cpp.o CMakeFiles/gatbcore-static.dir/gatb/template/TemplateSpecialization4.cpp.in_32.cpp.o CMakeFiles/gatbcore-static.dir/gatb/template/TemplateSpecialization4.cpp.in_64.cpp.o CMakeFiles/gatbcore-static.dir/gatb/template/TemplateSpecialization4.cpp.in_96.cpp.o CMakeFiles/gatbcore-static.dir/gatb/template/TemplateSpecialization5.cpp.in_128.cpp.o CMakeFiles/gatbcore-static.dir/gatb/template/TemplateSpecialization5.cpp.in_32.cpp.o CMakeFiles/gatbcore-static.dir/gatb/template/TemplateSpecialization5.cpp.in_64.cpp.o CMakeFiles/gatbcore-static.dir/gatb/template/TemplateSpecialization5.cpp.in_96.cpp.o CMakeFiles/gatbcore-static.dir/gatb/template/TemplateSpecialization6.cpp.in_128.cpp.o CMakeFiles/gatbcore-static.dir/gatb/template/TemplateSpecialization6.cpp.in_32.cpp.o CMakeFiles/gatbcore-static.dir/gatb/template/TemplateSpecialization6.cpp.in_64.cpp.o CMakeFiles/gatbcore-static.dir/gatb/template/TemplateSpecialization6.cpp.in_96.cpp.o CMakeFiles/gatbcore-static.dir/gatb/template/TemplateSpecialization7.cpp.in_128.cpp.o CMakeFiles/gatbcore-static.dir/gatb/template/TemplateSpecialization7.cpp.in_32.cpp.o CMakeFiles/gatbcore-static.dir/gatb/template/TemplateSpecialization7.cpp.in_64.cpp.o CMakeFiles/gatbcore-static.dir/gatb/template/TemplateSpecialization7.cpp.in_96.cpp.o CMakeFiles/gatbcore-static.dir/gatb/template/TemplateSpecialization8.cpp.in_128.cpp.o CMakeFiles/gatbcore-static.dir/gatb/template/TemplateSpecialization8.cpp.in_32.cpp.o CMakeFiles/gatbcore-static.dir/gatb/template/TemplateSpecialization8.cpp.in_64.cpp.o CMakeFiles/gatbcore-static.dir/gatb/template/TemplateSpecialization8.cpp.in_96.cpp.o CMakeFiles/gatbcore-static.dir/gatb/template/TemplateSpecialization9.cpp.in_128.cpp.o CMakeFiles/gatbcore-static.dir/gatb/template/TemplateSpecialization9.cpp.in_32.cpp.o CMakeFiles/gatbcore-static.dir/gatb/template/TemplateSpecialization9.cpp.in_64.cpp.o CMakeFiles/gatbcore-static.dir/gatb/template/TemplateSpecialization9.cpp.in_96.cpp.o
/usr/bin/ranlib ../lib/None/libgatbcore.a
make[4]: Leaving directory '/<<BUILDDIR>>/gatb-core-1.4.1+git20181225.44d5a44+dfsg/obj-arm-linux-gnueabihf'
[ 86%] Built target gatbcore-static
make[3]: Leaving directory '/<<BUILDDIR>>/gatb-core-1.4.1+git20181225.44d5a44+dfsg/obj-arm-linux-gnueabihf'
make[2]: *** [Makefile:155: all] Error 2
make[2]: Leaving directory '/<<BUILDDIR>>/gatb-core-1.4.1+git20181225.44d5a44+dfsg/obj-arm-linux-gnueabihf'
dh_auto_build: cd obj-arm-linux-gnueabihf && make -j4 "INSTALL=install --strip-program=true" returned exit code 2
make[1]: *** [debian/rules:13: override_dh_auto_build-arch] Error 2
make[1]: Leaving directory '/<<BUILDDIR>>/gatb-core-1.4.1+git20181225.44d5a44+dfsg'
make: *** [debian/rules:10: build-arch] Error 2

Tail of log for agda on armhf:

[156 of 338] Compiling Agda.Compiler.Treeless.Uncase ( src/full/Agda/Compiler/Treeless/Uncase.hs, dist-ghc/build/Agda/Compiler/Treeless/Uncase.o )
[157 of 338] Compiling Agda.Compiler.Treeless.AsPatterns ( src/full/Agda/Compiler/Treeless/AsPatterns.hs, dist-ghc/build/Agda/Compiler/Treeless/AsPatterns.o )
[158 of 338] Compiling Agda.TypeChecking.Serialise.Base ( src/full/Agda/TypeChecking/Serialise/Base.hs, dist-ghc/build/Agda/TypeChecking/Serialise/Base.o )
ghc: panic! (the 'impossible' happened)
  (GHC version 8.4.4 for arm-unknown-linux):
	tyThingCoAxiom
  Identifier ‘fromDescListWithKey’
  Call stack:
      CallStack (from HasCallStack):
        callStackDoc, called at compiler/utils/Outputable.hs:1150:37 in ghc:Outputable
        pprPanic, called at compiler/main/HscTypes.hs:2153:32 in ghc:HscTypes

Please report this as a GHC bug:  http://www.haskell.org/ghc/reportabug

make: *** [/usr/share/cdbs/1/class/hlibrary.mk:147: build-ghc-stamp] Error 1

Tail of log for flang on armhf:

make[3]: Leaving directory '/<<PKGBUILDDIR>>/debian/build/runtime/libpgmath'
Install the project...
-- Install configuration: ""
-- Installing: /<<PKGBUILDDIR>>/debian/tmp/usr/lib/libpgmath.so.0d
-- Installing: /<<PKGBUILDDIR>>/debian/tmp/usr/lib/libpgmath.so
-- Installing: /<<PKGBUILDDIR>>/debian/tmp/usr/lib/libpgmath.a
make[2]: Leaving directory '/<<PKGBUILDDIR>>/debian/build/runtime/libpgmath'
# Do in install scripts; fails within pdebuild, why ?
( cd debian/build/stage2 && make VERBOSE=1 install DESTDIR=/<<PKGBUILDDIR>>/debian/tmp )
make[2]: Entering directory '/<<PKGBUILDDIR>>/debian/build/stage2'
make[2]: *** No rule to make target 'install'.  Stop.
make[2]: Leaving directory '/<<PKGBUILDDIR>>/debian/build/stage2'
make[1]: *** [debian/rules:66: override_dh_auto_install] Error 2
make[1]: Leaving directory '/<<PKGBUILDDIR>>'
make: *** [debian/rules:14: binary-arch] Error 2

Tail of log for chromium-browser on armhf:

                 from ../../third_party/blink/renderer/platform/heap/heap_allocator.h:12,
                 from ../../third_party/blink/renderer/platform/heap/handle.h:35,
                 from ../../third_party/blink/renderer/platform/bindings/script_state.h:13,
                 from ../../third_party/blink/renderer/bindings/core/v8/script_value.h:37,
                 from ../../third_party/blink/renderer/bindings/core/v8/script_promise.h:35,
                 from ../../third_party/blink/renderer/core/fullscreen/document_fullscreen.h:29,
                 from ./../../third_party/blink/renderer/core/fullscreen/document_fullscreen.cc:26,
                 from gen/third_party/blink/renderer/core/fullscreen/fullscreen_jumbo_1.cc:5:
../../third_party/blink/renderer/platform/heap/member.h:204:7: note: 'class blink::Member<blink::SVGTransform>' declared here
 class Member : public MemberBase<T, TracenessMemberConfiguration::kTraced> {
       ^~~~~~
ninja: build stopped: subcommand failed.
make[1]: *** [debian/rules:139: override_dh_auto_build-arch] Error 1
make[1]: Leaving directory '/<<PKGBUILDDIR>>'
make: *** [debian/rules:120: binary-arch] Error 2