Raspbian Package Auto-Building

Buildd status for selected packages (bullseye-staging)

Bugs

Package(s): Suite:
Compact mode Co-maintainers

Package armhf
Buildd exposure stats
✔ bagelBuild-Attempted
✔ highwayhashBuild-Attempted
✔ ismrmrdBuild-Attempted
✔ appstream-generatorBuild-Attempted
✔ libundeadBuild-Attempted
✔ libseqlibBuild-Attempted
✔ pbseqlibBuild-Attempted
✔ python-skbioBuild-Attempted
✔ reprozipnot in w-b
✔ poclBuild-Attempted
✔ spadesBuild-Attempted
✔ gfccoreBuild-Attempted
✔ libibcmBuild-Attempted
✔ libqglviewerBuild-Attempted
✔ acoveaBuild-Attempted
✔ mingw32-binutilsBuild-Attempted
✔ apfBuild-Attempted
✔ asterisk-chan-capiBuild-Attempted
✔ audacious-analog-vumeter-pluginBuild-Attempted
Package armhf
Buildd exposure stats
✔ autofs5Build-Attempted
✔ bbhashBuild-Attempted
✔ blastemBuild-Attempted
✔ bustoolsBuild-Attempted
✔ criuBuild-Attempted
✔ consul-migrateBuild-Attempted
✔ debimanBuild-Attempted
✔ cclsBuild-Attempted
✔ fairy-stockfishBuild-Attempted
✔ dengBuild-Attempted
✔ ezquakeBuild-Attempted
✔ fuse-umfuse-iso9660Build-Attempted
✔ febootstrapBuild-Attempted
✔ dballeBuild-Attempted
✔ ioappsBuild-Attempted
✔ ibamBuild-Attempted
✔ haskell-type-levelBuild-Attempted
✔ ivarBuild-Attempted
✔ kafs-clientBuild-Attempted
✔ jocamlBuild-Attempted
Package armhf
Buildd exposure stats
✔ lastzInstalled
✔ kleborateBuild-Attempted
✔ libbiodBuild-Attempted
✔ gammapyBuild-Attempted
✔ leela-zeroBuild-Attempted
✔ lib3mfBuild-Attempted
✔ haskell-ghc-lib-parserBuild-Attempted
✔ libmath-int128-perlBuild-Attempted
✔ libmlx5Build-Attempted
✔ libnunc-stansBuild-Attempted
✔ libtangoBuild-Attempted
✔ libretro-mupen64plusBuild-Attempted
✔ libxsmmBuild-Attempted
✔ libmaus2Build-Attempted
✔ libsis-jhdf5-javaBuild-Attempted
✔ mensisBuild-Attempted
✔ mesBuild-Attempted
✔ listallerBuild-Attempted
✔ micropythonBuild-Attempted
✔ msrtoolBuild-Attempted
Package armhf
Buildd exposure stats
✔ ngmlrBuild-Attempted
✔ metabatBuild-Attempted
✔ nsd3Build-Attempted
✔ open-axiomBuild-Attempted
✔ oliveBuild-Attempted
✔ neuronBuild-Attempted
✔ osrmBuild-Attempted
✔ percona-xtradb-cluster-galera-2.xBuild-Attempted
✔ plink2Build-Attempted
✔ openmmBuild-Attempted
✔ octave-tiseanBuild-Attempted
✔ prboomBuild-Attempted
✔ py-sendfileBuild-Attempted
✔ python-nclsInstalled
✔ python-parasailBuild-Attempted
✔ python-peachpyBuild-Attempted
✔ prometheus-libvirt-exporterBuild-Attempted
✔ photoflowBuild-Attempted
✔ projectmBuild-Attempted
✔ qwertoneBuild-Attempted
Package armhf
Buildd exposure stats
✔ qtjsbackend-opensource-srcBuild-Attempted
✔ r-bioc-rsubreadBuild-Attempted
✔ qwinffBuild-Attempted
✔ r-bioc-dada2not in w-b
✔ rpm2htmlBuild-Attempted
✔ rust-kvm-ioctlsBuild-Attempted
✔ rust-generatorBuild-Attempted
✔ rust-mach-o-sysBuild-Attempted
✔ ruby2.1Build-Attempted
✔ rust-mysqlclient-sysBuild-Attempted
✔ rust-servo-freetype-sysBuild-Attempted
✔ rust-pq-sysBuild-Attempted
✔ scanbuttondBuild-Attempted
✔ scrappieBuild-Attempted
✔ rust-ucd-generateBuild-Attempted
✔ slang-slirpBuild-Attempted
✔ tarantoolBuild-Attempted
✔ traildbBuild-Attempted
✔ tlsdateBuild-Attempted
✔ wmmailBuild-Attempted
Package armhf
Buildd exposure stats
✔ xf86-video-msmBuild-Attempted
✔ tendermintBuild-Attempted
✔ siconosBuild-Attempted
✔ vtBuild-Attempted
✔ coneBuild-Attempted
✔ valentinaBuild-Attempted
✔ gle-graphicsBuild-Attempted
✔ iem-plugin-suiteBuild-Attempted
✔ gatb-coreBuild-Attempted
✔ pyfftwBuild-Attempted
✔ kodiBuild-Attempted
✔ openmsBuild-Attempted
✔ jellyfishBuild-Attempted
✔ paraviewBuild-Attempted
✔ haskell-protobufBuild-Attempted
✔ haskell-genvalidity-containersInstalled
✔ openstructureBuild-Attempted
✔ haskell-pretty-simpleBuild-Attempted
✔ haskell-gi-pangoBuild-Attempted
✔ librandomxBuild-Attempted
Package armhf
Buildd exposure stats
✔ vmemcacheBuild-Attempted
✔ mariadb-connector-odbcBuild-Attempted
✔ haskell-xml-html-qqBuild-Attempted
✔ perftestBuild-Attempted
✔ ocamlgslBuild-Attempted
✔ glooBuild-Attempted
✔ nixBuild-Attempted
✔ qtwebengine-opensource-srcBuild-Attempted
✔ restinioBuild-Attempted
✔ icinga2Build-Attempted
✔ megahitBuild-Attempted
✔ badgerBuild-Attempted
✔ garagemqBuild-Attempted
✔ golang-1.15Installed

Tail of log for bagel on armhf:

mpi_interface.cc:267:32: error: static assertion failed: size_t is assumed to be the same size as unsigned long long
  267 |   static_assert(sizeof(size_t) == sizeof(unsigned long long), "size_t is assumed to be the same size as unsigned long long");
      |                 ~~~~~~~~~~~~~~~^~~~~~~~~~~~~~~~~~~~~~~~~~~~~
make[5]: *** [Makefile:408: mpi_interface.lo] Error 1
make[5]: Leaving directory '/<<PKGBUILDDIR>>/src/util/parallel'
make[4]: *** [Makefile:462: all-recursive] Error 1
make[4]: Leaving directory '/<<PKGBUILDDIR>>/src/util'
make[3]: *** [Makefile:625: all-recursive] Error 1
make[3]: Leaving directory '/<<PKGBUILDDIR>>/src'
make[2]: *** [Makefile:422: all-recursive] Error 1
make[2]: Leaving directory '/<<PKGBUILDDIR>>'
make[1]: *** [Makefile:354: all] Error 2
make[1]: Leaving directory '/<<PKGBUILDDIR>>'
dh_auto_build: error: make -j1 returned exit code 2
make: *** [debian/rules:12: build-arch] Error 25

Tail of log for highwayhash on armhf:

  424 |     zone->num_calls = (biased_offset << Accumulator::kNumCallBits) + num_calls;
      |                        ~~~~~~~~~~~~~~^~~~~~~~~~~~~~~~~~~~~~~~~~~~
./highwayhash/profiler.h: In member function 'void highwayhash::Results::MergeDuplicates()':
./highwayhash/profiler.h:458:26: warning: left shift count >= width of type [-Wshift-count-overflow]
  458 |           (biased_offset << Accumulator::kNumCallBits) + num_calls;
      |            ~~~~~~~~~~~~~~^~~~~~~~~~~~~~~~~~~~~~~~~~~~
g++ -c -Wdate-time -D_FORTIFY_SOURCE=2 -I. -g -O2 -fdebug-prefix-map=/<<PKGBUILDDIR>>=. -fstack-protector-strong -Wformat -Werror=format-security -std=c++11 -Wall -O3 -fPIC -pthread highwayhash/vector_test.cc -o obj/vector_test.o
g++ -c -Wdate-time -D_FORTIFY_SOURCE=2 -I. -g -O2 -fdebug-prefix-map=/<<PKGBUILDDIR>>=. -fstack-protector-strong -Wformat -Werror=format-security -std=c++11 -Wall -O3 -fPIC -pthread highwayhash/vector_test_portable.cc -o obj/vector_test_portable.o
g++ -c -Wdate-time -D_FORTIFY_SOURCE=2 -I. -g -O2 -fdebug-prefix-map=/<<PKGBUILDDIR>>=. -fstack-protector-strong -Wformat -Werror=format-security -std=c++11 -Wall -O3 -fPIC -pthread -mavx2 highwayhash/vector_test_avx2.cc -o obj/vector_test_avx2.o
g++: error: unrecognized command-line option '-mavx2'
make[1]: *** [Makefile:61: obj/vector_test_avx2.o] Error 1
make[1]: *** Waiting for unfinished jobs....
make[1]: Leaving directory '/<<PKGBUILDDIR>>'
dh_auto_build: error: make -j4 "INSTALL=install --strip-program=true" returned exit code 2
make: *** [debian/rules:16: binary-arch] Error 25

Tail of log for ismrmrd on armhf:

/<<PKGBUILDDIR>>/tests/test_acquisitions.cpp(7): Leaving test suite "AcquisitionsTest"
Test is aborted
Leaving test module "ISMRMRD Unit Tests"

*** 1 failure is detected in the test module "ISMRMRD Unit Tests"
make[4]: *** [tests/CMakeFiles/check.dir/build.make:60: tests/CMakeFiles/check] Error 201
make[4]: Leaving directory '/<<PKGBUILDDIR>>/obj-arm-linux-gnueabihf'
make[3]: *** [CMakeFiles/Makefile2:387: tests/CMakeFiles/check.dir/all] Error 2
make[3]: Leaving directory '/<<PKGBUILDDIR>>/obj-arm-linux-gnueabihf'
make[2]: *** [CMakeFiles/Makefile2:394: tests/CMakeFiles/check.dir/rule] Error 2
make[2]: Leaving directory '/<<PKGBUILDDIR>>/obj-arm-linux-gnueabihf'
make[1]: *** [Makefile:293: check] Error 2
make[1]: Leaving directory '/<<PKGBUILDDIR>>/obj-arm-linux-gnueabihf'
dh_auto_test: error: cd obj-arm-linux-gnueabihf && make -j4 check ARGS\+=-j4 returned exit code 2
make: *** [debian/rules:14: build-arch] Error 25

Tail of log for appstream-generator on armhf:

../src/asgen/config.d:579:84: error: undefined identifier ‘JSONType’
  579 |                             feature.processLocale = featuresObj[featureId].type == JSONType.true_;
      |                                                                                    ^
../src/asgen/config.d:582:87: error: undefined identifier ‘JSONType’
  582 |                             feature.screenshotVideos = featuresObj[featureId].type == JSONType.true_;
      |                                                                                       ^
../src/asgen/config.d:585:97: error: undefined identifier ‘JSONType’
  585 |                             feature.propagateMetainfoArtifacts = featuresObj[featureId].type == JSONType.true_;
      |                                                                                                 ^
[45/157] gdc -Isrc/asgen/55ff84b@@appstream-generator@exe -Isrc/asgen -I../src/asgen -Isrc -I../src -Igirepo -I../girepo -I/usr/include/d/glibd-2 -I/usr/include/libmount -I/usr/include/blkid -I/usr/include/glib-2.0 -I/usr/lib/arm-linux-gnueabihf/glib-2.0/include -I/usr/include/appstream -I/usr/include/libsoup-2.4 -I/usr/include/libxml2 -I/usr/include/cairo -I/usr/include/pixman-1 -I/usr/include/uuid -I/usr/include/freetype2 -I/usr/include/libpng16 -I/usr/include/gdk-pixbuf-2.0 -I/usr/include/librsvg-2.0 -I/usr/include/pango-1.0 -I/usr/include/fribidi -I/usr/include/harfbuzz -g -O2 -fdebug-prefix-map=/<<PKGBUILDDIR>>=. -fstack-protector-strong -frelease -pthread -J../src/asgen/../../data -MD -MQ 'src/asgen/55ff84b@@appstream-generator@exe/.._app.d.o' -MF 'src/asgen/55ff84b@@appstream-generator@exe/.._app.d.o.deps' -o 'src/asgen/55ff84b@@appstream-generator@exe/.._app.d.o' -c ../src/app.d
[46/157] gdc -Isrc/asgen/55ff84b@@appstream-generator@exe -Isrc/asgen -I../src/asgen -Isrc -I../src -Igirepo -I../girepo -I/usr/include/d/glibd-2 -I/usr/include/libmount -I/usr/include/blkid -I/usr/include/glib-2.0 -I/usr/lib/arm-linux-gnueabihf/glib-2.0/include -I/usr/include/appstream -I/usr/include/libsoup-2.4 -I/usr/include/libxml2 -I/usr/include/cairo -I/usr/include/pixman-1 -I/usr/include/uuid -I/usr/include/freetype2 -I/usr/include/libpng16 -I/usr/include/gdk-pixbuf-2.0 -I/usr/include/librsvg-2.0 -I/usr/include/pango-1.0 -I/usr/include/fribidi -I/usr/include/harfbuzz -g -O2 -fdebug-prefix-map=/<<PKGBUILDDIR>>=. -fstack-protector-strong -frelease -pthread -J../src/asgen/../../data -MD -MQ 'src/asgen/55ff84b@@appstream-generator@exe/datainjectpkg.d.o' -MF 'src/asgen/55ff84b@@appstream-generator@exe/datainjectpkg.d.o.deps' -o 'src/asgen/55ff84b@@appstream-generator@exe/datainjectpkg.d.o' -c ../src/asgen/datainjectpkg.d
[47/157] gdc -Isrc/asgen/55ff84b@@appstream-generator@exe -Isrc/asgen -I../src/asgen -Isrc -I../src -Igirepo -I../girepo -I/usr/include/d/glibd-2 -I/usr/include/libmount -I/usr/include/blkid -I/usr/include/glib-2.0 -I/usr/lib/arm-linux-gnueabihf/glib-2.0/include -I/usr/include/appstream -I/usr/include/libsoup-2.4 -I/usr/include/libxml2 -I/usr/include/cairo -I/usr/include/pixman-1 -I/usr/include/uuid -I/usr/include/freetype2 -I/usr/include/libpng16 -I/usr/include/gdk-pixbuf-2.0 -I/usr/include/librsvg-2.0 -I/usr/include/pango-1.0 -I/usr/include/fribidi -I/usr/include/harfbuzz -g -O2 -fdebug-prefix-map=/<<PKGBUILDDIR>>=. -fstack-protector-strong -frelease -pthread -J../src/asgen/../../data -MD -MQ 'src/asgen/55ff84b@@appstream-generator@exe/contentsstore.d.o' -MF 'src/asgen/55ff84b@@appstream-generator@exe/contentsstore.d.o.deps' -o 'src/asgen/55ff84b@@appstream-generator@exe/contentsstore.d.o' -c ../src/asgen/contentsstore.d
ninja: build stopped: subcommand failed.
dh_auto_build: error: cd obj-arm-linux-gnueabihf && LC_ALL=C.UTF-8 ninja -j4 -v returned exit code 1
make: *** [debian/rules:18: binary-arch] Error 25

Tail of log for libundead on armhf:

/<<PKGBUILDDIR>>/src/undead/stream.d:1222:16: error: generic thunk code fails for method ‘_DT12_D6undead6stream6Stream6writefMFYC6undead6stream12OutputStream’ which uses ‘...’
 1222 |   OutputStream writef(...) {
      |                ^
/<<PKGBUILDDIR>>/src/undead/stream.d:1207:10: error: generic thunk code fails for method ‘_DT12_D6undead6stream6Stream6printfMFAxaYk’ which uses ‘...’
 1207 |   size_t printf(const(char)[] format, ...) {
      |          ^
/<<PKGBUILDDIR>>/src/undead/stream.d:1069:7: error: generic thunk code fails for method ‘_DT8_D6undead6stream6Stream5readfMFYi’ which uses ‘...’
 1069 |   int readf(...) {
      |       ^
[3/29] gdc -Iundead@sha -I. -I.. -I../src -g -O2 -fdebug-prefix-map=/<<PKGBUILDDIR>>=. -fstack-protector-strong -frelease -fPIC -MD -MQ 'undead@sha/src_undead_bitarray.d.o' -MF 'undead@sha/src_undead_bitarray.d.o.deps' -o 'undead@sha/src_undead_bitarray.d.o' -c ../src/undead/bitarray.d
[4/29] gdc -Iundead@sha -I. -I.. -I../src -g -O2 -fdebug-prefix-map=/<<PKGBUILDDIR>>=. -fstack-protector-strong -frelease -fPIC -MD -MQ 'undead@sha/src_undead_dateparse.d.o' -MF 'undead@sha/src_undead_dateparse.d.o.deps' -o 'undead@sha/src_undead_dateparse.d.o' -c ../src/undead/dateparse.d
[5/29] gdc -Iundead@sha -I. -I.. -I../src -g -O2 -fdebug-prefix-map=/<<PKGBUILDDIR>>=. -fstack-protector-strong -frelease -fPIC -MD -MQ 'undead@sha/src_undead_date.d.o' -MF 'undead@sha/src_undead_date.d.o.deps' -o 'undead@sha/src_undead_date.d.o' -c ../src/undead/date.d
ninja: build stopped: subcommand failed.
dh_auto_build: error: cd obj-arm-linux-gnueabihf && LC_ALL=C.UTF-8 ninja -j4 -v returned exit code 1
make: *** [debian/rules:9: build-arch] Error 25

Tail of log for libseqlib on armhf:

+#MISSING: 1.1.2+dfsg-6# (subst|arch=!armel !riscv64)_ZTVSt15_Sp_counted_ptrIPSt13unordered_mapIiN6SeqLib13TIntervalTreeIi{size_t}EESt4hashIiESt8equal_toIiESaISt4pairIKiS3_EEELN9__gnu_cxx12_Lock_policyE2EE@Base 1.1.2
+ _ZTVSt15_Sp_counted_ptrIPSt6vectorIN6SeqLib13GenomicRegionESaIS2_EELN9__gnu_cxx12_Lock_policyE1EE@Base 1.1.2
+#MISSING: 1.1.2+dfsg-6# (arch=!armel !riscv64)_ZTVSt15_Sp_counted_ptrIPSt6vectorIN6SeqLib13GenomicRegionESaIS2_EELN9__gnu_cxx12_Lock_policyE2EE@Base 1.1.2
+ _ZTVSt19_Sp_counted_deleterIP11__hts_idx_t10idx_deleteSaIvELN9__gnu_cxx12_Lock_policyE1EE@Base 1.1.2
+#MISSING: 1.1.2+dfsg-6# (arch=!armel !riscv64)_ZTVSt19_Sp_counted_deleterIP11__hts_idx_t10idx_deleteSaIvELN9__gnu_cxx12_Lock_policyE2EE@Base 1.1.2
+ _ZTVSt19_Sp_counted_deleterIP6bam1_tN6SeqLib11free_deleteESaIvELN9__gnu_cxx12_Lock_policyE1EE@Base 1.1.2
+#MISSING: 1.1.2+dfsg-6# (arch=!armel !riscv64)_ZTVSt19_Sp_counted_deleterIP6bam1_tN6SeqLib11free_deleteESaIvELN9__gnu_cxx12_Lock_policyE2EE@Base 1.1.2
+ _ZTVSt19_Sp_counted_deleterIP7htsFile14htsFile_deleteSaIvELN9__gnu_cxx12_Lock_policyE1EE@Base 1.1.2
+#MISSING: 1.1.2+dfsg-6# (arch=!armel !riscv64)_ZTVSt19_Sp_counted_deleterIP7htsFile14htsFile_deleteSaIvELN9__gnu_cxx12_Lock_policyE2EE@Base 1.1.2
+ _ZTVSt19_Sp_counted_deleterIP9hts_itr_t14hts_itr_deleteSaIvELN9__gnu_cxx12_Lock_policyE1EE@Base 1.1.2
+#MISSING: 1.1.2+dfsg-6# (arch=!armel !riscv64)_ZTVSt19_Sp_counted_deleterIP9hts_itr_t14hts_itr_deleteSaIvELN9__gnu_cxx12_Lock_policyE2EE@Base 1.1.2
+ _ZTVSt19_Sp_counted_deleterIP9sam_hdr_t14bam_hdr_deleteSaIvELN9__gnu_cxx12_Lock_policyE1EE@Base 1.1.2
+#MISSING: 1.1.2+dfsg-6# (arch=!armel !riscv64)_ZTVSt19_Sp_counted_deleterIP9sam_hdr_t14bam_hdr_deleteSaIvELN9__gnu_cxx12_Lock_policyE2EE@Base 1.1.2
dh_makeshlibs: error: failing due to earlier errors
make: *** [debian/rules:10: binary-arch] Error 25

Tail of log for pbseqlib on armhf:

                 from ../alignment/algorithms/anchoring/BWTSearch.hpp:6,
                 from ../alignment/algorithms/anchoring/BWTSearch.cpp:1:
../alignment/suffixarray/SuffixArray.hpp: In member function ‘void SuffixArray<T, Sigma, Compare, Tuple>::LarssonBuildSuffixArray(T*, SAIndexLength, Sigma&)’:
../alignment/suffixarray/SuffixArray.hpp:288:44: error: narrowing conversion of ‘4294967295’ from ‘unsigned int’ to ‘long int’ [-Wnarrowing]
  288 |         LarssonSuffixSort<SAIndex, UINT_MAX> sorter;
      |                                            ^
../alignment/suffixarray/SuffixArray.hpp:289:84: error: ‘sorter’ cannot be used as a function
  289 |         sorter(index, p, ((SAIndex)targetLength), ((SAIndex)maxVal + 1), (SAIndex)1);
      |                                                                                    ^
[44/186] c++ -Iblasr@sha -I. -I.. -I/usr/include -I/usr/include/hdf5/serial -fdiagnostics-color=always -pipe -D_FILE_OFFSET_BITS=64 -std=c++11 -g -O2 -fdebug-prefix-map=/<<BUILDDIR>>/pbseqlib-5.3.3+dfsg=. -fstack-protector-strong -Wformat -Werror=format-security -O3 -std=c++14 -Wdate-time -D_FORTIFY_SOURCE=2 -DHAVE_HDF5_1_10_1 -O3 -fPIC -DBOOST_ALL_NO_LIB -Wno-delete-non-virtual-dtor -Wno-unused-variable -Wno-non-virtual-dtor -MD -MQ 'blasr@sha/alignment_algorithms_anchoring_FindMaxInterval.cpp.o' -MF 'blasr@sha/alignment_algorithms_anchoring_FindMaxInterval.cpp.o.d' -o 'blasr@sha/alignment_algorithms_anchoring_FindMaxInterval.cpp.o' -c ../alignment/algorithms/anchoring/FindMaxInterval.cpp
[45/186] c++ -Iblasr@sha -I. -I.. -I/usr/include -I/usr/include/hdf5/serial -fdiagnostics-color=always -pipe -D_FILE_OFFSET_BITS=64 -std=c++11 -g -O2 -fdebug-prefix-map=/<<BUILDDIR>>/pbseqlib-5.3.3+dfsg=. -fstack-protector-strong -Wformat -Werror=format-security -O3 -std=c++14 -Wdate-time -D_FORTIFY_SOURCE=2 -DHAVE_HDF5_1_10_1 -O3 -fPIC -DBOOST_ALL_NO_LIB -Wno-delete-non-virtual-dtor -Wno-unused-variable -Wno-non-virtual-dtor -MD -MQ 'blasr@sha/alignment_algorithms_sorting_MultikeyQuicksort.cpp.o' -MF 'blasr@sha/alignment_algorithms_sorting_MultikeyQuicksort.cpp.o.d' -o 'blasr@sha/alignment_algorithms_sorting_MultikeyQuicksort.cpp.o' -c ../alignment/algorithms/sorting/MultikeyQuicksort.cpp
[46/186] c++ -Iblasr@sha -I. -I.. -I/usr/include -I/usr/include/hdf5/serial -fdiagnostics-color=always -pipe -D_FILE_OFFSET_BITS=64 -std=c++11 -g -O2 -fdebug-prefix-map=/<<BUILDDIR>>/pbseqlib-5.3.3+dfsg=. -fstack-protector-strong -Wformat -Werror=format-security -O3 -std=c++14 -Wdate-time -D_FORTIFY_SOURCE=2 -DHAVE_HDF5_1_10_1 -O3 -fPIC -DBOOST_ALL_NO_LIB -Wno-delete-non-virtual-dtor -Wno-unused-variable -Wno-non-virtual-dtor -MD -MQ 'blasr@sha/alignment_algorithms_sorting_LightweightSuffixArray.cpp.o' -MF 'blasr@sha/alignment_algorithms_sorting_LightweightSuffixArray.cpp.o.d' -o 'blasr@sha/alignment_algorithms_sorting_LightweightSuffixArray.cpp.o' -c ../alignment/algorithms/sorting/LightweightSuffixArray.cpp
ninja: build stopped: subcommand failed.
dh_auto_build: error: cd obj-arm-linux-gnueabihf && LC_ALL=C.UTF-8 ninja -j4 -v returned exit code 1
make: *** [debian/rules:25: build-arch] Error 25

Tail of log for python-skbio on armhf:

.pybuild/cpython3_3.8_skbio/build/skbio/util/tests/test_decorator.py::TestDeprecated::test_function_output
  /<<PKGBUILDDIR>>/.pybuild/cpython3_3.8_skbio/build/skbio/util/_decorator.py:254: DeprecationWarning: f is deprecated as of scikit-bio version 0.1.0, and will be removed in version 0.1.4. You should now use skbio.g().
    warnings.warn('%s is deprecated as of scikit-bio version %s, and '

.pybuild/cpython3_3.8_skbio/build/skbio/util/tests/test_testing.py::TestAssertSeriesAlmostEqual::test_equal
.pybuild/cpython3_3.8_skbio/build/skbio/util/tests/test_testing.py::TestAssertSeriesAlmostEqual::test_not_equal
  /<<PKGBUILDDIR>>/.pybuild/cpython3_3.8_skbio/build/skbio/util/tests/test_testing.py:231: DeprecationWarning: The default dtype for empty Series will be 'object' instead of 'float64' in a future version. Specify a dtype explicitly to silence this warning.
    pd.Series(),

-- Docs: https://docs.pytest.org/en/latest/warnings.html
===== 89 failed, 2225 passed, 38 skipped, 16938 warnings in 779.63 seconds =====
E: pybuild pybuild:352: test: plugin distutils failed with: exit code=1: cd /<<PKGBUILDDIR>>/.pybuild/cpython3_3.8_skbio/build; python3.8 -m pytest 
dh_auto_test: error: pybuild --test --test-pytest -i python{version} -p 3.8 returned exit code 13
make: *** [debian/rules:13: binary-arch] Error 25

Tail of log for pocl on armhf:

- (arch=armel riscv64)_ZTVSt23_Sp_counted_ptr_inplaceIN5clang22PCHContainerOperationsESaIS1_ELN9__gnu_cxx12_Lock_policyE1EE@Base 0.12-5~llvm3.7
- (arch=!armel !riscv64)_ZTVSt23_Sp_counted_ptr_inplaceIN5clang22PCHContainerOperationsESaIS1_ELN9__gnu_cxx12_Lock_policyE2EE@Base 0.12-5~llvm3.7
+ _ZTVSt23_Sp_counted_ptr_inplaceIN4llvm3sys2fs6detail12DirIterStateESaIS4_ELN9__gnu_cxx12_Lock_policyE1EE@Base 0.14-7~llvm4.0
+#MISSING: 1.5-6# (arch=!armel !riscv64)_ZTVSt23_Sp_counted_ptr_inplaceIN4llvm3sys2fs6detail12DirIterStateESaIS4_ELN9__gnu_cxx12_Lock_policyE2EE@Base 0.14-7~llvm4.0
+ _ZTVSt23_Sp_counted_ptr_inplaceIN4llvm3sys2fs6detail15RecDirIterStateESaIS4_ELN9__gnu_cxx12_Lock_policyE1EE@Base 0.14-7~llvm4.0
+#MISSING: 1.5-6# (arch=!armel !riscv64)_ZTVSt23_Sp_counted_ptr_inplaceIN4llvm3sys2fs6detail15RecDirIterStateESaIS4_ELN9__gnu_cxx12_Lock_policyE2EE@Base 0.14-7~llvm4.0
+ _ZTVSt23_Sp_counted_ptr_inplaceIN5clang22PCHContainerOperationsESaIS1_ELN9__gnu_cxx12_Lock_policyE1EE@Base 0.12-5~llvm3.7
+#MISSING: 1.5-6# (arch=!armel !riscv64)_ZTVSt23_Sp_counted_ptr_inplaceIN5clang22PCHContainerOperationsESaIS1_ELN9__gnu_cxx12_Lock_policyE2EE@Base 0.12-5~llvm3.7
  _ZZNSt19_Sp_make_shared_tag5_S_tiEvE5__tag@Base 1.1-8~llvm6.0+gcc8.2
 #MISSING: 0.14# check_compiler_cache@Base 0.10
  clGetExtensionFunctionAddress@Base 0.10
dh_makeshlibs: error: failing due to earlier errors
make[1]: *** [debian/rules:104: run_dh_makeshlibs] Error 25
make[1]: Leaving directory '/<<PKGBUILDDIR>>'
make: *** [debian/rules:53: binary-arch] Error 2

Tail of log for spades on armhf:

-- Looking for stdint.h - found
-- Looking for stddef.h
-- Looking for stddef.h - found
-- Check size of void*
-- Check size of void* - done
CMake Error at /<<BUILDDIR>>/spades-3.13.1+dfsg/assembler/ext/src/jemalloc/CMakeLists.txt:79 (message):
  Unsupported pointer size


-- Configuring incomplete, errors occurred!
See also "/<<BUILDDIR>>/spades-3.13.1+dfsg/assembler/build_spades/CMakeFiles/CMakeOutput.log".
See also "/<<BUILDDIR>>/spades-3.13.1+dfsg/assembler/build_spades/CMakeFiles/CMakeError.log".
make[1]: *** [debian/rules:42: override_dh_auto_build] Error 1
make[1]: Leaving directory '/<<BUILDDIR>>/spades-3.13.1+dfsg'
make: *** [debian/rules:24: build-arch] Error 2

Tail of log for gfccore on armhf:

set -e;    
make[1]: Leaving directory '/<<PKGBUILDDIR>>'
if [ "reverse-patches" = "reverse-patches" ]; then rm -f debian/stamp-patched; fi
patches: 
if [ "reverse-patches" != "reverse-patches" ]; then touch debian/stamp-patched; fi
if [ "reverse-patches" != "reverse-patches" ] ; then \
	/usr/bin/make -f debian/rules update-config ; \
fi
for dir in debian/patches ; do \
    rm -f $dir/*.log ; \
done
set -e;    
dh_clean 
dh_clean: error: Compatibility levels before 5 are no longer supported (level 4 requested)
make: *** [/usr/share/cdbs/1/rules/debhelper.mk:211: clean] Error 25

Tail of log for libibcm on armhf:

#define HAVE_STRING_H 1
#define HAVE_MEMORY_H 1
#define HAVE_STRINGS_H 1
#define HAVE_INTTYPES_H 1
#define HAVE_STDINT_H 1
#define HAVE_UNISTD_H 1
#define HAVE_DLFCN_H 1
#define LT_OBJDIR ".libs/"
#define SIZEOF_LONG 4
#define HAVE_LIBIBVERBS 1
#define STDC_HEADERS 1

configure: exit 1
dh_auto_configure: error: ./configure --build=arm-linux-gnueabihf --prefix=/usr --includedir=\${prefix}/include --mandir=\${prefix}/share/man --infodir=\${prefix}/share/info --sysconfdir=/etc --localstatedir=/var --disable-option-checking --disable-silent-rules --libdir=\${prefix}/lib/arm-linux-gnueabihf --libexecdir=\${prefix}/lib/arm-linux-gnueabihf --disable-maintainer-mode --disable-dependency-tracking returned exit code 1
make: *** [debian/rules:7: build-arch] Error 25

Tail of log for libqglviewer on armhf:

                 from qglviewer.cpp:23:
config.h:83:11: fatal error: GL/glu.h: No such file or directory
   83 | # include <GL/glu.h>
      |           ^~~~~~~~~~
compilation terminated.
compilation terminated.
compilation terminated.
make[1]: *** [Makefile:636: .obj/manipulatedCameraFrame.o] Error 1
make[1]: *** Waiting for unfinished jobs....
make[1]: *** [Makefile:608: .obj/camera.o] Error 1
make[1]: *** [Makefile:594: .obj/qglviewer.o] Error 1
make[1]: *** [Makefile:622: .obj/manipulatedFrame.o] Error 1
make[1]: Leaving directory '/<<BUILDDIR>>/libqglviewer-2.6.3+dfsg2/QGLViewer'
dh_auto_build: error: cd QGLViewer && make -j4 returned exit code 2
make: *** [debian/rules:4: build-arch] Error 25

Tail of log for acovea on armhf:

 fakeroot debian/rules clean
dh_testdir
dh_testroot
rm -f build-stamp 
# Add here commands to clean up after the build process.
/usr/bin/make distclean
make[1]: Entering directory '/<<PKGBUILDDIR>>'
make[1]: *** No rule to make target 'distclean'.  Stop.
make[1]: Leaving directory '/<<PKGBUILDDIR>>'
make: [debian/rules:49: clean] Error 2 (ignored)
cp -f /usr/share/misc/config.sub config.sub
cp -f /usr/share/misc/config.guess config.guess
dh_clean 
dh_clean: error: Compatibility levels before 5 are no longer supported (level 4 requested)
make: *** [debian/rules:52: clean] Error 25

Tail of log for mingw32-binutils on armhf:

dpkg-buildpackage
-----------------

dpkg-buildpackage: info: source package mingw32-binutils
dpkg-buildpackage: info: source version 2.20-0.2
dpkg-buildpackage: info: source distribution unstable
 dpkg-source --before-build .
dpkg-buildpackage: info: host architecture armhf
 fakeroot debian/rules clean
dh_testdir
dh_testroot
rm -rf /<<PKGBUILDDIR>>/build_dir *-stamp
dh_clean
dh_clean: error: Compatibility levels before 5 are no longer supported (level 4 requested)
make: *** [debian/rules:123: clean] Error 25

Tail of log for apf on armhf:

checking for suffix of executables... 
checking for suffix of object files... o
checking whether we are using the GNU C compiler... yes
checking whether arm-linux-gnueabihf-gcc accepts -g... yes
checking for arm-linux-gnueabihf-gcc option to accept ISO C89... none needed
checking for style of include used by make... GNU
checking dependency style of arm-linux-gnueabihf-gcc... gcc3
checking how to run the C preprocessor... arm-linux-gnueabihf-gcc -E
checking for grep that handles long lines and -e... /bin/grep
checking for egrep... /bin/grep -E
checking whether arm-linux-gnueabihf-gcc needs -traditional... no
checking for openssl... no
checking for SSL_library_init in -lssl... no
configure: error: "lib ssl not found!"
make: *** [debian/rules:29: config.status] Error 1

Tail of log for asterisk-chan-capi on armhf:

 9096 |   if (cid_name == 0 && i->owner->cid.cid_name && *i->owner->cid.cid_name) {
      |                                ^~
chan_capi.c:9096:59: error: invalid use of undefined type 'struct ast_channel'
 9096 |   if (cid_name == 0 && i->owner->cid.cid_name && *i->owner->cid.cid_name) {
      |                                                           ^~
In file included from /usr/include/asterisk/asterisk.h:23,
                 from chan_capi.h:20,
                 from chan_capi.c:32:
chan_capi.c:9097:34: error: invalid use of undefined type 'struct ast_channel'
 9097 |   cid_name = ast_strdupa(i->owner->cid.cid_name);
      |                                  ^~
make[1]: *** [Makefile:198: chan_capi.o] Error 1
make[1]: Leaving directory '/<<PKGBUILDDIR>>'
dh_auto_build: error: make -j1 returned exit code 2
make: *** [debian/rules:3: build-arch] Error 25

Tail of log for audacious-analog-vumeter-plugin on armhf:

make[3]: Entering directory '/<<PKGBUILDDIR>>/src'
/bin/bash ../libtool --tag=CC   --mode=compile gcc -DHAVE_CONFIG_H -I. -I..    -Wall -ggdb  -g -O2 -DSKINDIR=\"/usr/share/audacious\" -g -O2 -c -o plugin_main.lo plugin_main.c
libtool: compile:  gcc -DHAVE_CONFIG_H -I. -I.. -Wall -ggdb -g -O2 -DSKINDIR=\"/usr/share/audacious\" -g -O2 -c plugin_main.c  -fPIC -DPIC -o .libs/plugin_main.o
plugin_main.c:1:10: fatal error: gtk/gtk.h: No such file or directory
    1 | #include <gtk/gtk.h>
      |          ^~~~~~~~~~~
compilation terminated.
make[3]: *** [Makefile:321: plugin_main.lo] Error 1
make[3]: Leaving directory '/<<PKGBUILDDIR>>/src'
make[2]: *** [Makefile:365: all-recursive] Error 1
make[2]: Leaving directory '/<<PKGBUILDDIR>>'
make[1]: *** [Makefile:254: all] Error 2
make[1]: Leaving directory '/<<PKGBUILDDIR>>'
dh_auto_build: error: make -j1 returned exit code 2
make: *** [debian/rules:8: build-arch] Error 25

Tail of log for autofs5 on armhf:

/usr/bin/ld: ../lib/autofs.a(master.o): in function `master_submount_list_empty':
master.c:(.text+0x1950): undefined reference to `dump_core'
/usr/bin/ld: master.c:(.text+0x1970): undefined reference to `dump_core'
/usr/bin/ld: ../lib/autofs.a(master.o):master.c:(.text+0x1bdc): more undefined references to `dump_core' follow
/usr/bin/ld: ../lib/autofs.a(master.o): in function `master_mount_mounts':
master.c:(.text+0x2264): undefined reference to `pthread_create'
/usr/bin/ld: master.c:(.text+0x23dc): undefined reference to `dump_core'
/usr/bin/ld: ../lib/autofs.a(master.o): in function `master_done':
master.c:(.text+0x2544): undefined reference to `pthread_join'
collect2: error: ld returned 1 exit status
make[2]: *** [Makefile:28: automount] Error 1
make[2]: Leaving directory '/<<PKGBUILDDIR>>/daemon'
make[1]: *** [Makefile:14: daemon] Error 2
make[1]: Leaving directory '/<<PKGBUILDDIR>>'
make: *** [debian/rules:23: build.stamp] Error 2

Tail of log for bbhash on armhf:

BooPHF.h:817:35: error: expected ‘)’ before ‘word’
  817 |   return (uint64_t)(((__uint128_t)word * (__uint128_t)p) >> 64);
      |                     ~             ^~~~
      |                                   )
BooPHF.h:817:64: error: expected ‘)’ before ‘;’ token
  817 |   return (uint64_t)(((__uint128_t)word * (__uint128_t)p) >> 64);
      |                    ~                                           ^
      |                                                                )
make[1]: *** [makefile:22: example] Error 1
make[1]: *** Waiting for unfinished jobs....
make[1]: *** [makefile:25: example_custom_hash] Error 1
make[1]: *** [makefile:29: Bootest] Error 1
make[1]: Leaving directory '/<<PKGBUILDDIR>>'
dh_auto_build: error: make -j4 "INSTALL=install --strip-program=true" returned exit code 2
make: *** [debian/rules:21: binary-arch] Error 25

Tail of log for blastem on armhf:

      |                                                                     ~~~~~~~~~^~~
z80_to_x86.c: In function 'zremove_breakpoint':
z80_to_x86.c:3872:22: warning: assignment to 'code_ptr' {aka 'unsigned int *'} from incompatible pointer type 'uint8_t *' {aka 'unsigned char *'} [-Wincompatible-pointer-types]
 3872 |   opts->gen.code.cur = native;
      |                      ^
z80_to_x86.c:3873:23: warning: assignment to 'code_ptr' {aka 'unsigned int *'} from incompatible pointer type 'uint8_t *' {aka 'unsigned char *'} [-Wincompatible-pointer-types]
 3873 |   opts->gen.code.last = native + 128;
      |                       ^
make[2]: *** [Makefile:356: z80_to_x86.o] Error 1
make[2]: *** Waiting for unfinished jobs....
make[2]: Leaving directory '/<<PKGBUILDDIR>>'
dh_auto_build: error: make -j4 "INSTALL=install --strip-program=true" HOST_ZLIB=1 CONFIG_PATH=/etc/blastem DATA_PATH=/usr/share/games/blastem returned exit code 2
make[1]: *** [debian/rules:10: override_dh_auto_build] Error 25
make[1]: Leaving directory '/<<PKGBUILDDIR>>'
make: *** [debian/rules:7: binary-arch] Error 2

Tail of log for bustools on armhf:

   73 | inline size_t rndup(size_t v) {
      |               ^~~~~
make[4]: *** [src/CMakeFiles/bustools_core.dir/build.make:79: src/CMakeFiles/bustools_core.dir/Common.cpp.o] Error 1
make[4]: *** Waiting for unfinished jobs....
make[4]: *** [src/CMakeFiles/bustools_core.dir/build.make:92: src/CMakeFiles/bustools_core.dir/bustools_capture.cpp.o] Error 1
make[4]: *** [src/CMakeFiles/bustools_core.dir/build.make:105: src/CMakeFiles/bustools_core.dir/bustools_correct.cpp.o] Error 1
make[4]: Leaving directory '/<<PKGBUILDDIR>>/obj-arm-linux-gnueabihf'
make[3]: *** [CMakeFiles/Makefile2:126: src/CMakeFiles/bustools_core.dir/all] Error 2
make[3]: Leaving directory '/<<PKGBUILDDIR>>/obj-arm-linux-gnueabihf'
make[2]: *** [Makefile:133: all] Error 2
make[2]: Leaving directory '/<<PKGBUILDDIR>>/obj-arm-linux-gnueabihf'
dh_auto_build: error: cd obj-arm-linux-gnueabihf && make -j4 "INSTALL=install --strip-program=true" returned exit code 2
make[1]: *** [debian/rules:17: override_dh_auto_build] Error 25
make[1]: Leaving directory '/<<PKGBUILDDIR>>'
make: *** [debian/rules:9: binary-arch] Error 2

Tail of log for criu on armhf:

  192 | #define PTRACE_SETSIGMASK PTRACE_SETSIGMASK
      | 
In file included from include/protobuf.h:8,
                 from arch/arm/crtools.c:9:
include/util.h: In function 'kdev_to_odev':
include/util.h:158:9: error: implicit declaration of function 'makedev' [-Werror=implicit-function-declaration]
  158 |  return makedev(major, minor);
      |         ^~~~~~~
cc1: all warnings being treated as errors
make[2]: *** [scripts/Makefile.build:185: arch/arm/crtools.o] Error 1
make[2]: Leaving directory '/<<PKGBUILDDIR>>'
make[1]: *** [Makefile:208: arch/arm] Error 2
make[1]: Leaving directory '/<<PKGBUILDDIR>>'
dh_auto_build: error: make -j4 returned exit code 2
make: *** [debian/rules:6: build-arch] Error 25

Tail of log for consul-migrate on armhf:

--- FAIL: TestMigrator_data (0.00s)
=== RUN   TestMigrator_new
--- PASS: TestMigrator_new (0.00s)
=== RUN   TestMigrator_migrate
    TestMigrator_migrate: migrator_test.go:130: err: Failed to connect MDB: MDB_INVALID: File is not an LMDB file %!s(MISSING)
--- FAIL: TestMigrator_migrate (0.00s)
=== RUN   TestMigrator_migrate_fails
--- PASS: TestMigrator_migrate_fails (0.34s)
=== RUN   TestMigrator_migrate_noop
--- PASS: TestMigrator_migrate_noop (0.00s)
FAIL
FAIL	github.com/hashicorp/consul-migrate/migrator	0.387s
FAIL
dh_auto_test: error: cd obj-arm-linux-gnueabihf && go test -vet=off -v -p 1 github.com/hashicorp/consul-migrate github.com/hashicorp/consul-migrate/migrator returned exit code 1
make: *** [debian/rules:7: build-arch] Error 25

Tail of log for debiman on armhf:

--- PASS: TestCronSection (0.00s)
    --- PASS: TestCronSection/cron (0.00s)
PASS
ok  	github.com/Debian/debiman/internal/redirect	0.176s
=== RUN   TestSitemap
--- PASS: TestSitemap (0.00s)
=== RUN   TestSitemapIndex
--- PASS: TestSitemapIndex (0.00s)
PASS
ok  	github.com/Debian/debiman/internal/sitemap	0.019s
?   	github.com/Debian/debiman/internal/tag	[no test files]
?   	github.com/Debian/debiman/internal/write	[no test files]
FAIL
dh_auto_test: error: cd obj-arm-linux-gnueabihf && go test -vet=off -v -p 4 github.com/Debian/debiman github.com/Debian/debiman/cmd/debiman github.com/Debian/debiman/cmd/debiman-auxserver github.com/Debian/debiman/cmd/debiman-idx2rwmap github.com/Debian/debiman/cmd/debiman-minisrv github.com/Debian/debiman/internal/auxserver github.com/Debian/debiman/internal/bundled github.com/Debian/debiman/internal/commontmpl github.com/Debian/debiman/internal/convert github.com/Debian/debiman/internal/manpage github.com/Debian/debiman/internal/proto github.com/Debian/debiman/internal/recode github.com/Debian/debiman/internal/redirect github.com/Debian/debiman/internal/sitemap github.com/Debian/debiman/internal/tag github.com/Debian/debiman/internal/write returned exit code 1
make: *** [debian/rules:4: binary-arch] Error 25

Tail of log for ccls on armhf:

      |  ~~~~~~~~~~~~~~~~~~~~~^~~~~~~~~~~~~~~~~~~~~~~~~
[100%] Linking CXX executable ccls
/usr/bin/cmake -E cmake_link_script CMakeFiles/ccls.dir/link.txt --verbose=1
/usr/bin/c++  -g -O2 -fdebug-prefix-map=/<<PKGBUILDDIR>>=. -fstack-protector-strong -Wformat -Werror=format-security -Wdate-time -D_FORTIFY_SOURCE=2  -Wl,-z,relro -Wl,-z,now CMakeFiles/ccls.dir/third_party/siphash.cc.o CMakeFiles/ccls.dir/src/clang_tu.cc.o CMakeFiles/ccls.dir/src/config.cc.o CMakeFiles/ccls.dir/src/filesystem.cc.o CMakeFiles/ccls.dir/src/fuzzy_match.cc.o CMakeFiles/ccls.dir/src/main.cc.o CMakeFiles/ccls.dir/src/include_complete.cc.o CMakeFiles/ccls.dir/src/indexer.cc.o CMakeFiles/ccls.dir/src/log.cc.o CMakeFiles/ccls.dir/src/lsp.cc.o CMakeFiles/ccls.dir/src/message_handler.cc.o CMakeFiles/ccls.dir/src/pipeline.cc.o CMakeFiles/ccls.dir/src/platform_posix.cc.o CMakeFiles/ccls.dir/src/platform_win.cc.o CMakeFiles/ccls.dir/src/position.cc.o CMakeFiles/ccls.dir/src/project.cc.o CMakeFiles/ccls.dir/src/query.cc.o CMakeFiles/ccls.dir/src/sema_manager.cc.o CMakeFiles/ccls.dir/src/serializer.cc.o CMakeFiles/ccls.dir/src/test.cc.o CMakeFiles/ccls.dir/src/utils.cc.o CMakeFiles/ccls.dir/src/working_files.cc.o CMakeFiles/ccls.dir/src/messages/ccls_call.cc.o CMakeFiles/ccls.dir/src/messages/ccls_info.cc.o CMakeFiles/ccls.dir/src/messages/ccls_inheritance.cc.o CMakeFiles/ccls.dir/src/messages/ccls_member.cc.o CMakeFiles/ccls.dir/src/messages/ccls_navigate.cc.o CMakeFiles/ccls.dir/src/messages/ccls_reload.cc.o CMakeFiles/ccls.dir/src/messages/ccls_vars.cc.o CMakeFiles/ccls.dir/src/messages/initialize.cc.o CMakeFiles/ccls.dir/src/messages/textDocument_code.cc.o CMakeFiles/ccls.dir/src/messages/textDocument_completion.cc.o CMakeFiles/ccls.dir/src/messages/textDocument_definition.cc.o CMakeFiles/ccls.dir/src/messages/textDocument_did.cc.o CMakeFiles/ccls.dir/src/messages/textDocument_foldingRange.cc.o CMakeFiles/ccls.dir/src/messages/textDocument_formatting.cc.o CMakeFiles/ccls.dir/src/messages/textDocument_document.cc.o CMakeFiles/ccls.dir/src/messages/textDocument_hover.cc.o CMakeFiles/ccls.dir/src/messages/textDocument_references.cc.o CMakeFiles/ccls.dir/src/messages/textDocument_rename.cc.o CMakeFiles/ccls.dir/src/messages/textDocument_signatureHelp.cc.o CMakeFiles/ccls.dir/src/messages/workspace.cc.o  -o ccls  -Wl,-rpath,/usr/lib/llvm-9/lib: /usr/lib/llvm-9/lib/libclangIndex.a /usr/lib/llvm-9/lib/libclangFormat.a /usr/lib/llvm-9/lib/libclangTooling.a /usr/lib/llvm-9/lib/libclangToolingInclusions.a /usr/lib/llvm-9/lib/libclangToolingCore.a /usr/lib/llvm-9/lib/libclangFrontend.a /usr/lib/llvm-9/lib/libclangParse.a /usr/lib/llvm-9/lib/libclangSerialization.a /usr/lib/llvm-9/lib/libclangSema.a /usr/lib/llvm-9/lib/libclangAST.a /usr/lib/llvm-9/lib/libclangLex.a /usr/lib/llvm-9/lib/libclangDriver.a /usr/lib/llvm-9/lib/libclangBasic.a /usr/lib/llvm-9/lib/libclangFormat.a /usr/lib/llvm-9/lib/libclangToolingInclusions.a /usr/lib/llvm-9/lib/libclangToolingCore.a /usr/lib/llvm-9/lib/libclangEdit.a /usr/lib/llvm-9/lib/libclangAnalysis.a /usr/lib/llvm-9/lib/libclangRewrite.a /usr/lib/llvm-9/lib/libclangASTMatchers.a /usr/lib/llvm-9/lib/libclangAST.a /usr/lib/llvm-9/lib/libclangLex.a /usr/lib/llvm-9/lib/libclangBasic.a /usr/lib/llvm-9/lib/libLLVM-9.so.1 -pthread 
/usr/bin/ld: CMakeFiles/ccls.dir/src/pipeline.cc.o: undefined reference to symbol '__atomic_fetch_sub_8@@LIBATOMIC_1.0'
/usr/bin/ld: /usr/lib/arm-linux-gnueabihf/libatomic.so.1: error adding symbols: DSO missing from command line
collect2: error: ld returned 1 exit status
make[3]: *** [CMakeFiles/ccls.dir/build.make:726: ccls] Error 1
make[3]: Leaving directory '/<<PKGBUILDDIR>>/obj-arm-linux-gnueabihf'
make[2]: *** [CMakeFiles/Makefile2:135: CMakeFiles/ccls.dir/all] Error 2
make[2]: Leaving directory '/<<PKGBUILDDIR>>/obj-arm-linux-gnueabihf'
make[1]: *** [Makefile:133: all] Error 2
make[1]: Leaving directory '/<<PKGBUILDDIR>>/obj-arm-linux-gnueabihf'
dh_auto_build: error: cd obj-arm-linux-gnueabihf && make -j4 "INSTALL=install --strip-program=true" returned exit code 2
make: *** [debian/rules:15: binary-arch] Error 25

Tail of log for fairy-stockfish on armhf:

/usr/bin/ld: /usr/include/c++/10/bits/atomic_base.h:426: undefined reference to `__atomic_load_8'
/usr/bin/ld: /tmp/stockfish.svZ7Id.ltrans6.ltrans.o: in function `UCI::loop(int, char**)':
/usr/include/c++/10/bits/atomic_base.h:426: undefined reference to `__atomic_load_8'
/usr/bin/ld: /tmp/stockfish.svZ7Id.ltrans9.ltrans.o: in function `ThreadPool::start_thinking(Position&, std::unique_ptr<std::deque<StateInfo, std::allocator<StateInfo> >, std::default_delete<std::deque<StateInfo, std::allocator<StateInfo> > > >&, Search::LimitsType const&, bool) [clone .constprop.0]':
/usr/include/c++/10/bits/atomic_base.h:404: undefined reference to `__atomic_store_8'
/usr/bin/ld: /usr/include/c++/10/bits/atomic_base.h:404: undefined reference to `__atomic_store_8'
collect2: error: ld returned 1 exit status
make[3]: *** [Makefile:516: stockfish] Error 1
make[3]: Leaving directory '/<<PKGBUILDDIR>>/src'
make[2]: *** [Makefile:433: build] Error 2
make[2]: Leaving directory '/<<PKGBUILDDIR>>/src'
dh_auto_build: error: cd src && make -j4 build ARCH=general-32 returned exit code 2
make[1]: *** [debian/rules:105: override_dh_auto_build] Error 25
make[1]: Leaving directory '/<<PKGBUILDDIR>>'
make: *** [debian/rules:99: build-arch] Error 2

Tail of log for deng on armhf:

  175 |                                         pixel[1] = png_info->palette[rows[i][off]].green;
      |                                                            ^~
/<<BUILDDIR>>/deng-1.9.0-beta6.9+dfsg1/doomsday/engine/portable/src/gl_png.c:176:60: error: invalid use of incomplete typedef 'png_info' {aka 'struct png_info_def'}
  176 |                                         pixel[2] = png_info->palette[rows[i][off]].blue;
      |                                                            ^~
/<<BUILDDIR>>/deng-1.9.0-beta6.9+dfsg1/doomsday/engine/portable/src/gl_png.c:183:48: error: invalid use of incomplete typedef 'png_info' {aka 'struct png_info_def'}
  183 |                                     if(png_info->channels == 2) // Alpha data.
      |                                                ^~
make[3]: *** [CMakeFiles/doomsday.dir/build.make:726: CMakeFiles/doomsday.dir/engine/portable/src/gl_png.o] Error 1
make[3]: Leaving directory '/<<BUILDDIR>>/deng-1.9.0-beta6.9+dfsg1/doomsdaybuild'
make[2]: *** [CMakeFiles/Makefile2:209: CMakeFiles/doomsday.dir/all] Error 2
make[2]: Leaving directory '/<<BUILDDIR>>/deng-1.9.0-beta6.9+dfsg1/doomsdaybuild'
make[1]: *** [Makefile:152: all] Error 2
make[1]: Leaving directory '/<<BUILDDIR>>/deng-1.9.0-beta6.9+dfsg1/doomsdaybuild'
make: *** [debian/rules:25: build-stamp] Error 2

Tail of log for ezquake on armhf:

 1369 |  snprintf(name, MAX_OSPATH, "%s/%s.log", fs_gamedir, G_STRING(OFS_PARM0));
      |                                   ^~~~
In file included from /usr/include/stdio.h:867,
                 from q_shared.h:30,
                 from common.h:35,
                 from qwsvdef.h:26,
                 from pr_cmds.c:22:
/usr/include/arm-linux-gnueabihf/bits/stdio2.h:67:10: note: '__builtin___snprintf_chk' output 6 or more bytes (assuming 133) into a destination of size 128
   67 |   return __builtin___snprintf_chk (__s, __n, __USE_FORTIFY_LEVEL - 1,
      |          ^~~~~~~~~~~~~~~~~~~~~~~~~~~~~~~~~~~~~~~~~~~~~~~~~~~~~~~~~~~~
   68 |        __bos (__s), __fmt, __va_arg_pack ());
      |        ~~~~~~~~~~~~~~~~~~~~~~~~~~~~~~~~~~~~~
make[1]: Leaving directory '/<<BUILDDIR>>/ezquake-2.2+git20150324'
dh_auto_build: error: make -j4 returned exit code 2
make: *** [debian/rules:14: build-arch] Error 25

Tail of log for fuse-umfuse-iso9660 on armhf:

checking whether the gcc linker (/usr/bin/ld) supports shared libraries... yes
checking whether -lc should be explicitly linked in... no
checking dynamic linker characteristics... GNU/Linux ld.so
checking how to hardcode library paths into programs... immediate
checking whether stripping libraries is possible... yes
checking if libtool supports shared libraries... yes
checking whether to build shared libraries... yes
checking whether to build static libraries... yes
checking for fuse_main in -lfuse... yes
checking for iso9660_open_ext in -liso9660... yes
checking for _cdio_list_begin in -lcdio... yes
checking for uncompress in -lz... yes
checking for um_add_service in -lumlib... no
configure: error: Can't find libumlib, please install it
make: *** [/usr/share/cdbs/1/class/autotools.mk:46: debian/stamp-autotools] Error 1

Tail of log for febootstrap on armhf:

File "febootstrap_utils.ml", line 85, characters 42-46:
85 |   really_input chan data 0 (String.length data);
                                               ^^^^
Error: This expression has type bytes but an expression was expected of type
         string
make[4]: *** [Makefile:1275: febootstrap_utils.cmx] Error 2
make[4]: Leaving directory '/<<PKGBUILDDIR>>/src'
make[3]: *** [Makefile:1058: all-recursive] Error 1
make[3]: Leaving directory '/<<PKGBUILDDIR>>'
make[2]: *** [Makefile:996: all] Error 2
make[2]: Leaving directory '/<<PKGBUILDDIR>>'
dh_auto_build: error: make -j1 returned exit code 2
make[1]: *** [debian/rules:8: override_dh_auto_build] Error 25
make[1]: Leaving directory '/<<PKGBUILDDIR>>'
make: *** [debian/rules:11: build-arch] Error 2

Tail of log for dballe on armhf:

OK
2020-08-15 04:14:29,805 INFO test-csv: /usr/bin/python3 /<<PKGBUILDDIR>>/python/test-csv.py: success
2020-08-15 04:14:29,807 INFO runtest: 13 tests requested, 11 succeeded, 2 failed, 0 did not run.
make[5]: *** [Makefile:1033: check-local] Error 1
make[5]: Leaving directory '/<<PKGBUILDDIR>>/python'
make[4]: *** [Makefile:848: check-am] Error 2
make[4]: Leaving directory '/<<PKGBUILDDIR>>/python'
make[3]: *** [Makefile:850: check] Error 2
make[3]: Leaving directory '/<<PKGBUILDDIR>>/python'
make[2]: *** [Makefile:591: check-recursive] Error 1
make[2]: Leaving directory '/<<PKGBUILDDIR>>'
make[1]: *** [Makefile:889: check] Error 2
make[1]: Leaving directory '/<<PKGBUILDDIR>>'
dh_auto_test: error: make -j4 check VERBOSE=1 returned exit code 2
make: *** [debian/rules:7: build-arch] Error 25

Tail of log for ioapps on armhf:

      |                                    ^
replicate.c:1397:11: note: 'first_call_orig' was declared here
 1397 |  uint64_t first_call_orig; ///< when was the first original call made
      |           ^~~~~~~~~~~~~~~
replicate.c:104:36: warning: 'last_call_orig' may be used uninitialized in this function [-Wmaybe-uninitialized]
  104 |      diff_orig = CALL_TIME(x##_it) - last_call_orig; \
      |                                    ^
replicate.c:1396:11: note: 'last_call_orig' was declared here
 1396 |  uint64_t last_call_orig; ///< when was the last original call made
      |           ^~~~~~~~~~~~~~
make[2]: *** [Makefile:46: replicate.o] Error 1
make[2]: Leaving directory '/<<PKGBUILDDIR>>'
make[1]: *** [debian/rules:18: override_dh_auto_build] Error 2
make[1]: Leaving directory '/<<PKGBUILDDIR>>'
make: *** [debian/rules:14: build-arch] Error 2

Tail of log for ibam on armhf:

make[1]: Entering directory '/<<PKGBUILDDIR>>'
make[1]: 'ibam-krell.so' is up to date.
make[1]: Leaving directory '/<<PKGBUILDDIR>>'
touch build-stamp
dh_testdir
dh_testroot
dh_clean
dh_clean: warning: Compatibility levels before 10 are deprecated (level 7 in use)
dh_installdirs
dh_installdirs: warning: Compatibility levels before 10 are deprecated (level 7 in use)
# Add here commands to install the package into debian/tmp.
install -m0755 ibam `pwd`/debian/ibam/usr/bin
install -m0644 ibam-krell.so `pwd`/debian/gkrellm-ibam/usr/lib/gkrellm2/plugins
install: cannot create regular file '/<<PKGBUILDDIR>>/debian/gkrellm-ibam/usr/lib/gkrellm2/plugins': No such file or directory
make: *** [debian/rules:58: install] Error 1

Tail of log for haskell-type-level on armhf:

    |
266 | instance (DivMod x y q r) => Div x y q
    |          ^^^^^^^^^^^^^^^^^^^^^^^^^^^^^

src/Data/TypeLevel/Num/Ops.hs:336:10: error:
    * Illegal instance declaration for `Div10 x q'
        The liberal coverage condition fails in class `Div10'
          for functional dependency: `q -> x'
        Reason: lhs type `q' does not determine rhs type `x'
        Un-determined variable: x
    * In the instance declaration for `Div10 x q'
    |
336 | instance DivMod10 x q r => Div10 x q
    |          ^^^^^^^^^^^^^^^^^^^^^^^^^^^
make: *** [/usr/share/cdbs/1/class/hlibrary.mk:147: build-ghc-stamp] Error 1

Tail of log for ivar on armhf:

# ERROR: 0
============================================================================
See tests/test-suite.log
Please report to gkarthik@scripps.edu
============================================================================
make[4]: *** [Makefile:826: test-suite.log] Error 1
make[4]: Leaving directory '/<<BUILDDIR>>/ivar-1.2.2+dfsg/tests'
make[3]: *** [Makefile:934: check-TESTS] Error 2
make[3]: Leaving directory '/<<BUILDDIR>>/ivar-1.2.2+dfsg/tests'
make[2]: *** [Makefile:1092: check-am] Error 2
make[2]: Leaving directory '/<<BUILDDIR>>/ivar-1.2.2+dfsg/tests'
make[1]: *** [Makefile:360: check-recursive] Error 1
make[1]: Leaving directory '/<<BUILDDIR>>/ivar-1.2.2+dfsg'
dh_auto_test: error: make -j4 check VERBOSE=1 returned exit code 2
make: *** [debian/rules:9: binary-arch] Error 25

Tail of log for kafs-client on armhf:

make[2]: *** [Makefile:34: lib_cell_lookup.os] Error 1
make[2]: *** Waiting for unfinished jobs....
cc: error: unrecognized command-line option '-m32'; did you mean '-mbe32'?
cc: error: unrecognized command-line option '-m32'; did you mean '-mbe32'?
cc: error: unrecognized command-line option '-m32'; did you mean '-mbe32'?
make[2]: *** [Makefile:34: lib_dns_lookup.os] Error 1
make[2]: *** [Makefile:34: lib_cellserv.os] Error 1
cc: error: unrecognized command-line option '-m32'; did you mean '-mbe32'?
cc: error: unrecognized command-line option '-m32'; did you mean '-mbe32'?
make[2]: *** [Makefile:34: lib_object.os] Error 1
make[2]: Leaving directory '/<<PKGBUILDDIR>>/src'
make[1]: *** [Makefile:43: all] Error 2
make[1]: Leaving directory '/<<PKGBUILDDIR>>'
dh_auto_build: error: make -j4 "INSTALL=install --strip-program=true" returned exit code 2
make: *** [debian/rules:8: binary-arch] Error 25

Tail of log for jocaml on armhf:

|---
| tools/ocamlmklib.ml | 5 +++++
| 1 file changed, 5 insertions(+)
|
|diff --git a/tools/ocamlmklib.ml b/tools/ocamlmklib.ml
|index b5c0aee..b4e45d1 100644
|--- a/tools/ocamlmklib.ml
|+++ b/tools/ocamlmklib.ml
--------------------------
No file to patch.  Skipping patch.
1 out of 1 hunk ignored
Patch debian/patches/0003-Don-t-use-rpath.patch does not apply (enforce with -f)
make[1]: *** [debian/rules:22: override_dh_auto_configure] Error 1
make[1]: Leaving directory '/<<PKGBUILDDIR>>'
make: *** [debian/rules:85: build-arch] Error 2

Tail of log for kleborate on armhf:

======================================================================
FAIL: test_salmonella (test.test_species.TestSpecies)
----------------------------------------------------------------------
Traceback (most recent call last):
  File "/<<PKGBUILDDIR>>/.pybuild/cpython3_3.8/build/test/test_species.py", line 95, in test_salmonella
    self.assertTrue('Salmonella' in species)
AssertionError: False is not true

----------------------------------------------------------------------
Ran 123 tests in 477.296s

FAILED (failures=25)
E: pybuild pybuild:352: test: plugin distutils failed with: exit code=1: cd /<<PKGBUILDDIR>>/.pybuild/cpython3_3.8/build; python3.8 -m unittest discover -v 
dh_auto_test: error: pybuild --test -i python{version} -p 3.8 returned exit code 13
make: *** [debian/rules:6: binary-arch] Error 25

Tail of log for libbiod on armhf:

gdc: error: unrecognized command-line option ‘-release’; did you mean ‘-frelease’?
gdc: error: unrecognized command-line option ‘-boundscheck=off’; did you mean ‘-fbounds-check=off’?
[3/199] gdc -Ibiod@sha -I. -I.. -g -O2 -fdebug-prefix-map=/<<BUILDDIR>>/libbiod-0.2.3+git20191120.b8eecef=. -fstack-protector-strong -frelease -fPIC -O3 -release -enable-inlining -boundscheck=off -MD -MQ 'biod@sha/contrib_undead_internal_file.d.o' -MF 'biod@sha/contrib_undead_internal_file.d.o.deps' -o 'biod@sha/contrib_undead_internal_file.d.o' -c ../contrib/undead/internal/file.d
FAILED: biod@sha/contrib_undead_internal_file.d.o 
gdc -Ibiod@sha -I. -I.. -g -O2 -fdebug-prefix-map=/<<BUILDDIR>>/libbiod-0.2.3+git20191120.b8eecef=. -fstack-protector-strong -frelease -fPIC -O3 -release -enable-inlining -boundscheck=off -MD -MQ 'biod@sha/contrib_undead_internal_file.d.o' -MF 'biod@sha/contrib_undead_internal_file.d.o.deps' -o 'biod@sha/contrib_undead_internal_file.d.o' -c ../contrib/undead/internal/file.d
gdc: error: unrecognized command-line option ‘-release’; did you mean ‘-frelease’?
gdc: error: unrecognized command-line option ‘-boundscheck=off’; did you mean ‘-fbounds-check=off’?
[4/199] gdc -Ibiod@sha -I. -I.. -g -O2 -fdebug-prefix-map=/<<BUILDDIR>>/libbiod-0.2.3+git20191120.b8eecef=. -fstack-protector-strong -frelease -fPIC -O3 -release -enable-inlining -boundscheck=off -MD -MQ 'biod@sha/contrib_undead_stream.d.o' -MF 'biod@sha/contrib_undead_stream.d.o.deps' -o 'biod@sha/contrib_undead_stream.d.o' -c ../contrib/undead/stream.d
FAILED: biod@sha/contrib_undead_stream.d.o 
gdc -Ibiod@sha -I. -I.. -g -O2 -fdebug-prefix-map=/<<BUILDDIR>>/libbiod-0.2.3+git20191120.b8eecef=. -fstack-protector-strong -frelease -fPIC -O3 -release -enable-inlining -boundscheck=off -MD -MQ 'biod@sha/contrib_undead_stream.d.o' -MF 'biod@sha/contrib_undead_stream.d.o.deps' -o 'biod@sha/contrib_undead_stream.d.o' -c ../contrib/undead/stream.d
gdc: error: unrecognized command-line option ‘-release’; did you mean ‘-frelease’?
gdc: error: unrecognized command-line option ‘-boundscheck=off’; did you mean ‘-fbounds-check=off’?
ninja: build stopped: subcommand failed.
dh_auto_build: error: cd obj-arm-linux-gnueabihf && LC_ALL=C.UTF-8 ninja -j4 -v returned exit code 1
make: *** [debian/rules:7: build-arch] Error 25

Tail of log for gammapy on armhf:

            data[idx[::-1]] = 0
        else:
>           data = np.zeros(shape_np, dtype=dtype)
E           ValueError: negative dimensions are not allowed

gammapy/maps/hpxnd.py:52: ValueError
----------------------------- Captured stderr call -----------------------------
/usr/lib/python3/dist-packages/healpy/pixelfunc.py:1033: RuntimeWarning: invalid value encountered in sqrt
  resol = np.sqrt(nside2pixarea(nside))
= 14 failed, 1042 passed, 447 skipped, 3 xfailed, 2 xpassed in 1512.26 seconds =
/usr/lib/python3/dist-packages/_pytest/mark/structures.py:243: PytestCollectionWarning: cannot collect 'test_run_pwl' because it is not a function.
  def __call__(self, *args, **kwargs):
E: pybuild pybuild:352: test: plugin distutils failed with: exit code=1: cd /<<PKGBUILDDIR>>/.pybuild/cpython3_3.8_gammapy/build; python3.8 -m pytest 
dh_auto_test: error: pybuild --test --test-pytest -i python{version} -p 3.8 returned exit code 13
make: *** [debian/rules:9: build-arch] Error 25

Tail of log for leela-zero on armhf:

/usr/include/c++/10/bits/atomic_base.h:426: undefined reference to `__atomic_load_8'
/usr/bin/ld: /usr/include/c++/10/bits/atomic_base.h:426: undefined reference to `__atomic_load_8'
/usr/bin/ld: /usr/include/c++/10/bits/atomic_base.h:426: undefined reference to `__atomic_load_8'
/usr/bin/ld: /usr/include/c++/10/bits/atomic_base.h:426: undefined reference to `__atomic_load_8'
/usr/bin/ld: /usr/include/c++/10/bits/atomic_base.h:426: undefined reference to `__atomic_load_8'
/usr/bin/ld: CMakeFiles/objs.dir/src/UCTNodePointer.cpp.o:/usr/include/c++/10/bits/atomic_base.h:426: more undefined references to `__atomic_load_8' follow
collect2: error: ld returned 1 exit status
make[3]: *** [CMakeFiles/tests.dir/build.make:158: tests] Error 1
make[3]: Leaving directory '/<<PKGBUILDDIR>>/obj-arm-linux-gnueabihf'
make[2]: *** [CMakeFiles/Makefile2:189: CMakeFiles/tests.dir/all] Error 2
make[2]: Leaving directory '/<<PKGBUILDDIR>>/obj-arm-linux-gnueabihf'
make[1]: *** [Makefile:155: all] Error 2
make[1]: Leaving directory '/<<PKGBUILDDIR>>/obj-arm-linux-gnueabihf'
dh_auto_build: error: cd obj-arm-linux-gnueabihf && make -j4 "INSTALL=install --strip-program=true" returned exit code 2
make: *** [debian/rules:15: build-arch] Error 25

Tail of log for lib3mf on armhf:

+ _ZTVSt23_Sp_counted_ptr_inplaceIN3NMR6CModelESaIS1_ELN9__gnu_cxx12_Lock_policyE1EE@Base 1.8.0
+#MISSING: 1.8.1+ds-3# (arch=!armel !riscv64)_ZTVSt23_Sp_counted_ptr_inplaceIN3NMR6CModelESaIS1_ELN9__gnu_cxx12_Lock_policyE2EE@Base 1.8.0
+ _ZTVSt23_Sp_counted_ptr_inplaceIN3NMR6CSliceESaIS1_ELN9__gnu_cxx12_Lock_policyE1EE@Base 1.8.0
+#MISSING: 1.8.1+ds-3# (arch=!armel !riscv64)_ZTVSt23_Sp_counted_ptr_inplaceIN3NMR6CSliceESaIS1_ELN9__gnu_cxx12_Lock_policyE2EE@Base 1.8.0
+ _ZTVSt23_Sp_counted_ptr_inplaceIN3NMR7BEAMSETESaIS1_ELN9__gnu_cxx12_Lock_policyE1EE@Base 1.8.0
+#MISSING: 1.8.1+ds-3# (arch=!armel !riscv64)_ZTVSt23_Sp_counted_ptr_inplaceIN3NMR7BEAMSETESaIS1_ELN9__gnu_cxx12_Lock_policyE2EE@Base 1.8.0
  (arch=!ia64 !powerpcspe)_ZZNSt19_Sp_make_shared_tag5_S_tiEvE5__tag@Base 1.8.0
+ _ZZNSt8__detail18__to_chars_10_implIjEEvPcjT_E8__digits@Base 1.8.1+ds-3
  lib3mf_attachment_getpath@Base 1.8.0+ds
  lib3mf_attachment_getpathutf8@Base 1.8.0+ds
  lib3mf_attachment_getrelationshiptype@Base 1.8.0+ds
dh_makeshlibs: error: failing due to earlier errors
	mv debian/.debhelper/generated/lib3mf1/triggers.new debian/.debhelper/generated/lib3mf1/triggers
	rm -f debian/lib3mf-dev/DEBIAN/shlibs
make: *** [debian/rules:9: binary-arch] Error 25

Tail of log for haskell-ghc-lib-parser on armhf:

[187 of 228] Compiling FamInstEnv       ( compiler/types/FamInstEnv.hs, dist-ghc/build/FamInstEnv.o )
[188 of 228] Compiling CoreFVs          ( compiler/coreSyn/CoreFVs.hs, dist-ghc/build/CoreFVs.o )
[189 of 228] Compiling TcType           ( compiler/typecheck/TcType.hs, dist-ghc/build/TcType.o )
[190 of 228] Compiling TcRnTypes[boot]  ( compiler/typecheck/TcRnTypes.hs-boot, dist-ghc/build/TcRnTypes.o-boot )
[191 of 228] Compiling InstEnv          ( compiler/types/InstEnv.hs, dist-ghc/build/InstEnv.o )
[192 of 228] Compiling OptCoercion      ( compiler/types/OptCoercion.hs, dist-ghc/build/OptCoercion.o )
[193 of 228] Compiling TcEvidence       ( compiler/typecheck/TcEvidence.hs, dist-ghc/build/TcEvidence.o )
[194 of 228] Compiling GHC.Hs.Binds     ( compiler/GHC/Hs/Binds.hs, dist-ghc/build/GHC/Hs/Binds.o )
[195 of 228] Compiling GHC.Hs.Pat       ( compiler/GHC/Hs/Pat.hs, dist-ghc/build/GHC/Hs/Pat.o )
[196 of 228] Compiling GHC.Hs.Decls     ( compiler/GHC/Hs/Decls.hs, dist-ghc/build/GHC/Hs/Decls.o )
[197 of 228] Compiling GHC.Hs.Expr      ( compiler/GHC/Hs/Expr.hs, dist-ghc/build/GHC/Hs/Expr.o )
[198 of 228] Compiling GHC.Hs.Utils     ( compiler/GHC/Hs/Utils.hs, dist-ghc/build/GHC/Hs/Utils.o )
[199 of 228] Compiling GHC.Hs.Instances ( compiler/GHC/Hs/Instances.hs, dist-ghc/build/GHC/Hs/Instances.o )
ghc: out of memory (requested 1048576 bytes)
make: *** [/usr/share/cdbs/1/class/hlibrary.mk:147: build-ghc-stamp] Error 251

Tail of log for libmath-int128-perl on armhf:

Checking for strings.h... yes
Checking for inttypes.h... yes
Checking for stdint.h... yes
Checking for unistd.h... yes
Checking for uint64_t... yes
Checking for __int128... no
Checking for uint64_t... (cached) yes
Checking for int __attribute__ ((__mode__ (TI)))... 
  It looks like your compiler doesn't support a 128-bit integer type (one of
  "int __attribute__ ((__mode__ (TI)))" or "__int128"). One of these types is
  necessary to compile the Math::Int128 module.

no
dh_auto_configure: error: perl Makefile.PL INSTALLDIRS=vendor "OPTIMIZE=-g -O2 -fdebug-prefix-map=/<<PKGBUILDDIR>>=. -fstack-protector-strong -Wformat -Werror=format-security -Wdate-time -D_FORTIFY_SOURCE=2" "LD=arm-linux-gnueabihf-gcc -g -O2 -fdebug-prefix-map=/<<PKGBUILDDIR>>=. -fstack-protector-strong -Wformat -Werror=format-security -Wl,-z,relro -Wl,-z,now" returned exit code 1
make: *** [debian/rules:6: build-arch] Error 25

Tail of log for libmlx5 on armhf:

#define HAVE_STDLIB_H 1
#define HAVE_STRING_H 1
#define HAVE_MEMORY_H 1
#define HAVE_STRINGS_H 1
#define HAVE_INTTYPES_H 1
#define HAVE_STDINT_H 1
#define HAVE_UNISTD_H 1
#define HAVE_DLFCN_H 1
#define LT_OBJDIR ".libs/"
#define NVALGRIND 1
#define HAVE_LIBIBVERBS 1

configure: exit 1
dh_auto_configure: error: ./configure --build=arm-linux-gnueabihf --prefix=/usr --includedir=\${prefix}/include --mandir=\${prefix}/share/man --infodir=\${prefix}/share/info --sysconfdir=/etc --localstatedir=/var --disable-option-checking --disable-silent-rules --libdir=\${prefix}/lib/arm-linux-gnueabihf --libexecdir=\${prefix}/lib/arm-linux-gnueabihf --disable-maintainer-mode --disable-dependency-tracking returned exit code 1
make: *** [debian/rules:6: build-arch] Error 25

Tail of log for libnunc-stans on armhf:

mkdir -p bin
mkdir -p obj
gcc -MM -std=c99 -I"src" -I"inc" src/abstraction/abstraction_dcas.c >obj/abstraction_dcas.d
gcc -g -O2 -fdebug-prefix-map=/<<PKGBUILDDIR>>=. -fstack-protector-strong -Wformat -Werror=format-security  -c -fpic -Wno-unknown-pragmas -std=c99 -I"src" -I"inc"  -o obj/abstraction_dcas.o src/abstraction/abstraction_dcas.c
/tmp/cchzOwDG.s: Assembler messages:
/tmp/cchzOwDG.s:74: Error: selected processor does not support `ldrexd r6,r7,[r0]' in ARM mode
/tmp/cchzOwDG.s:74: Error: selected processor does not support `strexd lr,r2,r3,[r0]' in ARM mode
make[3]: *** [makefile.linux:79: obj/abstraction_dcas.o] Error 1
make[3]: Leaving directory '/<<PKGBUILDDIR>>/liblfds'
make[2]: *** [Makefile:921: all-recursive] Error 1
make[2]: Leaving directory '/<<PKGBUILDDIR>>'
make[1]: *** [Makefile:646: all] Error 2
make[1]: Leaving directory '/<<PKGBUILDDIR>>'
dh_auto_build: error: make -j1 returned exit code 2
make: *** [debian/rules:21: build-arch] Error 25

Tail of log for libtango on armhf:

dpkg-buildpackage: info: host architecture armhf
 fakeroot debian/rules clean
QUILT_PATCHES=debian/patches \
	quilt --quiltrc /dev/null pop -a -R || test $? = 2
No patch removed
rm -rf .pc debian/stamp-patched
dh_testdir
dh_testroot
rm -rf stamps objs
find build -type d -name "objs-*" | xargs rm -rf
rm -f build-stamp-*
dh_clean
dh_clean: warning: Compatibility levels before 10 are deprecated (level 7 in use)
 debian/rules build-arch
make: *** No rule to make target 'build-arch'.  Stop.

Tail of log for libretro-mupen64plus on armhf:

                 from ./libretro/opengl_state_machine.h:4,
                 from ./libretro/SDL_opengles2.h:29,
                 from gles2rice/src/osal_opengl.h:33,
                 from gles2rice/src/DeviceBuilder.cpp:21:
/usr/include/GLES2/gl2ext.h:3092:16: note: previous declaration as 'typedef double GLdouble'
 3092 | typedef double GLdouble;
      |                ^~~~~~~~
g++ -Wdate-time -D_FORTIFY_SOURCE=2 -g -fdebug-prefix-map=/<<BUILDDIR>>/libretro-mupen64plus-2.0+git20160207+dfsg2=. -fstack-protector-strong -Wformat -Werror=format-security -std=gnu++98 -MMD -O2 -DNDEBUG -DHAVE_NEON -D__LIBRETRO__ -DINLINE="inline" -DM64P_PLUGIN_API -DM64P_CORE_PROTOTYPES -D_ENDUSER_RELEASE -DSDL_VIDEO_OPENGL_ES2=1 -DSINC_LOWER_QUALITY -DHAVE_COMBINE_EXT -I./mupen64plus-core/src -I./mupen64plus-core/src/api -I./mupen64plus-core/src/plugin/audio_libretro -I./glide2gl/src/Glitch64/inc -I./libretro-common/include -I./libretro -DARM -fPIC -DARM -DNO_ASM -DARM -D__arm__ -DARM_ASM -DNOSSE -marm -D__NEON_OPT -mfpu=neon -mfloat-abi=hard -DGLES -DHAVE_OPENGLES2 -DDISABLE_3POINT -DUSE_GLES -DNEW_DYNAREC=3 -DDYNAREC -c gles2rice/src/FrameBuffer.cpp -o gles2rice/src/FrameBuffer.o
make[2]: *** [Makefile:408: gles2rice/src/DeviceBuilder.o] Error 1
make[2]: *** Waiting for unfinished jobs....
make[2]: Leaving directory '/<<BUILDDIR>>/libretro-mupen64plus-2.0+git20160207+dfsg2'
dh_auto_build: error: make -j4 "platform=armv gles neon hardfloat" returned exit code 2
make[1]: *** [debian/rules:19: override_dh_auto_build] Error 25
make[1]: Leaving directory '/<<BUILDDIR>>/libretro-mupen64plus-2.0+git20160207+dfsg2'
make: *** [debian/rules:16: build-arch] Error 2

Tail of log for libxsmm on armhf:

      |   ^~~~~
In file included from include/libxsmm.h:65,
                 from ./src/libxsmm_gemm_diff.h:34,
                 from ./src/libxsmm_main.c:31:
./src/libxsmm_main.c: In function 'libxsmm_init':
include/libxsmm_sync.h:70:29: warning: implicit declaration of function '__builtin_ia32_pause'; did you mean '__builtin_isspace'? [-Wimplicit-function-declaration]
   70 | # define LIBXSMM_SYNC_PAUSE __builtin_ia32_pause()
      |                             ^~~~~~~~~~~~~~~~~~~~
./src/libxsmm_main.c:719:36: note: in expansion of macro 'LIBXSMM_SYNC_PAUSE'
  719 |       if (0 != once) break; else { LIBXSMM_SYNC_PAUSE; }
      |                                    ^~~~~~~~~~~~~~~~~~
make[1]: *** [Makefile:721: build/intel64/libxsmm_main.o] Error 1
make[1]: Leaving directory '/<<PKGBUILDDIR>>'
dh_auto_build: error: make -j1 returned exit code 2
make: *** [debian/rules:7: build-arch] Error 25

Tail of log for libmaus2 on armhf:

                 from test/testsamrecoding.cpp:19:
/usr/include/c++/10/bits/vector.tcc: In function ‘int main(int, char**)’:
/usr/include/c++/10/bits/vector.tcc:121:21: note: parameter passing for argument of type ‘__gnu_cxx::__normal_iterator<libmaus2::bambam::BamAlignmentDecoderInfo*, std::vector<libmaus2::bambam::BamAlignmentDecoderInfo> >’ changed in GCC 7.1
  121 |    _M_realloc_insert(end(), std::forward<_Args>(__args)...);
      |    ~~~~~~~~~~~~~~~~~^~~~~~~~~~~~~~~~~~~~~~~~~~~~~~~~~~~~~~~
/usr/include/c++/10/bits/vector.tcc:121:21: note: parameter passing for argument of type ‘__gnu_cxx::__normal_iterator<libmaus2::bambam::BamAlignmentDecoderInfo*, std::vector<libmaus2::bambam::BamAlignmentDecoderInfo> >’ changed in GCC 7.1
  121 |    _M_realloc_insert(end(), std::forward<_Args>(__args)...);
      |    ~~~~~~~~~~~~~~~~~^~~~~~~~~~~~~~~~~~~~~~~~~~~~~~~~~~~~~~~
make[3]: Leaving directory '/<<BUILDDIR>>/libmaus2-2.0.722+dfsg/src'
make[2]: *** [Makefile:692: all-recursive] Error 1
make[2]: Leaving directory '/<<BUILDDIR>>/libmaus2-2.0.722+dfsg'
make[1]: *** [Makefile:574: all] Error 2
make[1]: Leaving directory '/<<BUILDDIR>>/libmaus2-2.0.722+dfsg'
dh_auto_build: error: make -j4 returned exit code 2
make: *** [debian/rules:12: binary-arch] Error 25

Tail of log for libsis-jhdf5-java on armhf:

[Utils] Attempting to create test-output/junitreports/TEST-ch.systemsx.cisd.hdf5.MatrixUtilsTest.xml
[Utils]   Directory test-output/junitreports exists: true
[Utils] Attempting to create test-output/junitreports/TEST-ch.systemsx.cisd.hdf5.io.HDF5DataSetRandomAccessFileTest.xml
[Utils]   Directory test-output/junitreports exists: true
[Utils] Attempting to create test-output/junitreports/TEST-ch.systemsx.cisd.hdf5.h5ar.UtilsTest.xml
[Utils]   Directory test-output/junitreports exists: true
[Utils] Attempting to create test-output/junitreports/TEST-ch.systemsx.cisd.hdf5.h5ar.ArchivingStrategyTest.xml
[Utils]   Directory test-output/junitreports exists: true
[Utils] Attempting to create test-output/junitreports/TEST-ch.systemsx.cisd.hdf5.h5ar.DirectoryIndexUpdaterTest.xml
[Utils]   Directory test-output/junitreports exists: true
[TestNG] Time taken by org.testng.reporters.JUnitReportReporter@6044d7: 957 ms
[TestNG] Time taken by org.testng.reporters.XMLReporter@10c2d26: 911 ms
make[1]: *** [debian/rules:53: override_dh_auto_test] Error 1
make[1]: Leaving directory '/<<PKGBUILDDIR>>'
make: *** [debian/rules:16: build-arch] Error 2

Tail of log for mensis on armhf:

checking for remove... yes
checking for shmat... yes
checking for IceConnectionNumber in -lICE... yes
checking for XOpenDevice in -lXi... no
checking for XkbQueryExtension in -lxkbui... no
checking for pthread_create in -lpthread... yes
checking for u_strcpy in -lgdraw... no
checking fontforge/basics.h usability... no
checking fontforge/basics.h presence... no
checking for fontforge/basics.h... no
You must install the include files for fontforge
before building mensis.
make[1]: *** [debian/rules:29: override_dh_auto_configure] Error 1
make[1]: Leaving directory '/<<PKGBUILDDIR>>'
make: *** [debian/rules:22: build-arch] Error 2

Tail of log for mes on armhf:

+ trace 'CCLD       lib/linux/arm-mes-gcc/exit-42.S' /usr/bin/gcc -nostdlib -g lib/linux/arm-mes-gcc/exit-42.S -o exit-42
+ shift
+ echo /usr/bin/gcc -nostdlib -g lib/linux/arm-mes-gcc/exit-42.S -o exit-42
+ eval /usr/bin/gcc -nostdlib -g lib/linux/arm-mes-gcc/exit-42.S -o exit-42
++ /usr/bin/gcc -nostdlib -g lib/linux/arm-mes-gcc/exit-42.S -o exit-42
gcc: error: lib/linux/arm-mes-gcc/exit-42.S: No such file or directory
gcc: fatal error: no input files
compilation terminated.
make[2]: *** [GNUmakefile:95: build] Error 1
make[2]: *** Waiting for unfinished jobs....
make[2]: Leaving directory '/<<PKGBUILDDIR>>'
dh_auto_build: error: make -j4 V=2 returned exit code 2
make[1]: *** [debian/rules:23: override_dh_auto_build] Error 25
make[1]: Leaving directory '/<<PKGBUILDDIR>>'
make: *** [debian/rules:17: binary-arch] Error 2

Tail of log for listaller on armhf:

  Command-line option `--thread` is deprecated and will be ignored

  Compilation failed: 7 error(s), 12 warning(s)



make[3]: *** [src/CMakeFiles/listaller-glib_precompile.dir/build.make:107: src/CMakeFiles/listaller-glib_precompile.dir/precompile.stamp] Error 1
make[3]: Leaving directory '/<<PKGBUILDDIR>>/obj-arm-linux-gnueabihf'
make[2]: *** [CMakeFiles/Makefile2:692: src/CMakeFiles/listaller-glib_precompile.dir/all] Error 2
make[2]: Leaving directory '/<<PKGBUILDDIR>>/obj-arm-linux-gnueabihf'
make[1]: *** [Makefile:144: all] Error 2
make[1]: Leaving directory '/<<PKGBUILDDIR>>/obj-arm-linux-gnueabihf'
dh_auto_build: error: cd obj-arm-linux-gnueabihf && make -j1 returned exit code 2
make: *** [debian/rules:15: build-arch] Error 25

Tail of log for micropython on armhf:

pass  unicode/unicode_subscr.py
skip  unix/extra_coverage.py
pass  unix/ffi_callback.py
pass  unix/ffi_float.py
pass  unix/ffi_float2.py
734 tests performed (19889 individual testcases)
728 tests passed
40 tests skipped: async_with async_with2 async_with_break async_with_return del_deref del_local exception_chain fun_name gen_yield_from_close generator_name scope_implicit try_finally_return2 try_reraise try_reraise2 unboundlocal cmd_parsetree btree1 vfs_blockdev vfs_fat_fileio1 vfs_fat_fileio2 vfs_fat_more vfs_fat_oldproto vfs_fat_ramdisk vfs_fat_ramdisklarge vfs_lfs vfs_lfs_corrupt vfs_lfs_error vfs_lfs_file vfs_lfs_mount emg_exc heapalloc_traceback opt_level_lineno schedule features print_exception sys_exc_info sys_settrace_features sys_settrace_generator sys_settrace_loop extra_coverage
6 tests failed: fun_largestate string_format2 import_pkg3 import_pkg4 import_pkg6 extreme_exc
make[2]: *** [Makefile:198: test] Error 1
make[2]: Leaving directory '/<<PKGBUILDDIR>>/ports/unix'
dh_auto_test: error: cd ports/unix && make -j4 test STRIP=true MICROPY_PY_BTREE=0 MICROPY_SSL_AXTLS=0 MICROPY_SSL_MBEDTLS=1 MICROPY_PY_JNI=1 "TESTS_ARGS=--emit native -e '(?:ussl_basic|mpy_native)'" returned exit code 2
make[1]: *** [debian/rules:67: override_dh_auto_test-arch] Error 25
make[1]: Leaving directory '/<<PKGBUILDDIR>>'
make: *** [debian/rules:37: binary-arch] Error 2

Tail of log for msrtool on armhf:

gcc -g -O2 -fdebug-prefix-map=/<<PKGBUILDDIR>>=. -fstack-protector-strong -Wformat -Werror=format-security -Os -Wall -Werror   -c -o msrutils.o msrutils.c
gcc -g -O2 -fdebug-prefix-map=/<<PKGBUILDDIR>>=. -fstack-protector-strong -Wformat -Werror=format-security -Os -Wall -Werror   -c -o sys.o sys.c
sys.c: In function 'cpuid':
sys.c:40:2: error: unknown register name '%edx' in 'asm'
   40 |  asm ("cpuid" : "=b" (outebx) : "a" (0) : "%ecx", "%edx");
      |  ^~~
sys.c:40:2: error: unknown register name '%ecx' in 'asm'
sys.c:54:2: error: unknown register name '%edx' in 'asm'
   54 |  asm ("cpuid" : "=a" (outeax) : "a" (1) : "%ebx", "%ecx", "%edx");
      |  ^~~
sys.c:54:2: error: unknown register name '%ecx' in 'asm'
sys.c:54:2: error: unknown register name '%ebx' in 'asm'
make[1]: *** [<builtin>: sys.o] Error 1
make[1]: Leaving directory '/<<PKGBUILDDIR>>'
make: *** [/usr/share/cdbs/1/class/makefile.mk:77: debian/stamp-makefile-build] Error 2

Tail of log for ngmlr on armhf:

[ 28%] Building CXX object src/CMakeFiles/ngmlr.dir/ConvexAlignFast.cpp.o
cd /<<BUILDDIR>>/ngmlr-0.2.7+dfsg/obj-arm-linux-gnueabihf/src && /usr/bin/c++   -I/usr/include/htslib -I/<<BUILDDIR>>/ngmlr-0.2.7+dfsg/src/../lib  -g -O2 -fdebug-prefix-map=/<<BUILDDIR>>/ngmlr-0.2.7+dfsg=. -fstack-protector-strong -Wformat -Werror=format-security -Wdate-time -D_FORTIFY_SOURCE=2 -std=c++11   -o CMakeFiles/ngmlr.dir/ConvexAlignFast.cpp.o -c /<<BUILDDIR>>/ngmlr-0.2.7+dfsg/src/ConvexAlignFast.cpp
/<<BUILDDIR>>/ngmlr-0.2.7+dfsg/src/ConvexAlignFast.cpp:11:10: fatal error: x86intrin.h: No such file or directory
   11 | #include <x86intrin.h>
      |          ^~~~~~~~~~~~~
compilation terminated.
make[3]: *** [src/CMakeFiles/ngmlr.dir/build.make:144: src/CMakeFiles/ngmlr.dir/ConvexAlignFast.cpp.o] Error 1
make[3]: *** Waiting for unfinished jobs....
make[3]: Leaving directory '/<<BUILDDIR>>/ngmlr-0.2.7+dfsg/obj-arm-linux-gnueabihf'
make[2]: *** [CMakeFiles/Makefile2:126: src/CMakeFiles/ngmlr.dir/all] Error 2
make[2]: Leaving directory '/<<BUILDDIR>>/ngmlr-0.2.7+dfsg/obj-arm-linux-gnueabihf'
make[1]: *** [Makefile:133: all] Error 2
make[1]: Leaving directory '/<<BUILDDIR>>/ngmlr-0.2.7+dfsg/obj-arm-linux-gnueabihf'
dh_auto_build: error: cd obj-arm-linux-gnueabihf && make -j4 "INSTALL=install --strip-program=true" returned exit code 2
make: *** [debian/rules:10: binary-arch] Error 25

Tail of log for metabat on armhf:

                 from /<<PKGBUILDDIR>>/src/metabat1.h:38,
                 from /<<PKGBUILDDIR>>/src/metabat1.cpp:1:
/usr/include/c++/10/bits/stl_algo.h:4892:18: note: parameter passing for argument of type ‘__gnu_cxx::__normal_iterator<std::pair<int, double>*, std::vector<std::pair<int, double> > >’ changed in GCC 7.1
 4892 |       std::__sort(__first, __last, __gnu_cxx::__ops::__iter_comp_iter(__comp));
      |       ~~~~~~~~~~~^~~~~~~~~~~~~~~~~~~~~~~~~~~~~~~~~~~~~~~~~~~~~~~~~~~~~~~~~~~~~
[ 87%] Linking CXX executable metabat1
cd /<<PKGBUILDDIR>>/obj-arm-linux-gnueabihf/src && /usr/bin/cmake -E cmake_link_script CMakeFiles/metabat1.dir/link.txt --verbose=1
/usr/bin/c++  -g -O2 -fdebug-prefix-map=/<<PKGBUILDDIR>>=. -fstack-protector-strong -Wformat -Werror=format-security -Wdate-time -D_FORTIFY_SOURCE=2 -fopenmp  -Wl,-z,relro -Wl,-z,now  CMakeFiles/metabat1.dir/metabat1.cpp.o  -o metabat1  -lhts /usr/lib/arm-linux-gnueabihf/libz.so /usr/lib/arm-linux-gnueabihf/libboost_program_options.a /usr/lib/arm-linux-gnueabihf/libboost_filesystem.a /usr/lib/arm-linux-gnueabihf/libboost_system.a /usr/lib/arm-linux-gnueabihf/libboost_graph.a /usr/lib/arm-linux-gnueabihf/libboost_serialization.a /usr/lib/arm-linux-gnueabihf/libboost_iostreams.a /usr/lib/arm-linux-gnueabihf/libboost_regex.a 
make[3]: Leaving directory '/<<PKGBUILDDIR>>/obj-arm-linux-gnueabihf'
[ 87%] Built target metabat1
make[2]: Leaving directory '/<<PKGBUILDDIR>>/obj-arm-linux-gnueabihf'
make[1]: *** [Makefile:144: all] Error 2
make[1]: Leaving directory '/<<PKGBUILDDIR>>/obj-arm-linux-gnueabihf'
dh_auto_build: error: cd obj-arm-linux-gnueabihf && make -j4 "INSTALL=install --strip-program=true" returned exit code 2
make: *** [debian/rules:11: binary-arch] Error 25

Tail of log for nsd3 on armhf:

#define FACILITY LOG_DAEMON
#define MAX_INTERFACES 8
#define TCP_TIMEOUT 120
#define ROOT_SERVER /**/
#define INET6 /**/
#define BIND8_STATS /**/
#define NDEBUG /**/
#define RATELIMIT /**/
#define HAVE_SSL /**/

configure: exit 1
dh_auto_configure: error: ./configure --build=arm-linux-gnueabihf --prefix=/usr --includedir=\${prefix}/include --mandir=\${prefix}/share/man --infodir=\${prefix}/share/info --sysconfdir=/etc --localstatedir=/var --disable-option-checking --disable-silent-rules --libexecdir=\${prefix}/lib/nsd3 --disable-maintainer-mode --disable-dependency-tracking --with-configdir=/etc/nsd3 --with-nsd_conf_file=/etc/nsd3/nsd.conf --with-pidfile=/var/run/nsd3/nsd.pid --with-dbfile=/var/lib/nsd3/nsd.db --with-zonesdir=/etc/nsd3 --with-difffile=/var/lib/nsd3/ixfr.db --with-xfrdfile=/var/lib/nsd3/xfrd.state --disable-largefile --enable-root-server --enable-mmap --enable-ratelimit returned exit code 1
make[1]: *** [debian/rules:32: override_dh_auto_configure] Error 25
make[1]: Leaving directory '/<<PKGBUILDDIR>>'
make: *** [debian/rules:26: build-arch] Error 2

Tail of log for open-axiom on armhf:

/* confdefs.h */
#define PACKAGE_NAME "OpenAxiom"
#define PACKAGE_TARNAME "openaxiom"
#define PACKAGE_VERSION "1.5.0-2013-06-21"
#define PACKAGE_STRING "OpenAxiom 1.5.0-2013-06-21"
#define PACKAGE_BUGREPORT "open-axiom-bugs@lists.sf.net"
#define PACKAGE_URL ""
#define PACKAGE "openaxiom"
#define VERSION "1.5.0-2013-06-21"
#define OPENAXIOM_BASE_RTS Runtime::sbcl

configure: exit 1
dh_auto_configure: error: cd build-tree && ../configure --build=arm-linux-gnueabihf --prefix=/usr --includedir=\${prefix}/include --mandir=\${prefix}/share/man --infodir=\${prefix}/share/info --sysconfdir=/etc --localstatedir=/var --disable-option-checking --disable-silent-rules --libexecdir=\${prefix}/lib/open-axiom --disable-maintainer-mode --disable-dependency-tracking --with-lisp=sbcl --with-x --disable-gcl returned exit code 1
make: *** [debian/rules:50: configure-stamp] Error 25

Tail of log for olive on armhf:

                 from ./project/effect.h:10,
                 from playback/playback.cpp:11:
/usr/include/arm-linux-gnueabihf/qt5/QtGui/qopengltexture.h:466:24: note: declared here
  466 |     QT_DEPRECATED void setData(int mipLevel,
      |                        ^~~~~~~
playback/playback.cpp:247:13: warning: this 'if' clause does not guard... [-Wmisleading-indentation]
  247 |             if (copied) delete [] data;
      |             ^~
playback/playback.cpp:249:4: note: ...this statement, but the latter is misleadingly indented as if it were guarded by the 'if'
  249 |    glPixelStorei(GL_UNPACK_ROW_LENGTH, 0);
      |    ^~~~~~~~~~~~~
make[1]: *** [Makefile:1392: playback.o] Error 1
make[1]: Leaving directory '/<<PKGBUILDDIR>>'
dh_auto_build: error: make -j4 returned exit code 2
make: *** [debian/rules:17: build-arch] Error 25

Tail of log for neuron on armhf:

libtool: link: (cd ".libs" && rm -f "libocxt.so" && ln -s "libocxt.so.0.0.0" "libocxt.so")
libtool: link: ( cd ".libs" && rm -f "libocxt.la" && ln -s "../libocxt.la" "libocxt.la" )
make[6]: Leaving directory '/<<PKGBUILDDIR>>/src/oc'
make[5]: *** [Makefile:562: all] Error 2
make[5]: Leaving directory '/<<PKGBUILDDIR>>/src/oc'
make[4]: *** [Makefile:519: all-recursive] Error 1
make[4]: Leaving directory '/<<PKGBUILDDIR>>/src'
make[3]: *** [Makefile:656: all-recursive] Error 1
make[3]: Leaving directory '/<<PKGBUILDDIR>>'
make[2]: *** [Makefile:514: all] Error 2
make[2]: Leaving directory '/<<PKGBUILDDIR>>'
dh_auto_build: error: make -j4 returned exit code 2
make[1]: *** [debian/rules:32: override_dh_auto_build] Error 25
make[1]: Leaving directory '/<<PKGBUILDDIR>>'
make: *** [debian/rules:15: build-arch] Error 2

Tail of log for osrm on armhf:

/usr/bin/cmake -E cmake_link_script CMakeFiles/OSRM.dir/link.txt --verbose=1
/usr/bin/ar qc libOSRM.a  CMakeFiles/OSRM.dir/library/osrm_impl.cpp.o CMakeFiles/OSRM.dir/descriptors/description_factory.cpp.o CMakeFiles/OSRM.dir/data_structures/route_parameters.cpp.o CMakeFiles/OSRM.dir/data_structures/search_engine_data.cpp.o CMakeFiles/OSRM.dir/util/bearing.cpp.o CMakeFiles/OSRM.dir/algorithms/douglas_peucker.cpp.o CMakeFiles/OSRM.dir/algorithms/polyline_compressor.cpp.o CMakeFiles/OSRM.dir/algorithms/polyline_formatter.cpp.o CMakeFiles/OSRM.dir/server/http/reply.cpp.o CMakeFiles/ANGLE.dir/util/compute_angle.cpp.o CMakeFiles/COORDINATE.dir/data_structures/coordinate.cpp.o CMakeFiles/COORDINATE.dir/data_structures/coordinate_calculation.cpp.o CMakeFiles/GITDESCRIPTION.dir/util/git_sha.cpp.o CMakeFiles/FINGERPRINT.dir/util/fingerprint.cpp.o CMakeFiles/LOGGER.dir/util/simple_logger.cpp.o CMakeFiles/PHANTOMNODE.dir/data_structures/phantom_node.cpp.o CMakeFiles/EXCEPTION.dir/util/osrm_exception.cpp.o CMakeFiles/MERCATOR.dir/util/mercator.cpp.o CMakeFiles/IMPORT.dir/data_structures/external_memory_node.cpp.o CMakeFiles/IMPORT.dir/data_structures/import_edge.cpp.o
/usr/bin/ranlib libOSRM.a
make[3]: Leaving directory '/<<PKGBUILDDIR>>/obj-arm-linux-gnueabihf'
[ 71%] Built target OSRM
[ 73%] Linking CXX executable osrm-prepare
/usr/bin/cmake -E cmake_link_script CMakeFiles/osrm-prepare.dir/link.txt --verbose=1
/usr/bin/c++  -g -O2 -fdebug-prefix-map=/<<PKGBUILDDIR>>=. -fstack-protector-strong -Wformat -Werror=format-security -Wdate-time -D_FORTIFY_SOURCE=2 -Wall -pedantic -fPIC -fdiagnostics-color=auto -std=c++11  -fopenmp -O3 -DNDEBUG  -Wl,-z,relro -rdynamic CMakeFiles/osrm-prepare.dir/prepare.cpp.o CMakeFiles/osrm-prepare.dir/contractor/contractor_options.cpp.o CMakeFiles/osrm-prepare.dir/contractor/edge_based_graph_factory.cpp.o CMakeFiles/osrm-prepare.dir/contractor/geometry_compressor.cpp.o CMakeFiles/osrm-prepare.dir/contractor/processing_chain.cpp.o CMakeFiles/osrm-prepare.dir/data_structures/hilbert_value.cpp.o CMakeFiles/ANGLE.dir/util/compute_angle.cpp.o CMakeFiles/FINGERPRINT.dir/util/fingerprint.cpp.o CMakeFiles/GITDESCRIPTION.dir/util/git_sha.cpp.o CMakeFiles/COORDINATE.dir/data_structures/coordinate.cpp.o CMakeFiles/COORDINATE.dir/data_structures/coordinate_calculation.cpp.o CMakeFiles/IMPORT.dir/data_structures/external_memory_node.cpp.o CMakeFiles/IMPORT.dir/data_structures/import_edge.cpp.o CMakeFiles/LOGGER.dir/util/simple_logger.cpp.o CMakeFiles/RESTRICTION.dir/data_structures/restriction_map.cpp.o CMakeFiles/EXCEPTION.dir/util/osrm_exception.cpp.o CMakeFiles/MERCATOR.dir/util/mercator.cpp.o  -o osrm-prepare  -lrt /usr/lib/arm-linux-gnueabihf/libboost_date_time.so.1.71.0 /usr/lib/arm-linux-gnueabihf/libboost_filesystem.so.1.71.0 /usr/lib/arm-linux-gnueabihf/libboost_iostreams.so.1.71.0 /usr/lib/arm-linux-gnueabihf/libboost_program_options.so.1.71.0 /usr/lib/arm-linux-gnueabihf/libboost_regex.so.1.71.0 /usr/lib/arm-linux-gnueabihf/libboost_system.so.1.71.0 /usr/lib/arm-linux-gnueabihf/libboost_thread.so.1.71.0 /usr/lib/arm-linux-gnueabihf/libboost_unit_test_framework.so.1.71.0 -lpthread -ltbb -ltbbmalloc -lluabind -llua5.2 -lstxxl -Wl,-Bstatic -losmpbf -Wl,-Bdynamic -lprotobuf /usr/lib/arm-linux-gnueabihf/libboost_atomic.so.1.71.0 -lpthread 
make[3]: Leaving directory '/<<PKGBUILDDIR>>/obj-arm-linux-gnueabihf'
[ 73%] Built target osrm-prepare
make[2]: Leaving directory '/<<PKGBUILDDIR>>/obj-arm-linux-gnueabihf'
make[1]: *** [Makefile:133: all] Error 2
make[1]: Leaving directory '/<<PKGBUILDDIR>>/obj-arm-linux-gnueabihf'
dh_auto_build: error: cd obj-arm-linux-gnueabihf && make -j4 returned exit code 2
make: *** [debian/rules:6: build-arch] Error 25

Tail of log for percona-xtradb-cluster-galera-2.x on armhf:

   debian/rules override_dh_auto_build
make[1]: Entering directory '/<<PKGBUILDDIR>>'
scons revno=318911d boost_pool=0 garb/garbd libgalera_smm.so 
scons: Reading SConscript files ...
  File "/<<PKGBUILDDIR>>/SConstruct", line 23

    print 'Host: ' + sysname + ' ' + machine

          ^

SyntaxError: Missing parentheses in call to 'print'. Did you mean print('Host: ' + sysname + ' ' + machine)?

make[1]: *** [debian/rules:15: override_dh_auto_build] Error 2
make[1]: Leaving directory '/<<PKGBUILDDIR>>'
make: *** [debian/rules:18: build-arch] Error 2

Tail of log for plink2 on armhf:

In file included from ../include/plink2_bgzf.h:36,
                 from ../include/plink2_text.h:111,
                 from ../plink2_decompress.h:23,
                 from ../plink2_common.h:27,
                 from ../plink2_set.h:21,
                 from ../plink2_set.cc:18:
../include/plink2_string.h:1517:4: error: #error "Unaligned accesses in IsNanStr()."
 1517 | #  error "Unaligned accesses in IsNanStr()."
      |    ^~~~~
make[2]: *** [Makefile:155: plink2""] Error 1
make[2]: Leaving directory '/<<BUILDDIR>>/plink2-2.00~a3-200511+dfsg/build_dynamic'
dh_auto_build: error: cd build_dynamic && make -j4 "INSTALL=install --strip-program=true" returned exit code 2
make[1]: *** [debian/rules:66: override_dh_auto_build-arch] Error 25
make[1]: Leaving directory '/<<BUILDDIR>>/plink2-2.00~a3-200511+dfsg'
make: *** [debian/rules:15: binary-arch] Error 2

Tail of log for openmm on armhf:

In file included from /<<BUILDDIR>>/openmm-7.4.0.491.gac5a8f71+dfsg/libraries/vecmath/src/vecmath.cpp:2:
/<<BUILDDIR>>/openmm-7.4.0.491.gac5a8f71+dfsg/libraries/vecmath/include/neon_mathfun.h:53:25: note: called from here
   53 |   v4sf one = vdupq_n_f32(1);
      |              ~~~~~~~~~~~^~~
make[4]: *** [CMakeFiles/OpenMM.dir/build.make:2523: CMakeFiles/OpenMM.dir/libraries/vecmath/src/vecmath.cpp.o] Error 1
make[4]: *** Waiting for unfinished jobs....
make[4]: Leaving directory '/<<BUILDDIR>>/openmm-7.4.0.491.gac5a8f71+dfsg/obj-arm-linux-gnueabihf'
make[3]: *** [CMakeFiles/Makefile2:1393: CMakeFiles/OpenMM.dir/all] Error 2
make[3]: Leaving directory '/<<BUILDDIR>>/openmm-7.4.0.491.gac5a8f71+dfsg/obj-arm-linux-gnueabihf'
make[2]: *** [Makefile:144: all] Error 2
make[2]: Leaving directory '/<<BUILDDIR>>/openmm-7.4.0.491.gac5a8f71+dfsg/obj-arm-linux-gnueabihf'
dh_auto_build: error: cd obj-arm-linux-gnueabihf && make -j4 "INSTALL=install --strip-program=true" returned exit code 2
make[1]: *** [debian/rules:31: override_dh_auto_build] Error 25
make[1]: Leaving directory '/<<BUILDDIR>>/openmm-7.4.0.491.gac5a8f71+dfsg'
make: *** [debian/rules:25: binary-arch] Error 2

Tail of log for octave-tisean on armhf:

***** ###############################################################
***** fail("lazy([(1:10);(1:10)],7,-0.06)");
***** fail("lazy((1:10),0,0.04)");
***** fail("[a,b,c] = lazy((1:10),1,0.05)");
***** test
 "In is generated from Octave using 'in = 1 + 0.5 * rand(10,1);'";
 in = [1.47007925526322;1.168775342017635;1.10943000146922; 1.174293926353764;  1.075741574572656; 1.373465364407417; 1.089417388489702; 1.403669883669071;1.452726826806777;  1.016960990335037];
 "res was generated using 'lazy -m1 -v0.06 in.dat' from TISEAN 'lazy'";
 res = [1.47007930, 0.00000000; 1.17153454, -2.75921822E-03; 1.10942996, 0.00000000; 1.17153454, 2.75933743E-03; 1.07574153, 0.00000000; 1.37346542, 0.00000000; 1.08941734, 0.00000000; 1.40366983, 0.00000000; 1.45272684, 0.00000000; 1.01696098, 0.00000000];
 [al,bl] = lazy(in, 1, -0.06);
 assert([al,bl],res,1e-6);
4 tests, 4 passed, 0 known failure, 0 skipped
Summary: 162 tests, 152 passed, 0 known failures, 0 skipped
Some tests failed.  Giving up...
make: *** [debian/rules:5: binary-arch] Error 1

Tail of log for prboom on armhf:

      |                                png_error_ptr
i_sshot.c:234:32: note: each undeclared identifier is reported only once for each function it appears in
i_sshot.c:282:43: error: 'png_infopp_NULL' undeclared (first use in this function); did you mean 'png_infopp'?
  282 |       png_destroy_write_struct(&png_ptr,  png_infopp_NULL);
      |                                           ^~~~~~~~~~~~~~~
      |                                           png_infopp
make[4]: *** [Makefile:242: i_sshot.o] Error 1
make[4]: Leaving directory '/<<BUILDDIR>>/prboom-2.5.0+dfsg1/src/SDL'
make[3]: *** [Makefile:460: all-recursive] Error 1
make[3]: Leaving directory '/<<BUILDDIR>>/prboom-2.5.0+dfsg1/src'
make[2]: *** [Makefile:285: all-recursive] Error 1
make[2]: Leaving directory '/<<BUILDDIR>>/prboom-2.5.0+dfsg1'
make[1]: *** [Makefile:205: all] Error 2
make[1]: Leaving directory '/<<BUILDDIR>>/prboom-2.5.0+dfsg1'
make: *** [debian/rules:28: build-stamp] Error 2

Tail of log for py-sendfile on armhf:

running install_scripts
find /<<PKGBUILDDIR>>/debian/python-sendfile-dbg/usr/lib/python2.7/ ! -type d ! -name '*_d\.so' \
	-delete
find /<<PKGBUILDDIR>>/debian/python-sendfile-dbg/usr/lib/python2.7/ -depth -empty -delete
touch install-debug-python2.7
dh_testdir
dh_testroot
dh_installchangelogs -a
dh_installchangelogs: warning: Compatibility levels before 10 are deprecated (level 5 in use)
dh_installdocs -a
dh_installdocs: warning: Compatibility levels before 10 are deprecated (level 5 in use)
dh_pysupport -a
dh_pysupport: warning: This program is deprecated, you should use dh_python2 instead. Migration guide: http://deb.li/dhs2p
dh_pysupport: error: Cannot detect default Python version
make: *** [debian/rules:57: binary-arch] Error 25

Tail of log for python-parasail on armhf:

creating /<<PKGBUILDDIR>>/.pybuild/cpython3_3.8/build/parasail
copying parasail/bindings_v1.py -> /<<PKGBUILDDIR>>/.pybuild/cpython3_3.8/build/parasail
copying parasail/bindings_v2.py -> /<<PKGBUILDDIR>>/.pybuild/cpython3_3.8/build/parasail
copying parasail/__init__.py -> /<<PKGBUILDDIR>>/.pybuild/cpython3_3.8/build/parasail
   dh_auto_test -a -O--buildsystem=pybuild
I: pybuild base:217: cd /<<PKGBUILDDIR>>/.pybuild/cpython3_3.8/build; python3.8 -m pytest tests
============================= test session starts ==============================
platform linux -- Python 3.8.5, pytest-4.6.11, py-1.8.1, pluggy-0.13.0
rootdir: /<<PKGBUILDDIR>>
collected 16 items

tests/test_basic.py ...Segmentation fault
E: pybuild pybuild:352: test: plugin distutils failed with: exit code=139: cd /<<PKGBUILDDIR>>/.pybuild/cpython3_3.8/build; python3.8 -m pytest tests
dh_auto_test: error: pybuild --test --test-pytest -i python{version} -p 3.8 returned exit code 13
make: *** [debian/rules:21: binary-arch] Error 25

Tail of log for python-peachpy on armhf:

----------------------------------------------------------------------
Traceback (most recent call last):
  File "/<<PKGBUILDDIR>>/.pybuild/cpython3_3.8_peachpy/build/test/x86_64/test_load.py", line 28, in runTest
    py_multiply = asm_multiply.finalize(abi.detect()).encode().load()
  File "/<<PKGBUILDDIR>>/.pybuild/cpython3_3.8_peachpy/build/peachpy/x86_64/function.py", line 308, in finalize
    raise TypeError("%s is not an ABI object" % str(abi))
TypeError: None is not an ABI object

----------------------------------------------------------------------
Ran 1309 tests in 4.097s

FAILED (errors=1)
E: pybuild pybuild:352: test: plugin distutils failed with: exit code=1: cd '/<<PKGBUILDDIR>>/.pybuild/cpython3_3.8_peachpy/build'; python3.8 -m unittest discover -v 
dh_auto_test: error: pybuild --test -i python{version} -p 3.8 returned exit code 13
make: *** [debian/rules:8: binary-arch] Error 25

Tail of log for prometheus-libvirt-exporter on armhf:

text/template
go/doc
gopkg.in/alecthomas/kingpin.v2
expvar
github.com/prometheus/common/expfmt
github.com/prometheus/client_golang/prometheus
github.com/prometheus/client_golang/prometheus/promhttp
# github.com/libvirt/libvirt-go
src/github.com/libvirt/libvirt-go/connect.go:181:77: constant 2147483648 overflows ConnectGetAllDomainStatsFlags
src/github.com/libvirt/libvirt-go/domain_events.go:332:18: type [1073741824]_Ctype_struct__virDomainEventGraphicsSubjectIdentity larger than address space
src/github.com/libvirt/libvirt-go/domain_events.go:332:18: type [1073741824]_Ctype_struct__virDomainEventGraphicsSubjectIdentity too large
dh_auto_build: error: cd build && go install -trimpath -v -p 4 github.com/kumina/libvirt_exporter github.com/kumina/libvirt_exporter/libvirt_schema returned exit code 2
make[1]: *** [debian/rules:19: override_dh_auto_build] Error 25
make[1]: Leaving directory '/<<BUILDDIR>>/prometheus-libvirt-exporter-0.1.1+git20190725.256cf3c'
make: *** [debian/rules:12: build-arch] Error 2

Tail of log for photoflow on armhf:

c++: error: unrecognized command-line option '-mno-sse3'
cd /<<BUILDDIR>>/photoflow-0.2.8+git20200114/obj-arm-linux-gnueabihf/src && /usr/bin/c++  -DLENSFUN_HAS_OVERLOADED_FIND_LENSES=1 -DVIPS_GET_BLOB_REQUIRES_CONST_VOID_POINTER=1 -I/usr/include/gtkmm-2.4 -I/usr/lib/arm-linux-gnueabihf/gtkmm-2.4/include -I/usr/include/atkmm-1.6 -I/usr/include/gtk-unix-print-2.0 -I/usr/include/gtk-2.0 -I/usr/include/gdkmm-2.4 -I/usr/lib/arm-linux-gnueabihf/gdkmm-2.4/include -I/usr/include/giomm-2.4 -I/usr/lib/arm-linux-gnueabihf/giomm-2.4/include -I/usr/include/pangomm-1.4 -I/usr/lib/arm-linux-gnueabihf/pangomm-1.4/include -I/usr/include/glibmm-2.4 -I/usr/lib/arm-linux-gnueabihf/glibmm-2.4/include -I/usr/include/cairomm-1.0 -I/usr/lib/arm-linux-gnueabihf/cairomm-1.0/include -I/usr/include/sigc++-2.0 -I/usr/lib/arm-linux-gnueabihf/sigc++-2.0/include -I/usr/lib/arm-linux-gnueabihf/gtk-2.0/include -I/usr/include/pango-1.0 -I/usr/include/atk-1.0 -I/usr/include/gdk-pixbuf-2.0 -I/usr/include/libmount -I/usr/include/blkid -I/usr/include/fribidi -I/usr/include/cairo -I/usr/include/pixman-1 -I/usr/include/harfbuzz -I/usr/include/glib-2.0 -I/usr/lib/arm-linux-gnueabihf/glib-2.0/include -I/usr/include/uuid -I/usr/include/freetype2 -I/usr/include/libpng16 -I/<<BUILDDIR>>/photoflow-0.2.8+git20200114/src/external -I/usr/include/OpenEXR -I/usr/include/libxml2 -I/usr/include/orc-0.4 -I/usr/include/libgsf-1 -I/usr/include/arm-linux-gnueabihf/ImageMagick-6 -I/usr/include/ImageMagick-6 -I/usr/include/poppler/glib -I/usr/include/poppler -I/usr/include/librsvg-2.0 -I/usr/include/openslide -I/usr/lib/arm-linux-gnueabihf/hdf5/serial/include -I/<<BUILDDIR>>/photoflow-0.2.8+git20200114/src -I/<<BUILDDIR>>/photoflow-0.2.8+git20200114/src/external/rawspeed/src/librawspeed -I/<<BUILDDIR>>/photoflow-0.2.8+git20200114/src/external/rawspeed/src/external -I/<<BUILDDIR>>/photoflow-0.2.8+git20200114/obj-arm-linux-gnueabihf/src/external/rawspeed/src -I/usr/include/lensfun -I/<<BUILDDIR>>/photoflow-0.2.8+git20200114/src/external/librtprocess/src/include  -g -O2 -fdebug-prefix-map=/<<BUILDDIR>>/photoflow-0.2.8+git20200114=. -fstack-protector-strong -Wformat -Werror=format-security -Wdate-time -D_FORTIFY_SOURCE=2 -DPF_HAS_LENSFUN   -O3 -ftree-vectorize -funroll-loops -fomit-frame-pointer -DNDEBUG  -std=gnu++14 -march=nocona -mno-sse3 -mtune=generic -Wno-error=narrowing -Dgmic_build -Dcimg_use_vt100 -Dgmic_is_parallel -Dcimg_use_fftw3 -Dcimg_use_tiff -Dcimg_use_zlib -Dcimg_display=0 -fno-ipa-sra -fpermissive -I/<<BUILDDIR>>/photoflow-0.2.8+git20200114/src/dt -DLIBRAW_NODLL -DINSTALL_PREFIX='"/usr"'  -Wno-deprecated-register -Wno-deprecated-declarations -DLOCALEDIR="/usr/share/locale" -DGTKMM_2  -Wno-unused-parameter -fPIC   -o CMakeFiles/pfgui.dir/gui/histogram.cc.o -c /<<BUILDDIR>>/photoflow-0.2.8+git20200114/src/gui/histogram.cc
make[3]: *** [src/CMakeFiles/pfgui.dir/build.make:92: src/CMakeFiles/pfgui.dir/gui/help.cc.o] Error 1
c++: error: unrecognized -march target: nocona
c++: note: valid arguments are: armv4 armv4t armv5t armv5te armv5tej armv6 armv6j armv6k armv6z armv6kz armv6zk armv6t2 armv6-m armv6s-m armv7 armv7-a armv7ve armv7-r armv7-m armv7e-m armv8-a armv8.1-a armv8.2-a armv8.3-a armv8.4-a armv8.5-a armv8.6-a armv8-m.base armv8-m.main armv8-r armv8.1-m.main iwmmxt iwmmxt2 native
c++: error: missing argument to '-march='
c++: error: unrecognized command-line option '-mno-sse3'
make[3]: *** [src/CMakeFiles/pfgui.dir/build.make:105: src/CMakeFiles/pfgui.dir/gui/histogram.cc.o] Error 1
make[3]: Leaving directory '/<<BUILDDIR>>/photoflow-0.2.8+git20200114/obj-arm-linux-gnueabihf'
make[2]: *** [CMakeFiles/Makefile2:686: src/CMakeFiles/pfgui.dir/all] Error 2
make[2]: Leaving directory '/<<BUILDDIR>>/photoflow-0.2.8+git20200114/obj-arm-linux-gnueabihf'
make[1]: *** [Makefile:133: all] Error 2
make[1]: Leaving directory '/<<BUILDDIR>>/photoflow-0.2.8+git20200114/obj-arm-linux-gnueabihf'
dh_auto_build: error: cd obj-arm-linux-gnueabihf && make -j4 "INSTALL=install --strip-program=true" returned exit code 2
make: *** [debian/rules:14: build-arch] Error 25

Tail of log for projectm on armhf:

qprojectm_mainwindow.cpp:551:3: note: here
  551 |   case Qt::Key_L:
      |   ^~~~
make[5]: *** [Makefile:533: qprojectm_mainwindow.o] Error 1
make[5]: Leaving directory '/<<PKGBUILDDIR>>/src/projectM-qt'
make[4]: *** [Makefile:454: all] Error 2
make[4]: Leaving directory '/<<PKGBUILDDIR>>/src/projectM-qt'
make[3]: *** [Makefile:458: all-recursive] Error 1
make[3]: Leaving directory '/<<PKGBUILDDIR>>/src'
make[2]: *** [Makefile:526: all-recursive] Error 1
make[2]: Leaving directory '/<<PKGBUILDDIR>>'
make[1]: *** [Makefile:416: all] Error 2
make[1]: Leaving directory '/<<PKGBUILDDIR>>'
dh_auto_build: error: make -j4 returned exit code 2
make: *** [debian/rules:9: binary-arch] Error 25

Tail of log for qwertone on armhf:

debian cargo wrapper: options, profiles, parallel: ['parallel=4'] [] ['-j4']
debian cargo wrapper: rust_type, gnu_type: arm-unknown-linux-gnueabihf, arm-linux-gnueabihf
debian cargo wrapper: linking /usr/share/cargo/registry/* into /<<PKGBUILDDIR>>/debian/cargo_registry/
   dh_auto_build -a -O--buildsystem=cargo
   dh_auto_test -a -O--buildsystem=cargo
debian cargo wrapper: options, profiles, parallel: ['parallel=4'] [] ['-j4']
debian cargo wrapper: rust_type, gnu_type: arm-unknown-linux-gnueabihf, arm-linux-gnueabihf
debian cargo wrapper: running subprocess (['env', 'RUST_BACKTRACE=1', '/usr/bin/cargo', '-Zavoid-dev-deps', 'build', '--verbose', '--verbose', '-j4', '--target', 'arm-unknown-linux-gnueabihf'],) {}
error: failed to select a version for the requirement `crossbeam-channel = "^0.3"`
  candidate versions found which didn't match: 0.4.2
  location searched: directory source `/<<PKGBUILDDIR>>/debian/cargo_registry` (which is replacing registry `https://github.com/rust-lang/crates.io-index`)
required by package `qwertone v0.1.0 (/<<PKGBUILDDIR>>)`
perhaps a crate was updated and forgotten to be re-vendored?
dh_auto_test: error: /usr/share/cargo/bin/cargo build returned exit code 101
make: *** [debian/rules:3: binary-arch] Error 25

Tail of log for qtjsbackend-opensource-src on armhf:

../3rdparty/v8/src/objects.h:7486:36: error: left operand of shift expression '(-8 << 26)' is negative [-fpermissive]
 7486 |       (~kMaxCachedArrayIndexLength << kArrayIndexHashLengthShift) |
      |       ~~~~~~~~~~~~~~~~~~~~~~~~~~~~~^~~~~~~~~~~~~~~~~~~~~~~~~~~~~~
make[3]: *** [Makefile:924: .obj/accessors.o] Error 1
make[3]: *** Waiting for unfinished jobs....
make[3]: *** [Makefile:1362: .obj/ast.o] Error 1
make[3]: *** [Makefile:1244: .obj/assembler.o] Error 1
make[3]: *** [Makefile:1097: .obj/api.o] Error 1
make[3]: Leaving directory '/<<PKGBUILDDIR>>/src/v8'
make[2]: *** [Makefile:91: sub-v8-make_first-ordered] Error 2
make[2]: Leaving directory '/<<PKGBUILDDIR>>/src'
make[1]: *** [Makefile:48: sub-src-make_first] Error 2
make[1]: Leaving directory '/<<PKGBUILDDIR>>'
dh_auto_build: error: make -j4 returned exit code 2
make: *** [debian/rules:14: build-arch] Error 25

Tail of log for r-bioc-rsubread on armhf:

/usr/include/stdint.h:96:23: error: conflicting types for 'uintptr_t'
   96 | typedef unsigned int  uintptr_t;
      |                       ^~~~~~~~~
In file included from R_wrapper.c:30:
/usr/share/R/include/Rinterface.h:110:24: note: previous declaration of 'uintptr_t' was here
  110 |  typedef unsigned long uintptr_t;
      |                        ^~~~~~~~~
make[1]: *** [/usr/lib/R/etc/Makeconf:167: R_wrapper.o] Error 1
make[1]: Leaving directory '/<<PKGBUILDDIR>>/src'
make[1]: Entering directory '/<<PKGBUILDDIR>>/src'
make[1]: Leaving directory '/<<PKGBUILDDIR>>/src'
ERROR: compilation failed for package 'Rsubread'
* removing '/<<PKGBUILDDIR>>/debian/r-bioc-rsubread/usr/lib/R/site-library/Rsubread'
dh_auto_install: error: R CMD INSTALL -l /<<PKGBUILDDIR>>/debian/r-bioc-rsubread/usr/lib/R/site-library --clean . "--built-timestamp='Wed, 12 Aug 2020 10:25:43 +0200'" returned exit code 1
make: *** [debian/rules:4: binary-arch] Error 25

Tail of log for qwinff on armhf:

  166 |     glTexCoord2f(0, 0); glVertex2f(-1, -1);
      |     ^~~~~~~~~~~~
src/qmpwidget/qmpwidget.cpp:166:25: error: 'glVertex2f' was not declared in this scope; did you mean 'glVertexAttrib2f'?
  166 |     glTexCoord2f(0, 0); glVertex2f(-1, -1);
      |                         ^~~~~~~~~~
      |                         glVertexAttrib2f
src/qmpwidget/qmpwidget.cpp:170:5: error: 'glEnd' was not declared in this scope
  170 |     glEnd();
      |     ^~~~~
make[2]: *** [Makefile:1151: qmpwidget.o] Error 1
make[2]: Leaving directory '/<<BUILDDIR>>/qwinff-0.2.1+git20191128'
dh_auto_build: error: make -j4 "INSTALL=install --strip-program=true" QMAKE=arm-linux-gnueabihf-qmake returned exit code 2
make[1]: *** [debian/rules:28: override_dh_auto_build] Error 25
make[1]: Leaving directory '/<<BUILDDIR>>/qwinff-0.2.1+git20191128'
make: *** [debian/rules:20: build-arch] Error 2

Tail of log for rpm2html on armhf:

  758 |              headerNextIterator(sIter, &tag, &type, (void *) &p, &count);) {
      |              ^~~~~~~~~~~~~~~~~~
      |              headerInitIterator
rpmopen.c: In function 'rpmOpen':
rpmopen.c:1052:20: error: storage size of 'lead' isn't known
 1052 |     struct rpmlead lead;
      |                    ^~~~
rpmopen.c:1140:9: warning: implicit declaration of function 'fdClose'; did you mean 'fclose'? [-Wimplicit-function-declaration]
 1140 |         fdClose(fd);
      |         ^~~~~~~
      |         fclose
make[1]: *** [Makefile:514: rpmopen.o] Error 1
make[1]: Leaving directory '/<<PKGBUILDDIR>>'
dh_auto_build: error: make -j1 returned exit code 2
make: *** [debian/rules:7: build-arch] Error 25

Tail of log for rust-kvm-ioctls on armhf:

    |                                                     ^^^^^^^^^^ types differ in mutability
    |
    = note: expected mutable reference `&mut [u8]`
                       found reference `&[u8]`

error: aborting due to 151 previous errors

Some errors have detailed explanations: E0308, E0412, E0422, E0425, E0432.
For more information about an error, try `rustc --explain E0308`.
error: could not compile `kvm-ioctls`.

Caused by:
  process didn't exit successfully: `CARGO_PKG_VERSION_MAJOR=0 LD_LIBRARY_PATH='/<<PKGBUILDDIR>>/target/debug/deps:/usr/lib' CARGO_PKG_NAME=kvm-ioctls CARGO_PKG_HOMEPAGE= CARGO_PKG_REPOSITORY='https://github.com/rust-vmm/kvm-ioctls' CARGO_PKG_AUTHORS='Amazon Firecracker Team <firecracker-maintainers@amazon.com>' CARGO=/usr/bin/cargo CARGO_PKG_VERSION_PATCH=0 CARGO_PKG_VERSION=0.2.0 CARGO_PKG_DESCRIPTION='Safe wrappers over KVM ioctls' CARGO_MANIFEST_DIR=/<<PKGBUILDDIR>> CARGO_PKG_VERSION_PRE= CARGO_PKG_VERSION_MINOR=2 rustc --crate-name kvm_ioctls src/lib.rs --error-format=json --json=diagnostic-rendered-ansi --crate-type lib --emit=dep-info,metadata,link -C debuginfo=2 -C metadata=02fa6815f83dbca5 -C extra-filename=-02fa6815f83dbca5 --out-dir /<<PKGBUILDDIR>>/target/arm-unknown-linux-gnueabihf/debug/deps --target arm-unknown-linux-gnueabihf -C incremental=/<<PKGBUILDDIR>>/target/arm-unknown-linux-gnueabihf/debug/incremental -L dependency=/<<PKGBUILDDIR>>/target/arm-unknown-linux-gnueabihf/debug/deps -L dependency=/<<PKGBUILDDIR>>/target/debug/deps --extern kvm_bindings=/<<PKGBUILDDIR>>/target/arm-unknown-linux-gnueabihf/debug/deps/libkvm_bindings-4990b327b49c44d5.rmeta --extern libc=/<<PKGBUILDDIR>>/target/arm-unknown-linux-gnueabihf/debug/deps/liblibc-26ec46b8e0304423.rmeta -C debuginfo=2 --cap-lints warn -C linker=arm-linux-gnueabihf-gcc -C link-arg=-Wl,-z,relro --remap-path-prefix /<<PKGBUILDDIR>>=/usr/share/cargo/registry/kvm-ioctls-0.2.0` (exit code: 1)
dh_auto_test: error: /usr/share/cargo/bin/cargo build returned exit code 101
make: *** [debian/rules:3: build-arch] Error 25

Tail of log for rust-generator on armhf:

             at src/libstd/panicking.rs:281
  19: std::panic::catch_unwind
             at src/libstd/panic.rs:394
  20: std::rt::lang_start_internal
             at src/libstd/rt.rs:51
  21: std::rt::lang_start
             at /usr/src/rustc-1.43.0/src/libstd/rt.rs:67
  22: main
  23: __libc_start_main
note: Some details are omitted, run with `RUST_BACKTRACE=full` for a verbose backtrace.

dh_auto_test: error: /usr/share/cargo/bin/cargo test --all returned exit code 101
make[1]: *** [debian/rules:6: override_dh_auto_test] Error 25
make[1]: Leaving directory '/<<PKGBUILDDIR>>'
make: *** [debian/rules:3: build-arch] Error 2

Tail of log for rust-mach-o-sys on armhf:

Caused by:
  process didn't exit successfully: `CARGO=/usr/bin/cargo CARGO_PKG_VERSION_MINOR=1 CARGO_PKG_VERSION_PATCH=1 CARGO_PKG_HOMEPAGE= LD_LIBRARY_PATH='/<<PKGBUILDDIR>>/target/debug/deps:/usr/lib' CARGO_PKG_AUTHORS='Nick Fitzgerald <fitzgen@gmail.com>' CARGO_PKG_VERSION_MAJOR=0 CARGO_PKG_VERSION=0.1.1 CARGO_PKG_VERSION_PRE= CARGO_PKG_NAME=mach_o_sys CARGO_MANIFEST_DIR=/<<PKGBUILDDIR>> CARGO_PKG_REPOSITORY='https://github.com/fitzgen/mach_o_sys' CARGO_PKG_DESCRIPTION='Bindings to the OSX mach-o system library' rustc --crate-name mach_o_sys src/lib.rs --error-format=json --json=diagnostic-rendered-ansi --crate-type lib --emit=dep-info,metadata,link -C debuginfo=2 -C metadata=54e05a23b9e7b924 -C extra-filename=-54e05a23b9e7b924 --out-dir /<<PKGBUILDDIR>>/target/arm-unknown-linux-gnueabihf/debug/deps --target arm-unknown-linux-gnueabihf -C incremental=/<<PKGBUILDDIR>>/target/arm-unknown-linux-gnueabihf/debug/incremental -L dependency=/<<PKGBUILDDIR>>/target/arm-unknown-linux-gnueabihf/debug/deps -L dependency=/<<PKGBUILDDIR>>/target/debug/deps -C debuginfo=2 --cap-lints warn -C linker=arm-linux-gnueabihf-gcc -C link-arg=-Wl,-z,relro --remap-path-prefix /<<PKGBUILDDIR>>=/usr/share/cargo/registry/mach-o-sys-0.1.1` (exit code: 1)
warning: build failed, waiting for other jobs to finish...
error: aborting due to 130 previous errors

For more information about this error, try `rustc --explain E0600`.
error: could not compile `mach_o_sys`.

Caused by:
  process didn't exit successfully: `CARGO=/usr/bin/cargo CARGO_PKG_VERSION_MINOR=1 CARGO_PKG_VERSION_PATCH=1 CARGO_PKG_HOMEPAGE= LD_LIBRARY_PATH='/<<PKGBUILDDIR>>/target/debug/deps:/usr/lib' CARGO_PKG_AUTHORS='Nick Fitzgerald <fitzgen@gmail.com>' CARGO_PKG_VERSION_MAJOR=0 CARGO_PKG_VERSION=0.1.1 CARGO_PKG_VERSION_PRE= CARGO_PKG_NAME=mach_o_sys CARGO_MANIFEST_DIR=/<<PKGBUILDDIR>> CARGO_PKG_REPOSITORY='https://github.com/fitzgen/mach_o_sys' CARGO_PKG_DESCRIPTION='Bindings to the OSX mach-o system library' rustc --crate-name mach_o_sys src/lib.rs --error-format=json --json=diagnostic-rendered-ansi --emit=dep-info,link -C debuginfo=2 --test -C metadata=c1f25cab3e8f5708 -C extra-filename=-c1f25cab3e8f5708 --out-dir /<<PKGBUILDDIR>>/target/arm-unknown-linux-gnueabihf/debug/deps --target arm-unknown-linux-gnueabihf -C incremental=/<<PKGBUILDDIR>>/target/arm-unknown-linux-gnueabihf/debug/incremental -L dependency=/<<PKGBUILDDIR>>/target/arm-unknown-linux-gnueabihf/debug/deps -L dependency=/<<PKGBUILDDIR>>/target/debug/deps -C debuginfo=2 --cap-lints warn -C linker=arm-linux-gnueabihf-gcc -C link-arg=-Wl,-z,relro --remap-path-prefix /<<PKGBUILDDIR>>=/usr/share/cargo/registry/mach-o-sys-0.1.1` (exit code: 1)
dh_auto_test: error: /usr/share/cargo/bin/cargo test --all returned exit code 101
make[1]: *** [debian/rules:6: override_dh_auto_test] Error 25
make[1]: Leaving directory '/<<PKGBUILDDIR>>'
make: *** [debian/rules:3: build-arch] Error 2

Tail of log for ruby2.1 on armhf:

      | 
parse.c:10841:63: error: macro "yydestruct" passed 4 arguments, but takes just 3
10841 |      this YYABORT or YYACCEPT.  */
      |                                                               ^
parse.c:4967: note: macro "yydestruct" defined here
 4967 | #define yydestruct(m, t, v) ruby_parser_yydestruct(m, t, v, parser)
      | 
gcc -g -O2 -fdebug-prefix-map=/<<PKGBUILDDIR>>=. -fstack-protector-strong -Wformat -Werror=format-security -fPIC  -D_FORTIFY_SOURCE=2 -fstack-protector -fno-strict-overflow -fvisibility=hidden -DRUBY_EXPORT -Wdate-time -D_FORTIFY_SOURCE=2   -I. -I.ext/include/arm-linux-gnueabihf -I./include -I. -o compile.o -c compile.c
make[2]: *** [Makefile:334: parse.o] Error 1
make[2]: *** Waiting for unfinished jobs....
make[2]: Leaving directory '/<<PKGBUILDDIR>>'
dh_auto_build: error: make -j4 main V=1 returned exit code 2
make[1]: *** [debian/rules:67: override_dh_auto_build-arch] Error 25
make[1]: Leaving directory '/<<PKGBUILDDIR>>'
make: *** [debian/rules:49: build-arch] Error 2

Tail of log for rust-mysqlclient-sys on armhf:

    bindgen_test_layout_st_mysql_res
    bindgen_test_layout_st_mysql_rows
    bindgen_test_layout_st_mysql_stmt
    bindgen_test_layout_st_mysql_time
    bindgen_test_layout_st_net
    bindgen_test_layout_st_plugin_vio
    bindgen_test_layout_st_used_mem

test result: FAILED. 2 passed; 16 failed; 0 ignored; 0 measured; 0 filtered out

error: test failed, to rerun pass '--lib'
dh_auto_test: error: /usr/share/cargo/bin/cargo test --all returned exit code 101
make[1]: *** [debian/rules:6: override_dh_auto_test] Error 25
make[1]: Leaving directory '/<<PKGBUILDDIR>>'
make: *** [debian/rules:3: build-arch] Error 2

Tail of log for rust-servo-freetype-sys on armhf:

             at src/libstd/panicking.rs:281
  22: std::panic::catch_unwind
             at src/libstd/panic.rs:394
  23: std::rt::lang_start_internal
             at src/libstd/rt.rs:51
  24: std::rt::lang_start
             at /usr/src/rustc-1.43.0/src/libstd/rt.rs:67
  25: main
  26: __libc_start_main
note: Some details are omitted, run with `RUST_BACKTRACE=full` for a verbose backtrace.

dh_auto_test: error: /usr/share/cargo/bin/cargo test --all returned exit code 101
make[1]: *** [debian/rules:6: override_dh_auto_test] Error 25
make[1]: Leaving directory '/<<PKGBUILDDIR>>'
make: *** [debian/rules:3: build-arch] Error 2

Tail of log for rust-pq-sys on armhf:

failures:
    bindgen_test_layout__PQconninfoOption
    bindgen_test_layout__PQprintOpt
    bindgen_test_layout___sFILE
    bindgen_test_layout___sbuf
    bindgen_test_layout_pgNotify
    bindgen_test_layout_pgresAttDesc

test result: FAILED. 2 passed; 6 failed; 0 ignored; 0 measured; 0 filtered out

error: test failed, to rerun pass '--lib'
dh_auto_test: error: /usr/share/cargo/bin/cargo test --all returned exit code 101
make[1]: *** [debian/rules:6: override_dh_auto_test] Error 25
make[1]: Leaving directory '/<<PKGBUILDDIR>>'
make: *** [debian/rules:3: build-arch] Error 2

Tail of log for scanbuttond on armhf:

dpkg-buildpackage: info: source package scanbuttond
dpkg-buildpackage: info: source version 0.2.3.cvs20090713-16
dpkg-buildpackage: info: source distribution unstable
 dpkg-source --before-build .
dpkg-buildpackage: info: host architecture armhf
 fakeroot debian/rules clean
dh_testdir
set -e; for f in include/scanbuttond/config.h.in INSTALL; do cp "$f" "$f.upstream"; done
if [ -f /usr/share/libtool/config/ltmain.sh ]; then \
  cp /usr/share/libtool/config/ltmain.sh .; \
else \
  cp /usr/share/libtool/ltmain.sh .; \
fi
cp: cannot stat '/usr/share/libtool/ltmain.sh': No such file or directory
make: *** [debian/rules:45: configure-stamp] Error 1

Tail of log for scrappie on armhf:

                 from /<<PKGBUILDDIR>>/src/decode.c:3:
/<<PKGBUILDDIR>>/src/scrappie_matrix.h:5:14: fatal error: immintrin.h: No such file or directory
    5 | #    include <immintrin.h>
      |              ^~~~~~~~~~~~~
compilation terminated.
make[4]: *** [CMakeFiles/scrappie_objects.dir/build.make:63: CMakeFiles/scrappie_objects.dir/src/decode.c.o] Error 1
make[4]: Leaving directory '/<<PKGBUILDDIR>>/build'
make[3]: *** [CMakeFiles/Makefile2:85: CMakeFiles/scrappie_objects.dir/all] Error 2
make[3]: Leaving directory '/<<PKGBUILDDIR>>/build'
make[2]: *** [Makefile:163: all] Error 2
make[2]: Leaving directory '/<<PKGBUILDDIR>>/build'
make[1]: *** [Makefile:21: build/scrappie] Error 2
make[1]: Leaving directory '/<<PKGBUILDDIR>>'
dh_auto_build: error: make -j4 "INSTALL=install --strip-program=true" returned exit code 2
make: *** [debian/rules:9: binary-arch] Error 25

Tail of log for rust-ucd-generate on armhf:

102 |                 wtr.dense_regex(args.name(), &re)?;
    |                                              ^^^ the trait `regex_automata::StateID` is not implemented for `u64`

error: aborting due to 8 previous errors

Some errors have detailed explanations: E0277, E0599.
For more information about an error, try `rustc --explain E0277`.
error: could not compile `ucd-generate`.

Caused by:
  process didn't exit successfully: `CARGO_PKG_VERSION_MINOR=2 CARGO_PKG_NAME=ucd-generate CARGO_PKG_VERSION_PATCH=3 CARGO_PKG_DESCRIPTION='A program for generating packed representations of the Unicode character
database that can be efficiently searched.
' CARGO_PKG_VERSION_MAJOR=0 LD_LIBRARY_PATH='/<<PKGBUILDDIR>>/target/debug/deps:/usr/lib' CARGO_MANIFEST_DIR=/<<PKGBUILDDIR>> CARGO_PKG_VERSION=0.2.3 CARGO_PKG_HOMEPAGE='https://github.com/BurntSushi/ucd-generate' CARGO=/usr/bin/cargo CARGO_PKG_REPOSITORY='https://github.com/BurntSushi/ucd-generate' CARGO_PKG_AUTHORS='Andrew Gallant <jamslam@gmail.com>' CARGO_PKG_VERSION_PRE= rustc --crate-name ucd_generate src/main.rs --error-format=json --json=diagnostic-rendered-ansi --crate-type bin --emit=dep-info,link -C debuginfo=2 -C metadata=d97f3021463f8394 -C extra-filename=-d97f3021463f8394 --out-dir /<<PKGBUILDDIR>>/target/arm-unknown-linux-gnueabihf/debug/deps --target arm-unknown-linux-gnueabihf -C incremental=/<<PKGBUILDDIR>>/target/arm-unknown-linux-gnueabihf/debug/incremental -L dependency=/<<PKGBUILDDIR>>/target/arm-unknown-linux-gnueabihf/debug/deps -L dependency=/<<PKGBUILDDIR>>/target/debug/deps --extern byteorder=/<<PKGBUILDDIR>>/target/arm-unknown-linux-gnueabihf/debug/deps/libbyteorder-f1c1229d7f56376c.rlib --extern clap=/<<PKGBUILDDIR>>/target/arm-unknown-linux-gnueabihf/debug/deps/libclap-15cf0f6ec4729b97.rlib --extern fst=/<<PKGBUILDDIR>>/target/arm-unknown-linux-gnueabihf/debug/deps/libfst-47720b356ef2c6aa.rlib --extern regex_automata=/<<PKGBUILDDIR>>/target/arm-unknown-linux-gnueabihf/debug/deps/libregex_automata-bae56208e22d96db.rlib --extern ucd_parse=/<<PKGBUILDDIR>>/target/arm-unknown-linux-gnueabihf/debug/deps/libucd_parse-cc395c0c48b28387.rlib --extern ucd_trie=/<<PKGBUILDDIR>>/target/arm-unknown-linux-gnueabihf/debug/deps/libucd_trie-d53ff72fc021e6a4.rlib --extern ucd_util=/<<PKGBUILDDIR>>/target/arm-unknown-linux-gnueabihf/debug/deps/libucd_util-8d219d4aeb5c4a06.rlib -C debuginfo=2 --cap-lints warn -C linker=arm-linux-gnueabihf-gcc -C link-arg=-Wl,-z,relro --remap-path-prefix /<<PKGBUILDDIR>>=/usr/share/cargo/registry/ucd-generate-0.2.3` (exit code: 1)
dh_auto_test: error: /usr/share/cargo/bin/cargo build returned exit code 101
make: *** [debian/rules:3: build-arch] Error 25

Tail of log for slang-slirp on armhf:

checking for dlfcn.h... yes
checking for dlopen in -ldl... yes
checking for g++... g++
checking whether we are using the GNU C++ compiler... yes
checking whether g++ accepts -g... yes
checking for gfortran... gfortran
checking whether we are using the GNU Fortran compiler... yes
checking whether gfortran accepts -g... yes
checking how to get verbose linking output from gfortran... -v
checking for Fortran libraries of gfortran...  -L/usr/lib/gcc/arm-linux-gnueabihf/10 -L/usr/lib/gcc/arm-linux-gnueabihf/10/../../../arm-linux-gnueabihf -L/usr/lib/gcc/arm-linux-gnueabihf/10/../../.. -L/lib/arm-linux-gnueabihf -L/usr/lib/arm-linux-gnueabihf -lgfortran -lm
checking for dummy main to link with Fortran libraries... none
checking for Fortran name-mangling scheme... lower case, underscore, no extra underscore
checking for the slang library and header files ... no
configure: error: unable to find the slang library and header file slang.h
make: *** [/usr/share/cdbs/1/class/autotools.mk:46: debian/stamp-autotools] Error 1

Tail of log for tarantool on armhf:

      |    ^~~~~
/<<PKGBUILDDIR>>/third_party/coro/coro.c:480:14: error: 'NUM_SAVED' undeclared (first use in this function)
  480 |   ctx->sp -= NUM_SAVED;
      |              ^~~~~~~~~
/<<PKGBUILDDIR>>/third_party/coro/coro.c:480:14: note: each undeclared identifier is reported only once for each function it appears in
/<<PKGBUILDDIR>>/third_party/coro/coro.c:494:4: error: #error unsupported architecture
  494 |   #error unsupported architecture
      |    ^~~~~
make[3]: *** [CMakeFiles/coro.dir/build.make:66: CMakeFiles/coro.dir/third_party/coro/coro.c.o] Error 1
make[3]: Leaving directory '/<<PKGBUILDDIR>>/obj-arm-linux-gnueabihf'
make[2]: *** [CMakeFiles/Makefile2:815: CMakeFiles/coro.dir/all] Error 2
make[2]: Leaving directory '/<<PKGBUILDDIR>>/obj-arm-linux-gnueabihf'
make[1]: *** [Makefile:155: all] Error 2
make[1]: Leaving directory '/<<PKGBUILDDIR>>/obj-arm-linux-gnueabihf'
make: *** [/usr/share/cdbs/1/class/makefile.mk:77: debian/stamp-makefile-build] Error 2

Tail of log for traildb on armhf:

#define HAVE_INTTYPES_H 1
#define HAVE_STDINT_H 1
#define HAVE_UNISTD_H 1
#define HAVE_DLFCN_H 1
#define LT_OBJDIR ".libs/"
#define DSFMT_MEXP 521
#define HAVE_SSE2 1
#define HAVE_LIBJUDY 1
#define HAVE_JUDY_H 1
#define HAVE_ARCHIVE_H 1
#define HAVE_LIBARCHIVE 1

configure: exit 1
dh_auto_configure: error: ./configure --build=arm-linux-gnueabihf --prefix=/usr --includedir=\${prefix}/include --mandir=\${prefix}/share/man --infodir=\${prefix}/share/info --sysconfdir=/etc --localstatedir=/var --disable-option-checking --disable-silent-rules --libdir=\${prefix}/lib/arm-linux-gnueabihf --libexecdir=\${prefix}/lib/arm-linux-gnueabihf --disable-maintainer-mode --disable-dependency-tracking returned exit code 1
make: *** [debian/rules:10: build-arch] Error 25

Tail of log for tlsdate on armhf:

                 from /usr/include/openssl/bio.h:13,
                 from ./src/tlsdate-helper.h:37,
                 from src/tlsdate-helper.c:78:
/usr/include/openssl/ssl.h:1879:1: note: declared here
 1879 | DEPRECATEDIN_1_1_0(__owur const SSL_METHOD *TLSv1_client_method(void))
      | ^~~~~~~~~~~~~~~~~~
src/tlsdate-helper.c:1207:27: error: invalid use of incomplete typedef 'SSL' {aka 'struct ssl_st'}
 1207 |   memcpy(&result_time, ssl->s3->server_random, sizeof (uint32_t));
      |                           ^~
make[2]: *** [Makefile:2037: src/tlsdate_helper-tlsdate-helper.o] Error 1
make[2]: Leaving directory '/<<PKGBUILDDIR>>'
make[1]: *** [Makefile:1428: all] Error 2
make[1]: Leaving directory '/<<PKGBUILDDIR>>'
dh_auto_build: error: make -j1 returned exit code 2
make: *** [debian/rules:25: build-arch] Error 25

Tail of log for wmmail on armhf:

/usr/bin/make
make[1]: Entering directory '/<<PKGBUILDDIR>>'
Making all in src
make[2]: Entering directory '/<<PKGBUILDDIR>>/src'
gcc -DPACKAGE=\"WMMail\" -DVERSION=\"0.64\" -DHAVE_LIBNSL=1 -DHAVE_LIBX11=1 -DHAVE_LIBXEXT=1 -DHAVE_LIBXT=1 -DHAVE_LIBXPM=1 -DHAVE_LIBWUTIL=1 -DSTDC_HEADERS=1 -DHAVE_LIMITS_H=1 -DHAVE_STRINGS_H=1 -DHAVE_UNISTD_H=1 -DRETSIGTYPE=int -DHAVE_VPRINTF=1 -DHAVE_SOCKET=1 -DHAVE_STRSTR=1  -I. -I.      -g -O2 -I  -c global.c
In file included from global.c:27:
wmmail.h:32:10: fatal error: WINGs/proplist-compat.h: No such file or directory
   32 | #include <WINGs/proplist-compat.h>
      |          ^~~~~~~~~~~~~~~~~~~~~~~~~
compilation terminated.
make[2]: *** [Makefile:247: global.o] Error 1
make[2]: Leaving directory '/<<PKGBUILDDIR>>/src'
make[1]: *** [Makefile:125: all-recursive] Error 1
make[1]: Leaving directory '/<<PKGBUILDDIR>>'
make: *** [debian/rules:17: build-stamp] Error 2

Tail of log for xf86-video-msm on armhf:

                 from neon_memsets.c:30:
/usr/include/xorg/servermd.h:51:2: error: #error Drivers must include xorg-server.h before any other xserver headers
   51 | #error Drivers must include xorg-server.h before any other xserver headers
      |  ^~~~~
/usr/include/xorg/servermd.h:52:2: error: #error xserver code must include dix-config.h before any other headers
   52 | #error xserver code must include dix-config.h before any other headers
      |  ^~~~~
make[3]: *** [Makefile:550: neon_memsets.lo] Error 1
make[3]: Leaving directory '/<<BUILDDIR>>/xf86-video-msm-1.0.1+git20100122.5f7df591/src'
make[2]: *** [Makefile:426: all-recursive] Error 1
make[2]: Leaving directory '/<<BUILDDIR>>/xf86-video-msm-1.0.1+git20100122.5f7df591'
make[1]: *** [Makefile:358: all] Error 2
make[1]: Leaving directory '/<<BUILDDIR>>/xf86-video-msm-1.0.1+git20100122.5f7df591'
dh_auto_build: error: make -j1 returned exit code 2
make: *** [debian/rules:8: build-arch] Error 25

Tail of log for tendermint on armhf:

--- PASS: TestBadVotes (0.05s)
=== RUN   TestConflicts
--- PASS: TestConflicts (0.09s)
=== RUN   TestMakeCommit
--- PASS: TestMakeCommit (0.14s)
=== RUN   TestVoteSignable
--- PASS: TestVoteSignable (0.00s)
PASS
ok  	github.com/tendermint/tendermint/types	7.956s
?   	github.com/tendermint/tendermint/version	[no test files]
FAIL
dh_auto_test: error: cd obj-arm-linux-gnueabihf && go test -vet=off -v -p 1 github.com/tendermint/tendermint/benchmarks github.com/tendermint/tendermint/benchmarks/proto github.com/tendermint/tendermint/benchmarks/simu github.com/tendermint/tendermint/blockchain github.com/tendermint/tendermint/cmd/tendermint github.com/tendermint/tendermint/config/tendermint github.com/tendermint/tendermint/config/tendermint_test github.com/tendermint/tendermint/consensus github.com/tendermint/tendermint/fail-test github.com/tendermint/tendermint/mempool github.com/tendermint/tendermint/node github.com/tendermint/tendermint/proxy github.com/tendermint/tendermint/rpc/core github.com/tendermint/tendermint/rpc/core/types github.com/tendermint/tendermint/rpc/grpc github.com/tendermint/tendermint/rpc/test github.com/tendermint/tendermint/state github.com/tendermint/tendermint/test/app github.com/tendermint/tendermint/types github.com/tendermint/tendermint/version returned exit code 1
make[1]: *** [debian/rules:9: override_dh_auto_test] Error 25
make[1]: Leaving directory '/<<BUILDDIR>>/tendermint-0.8.0+git20170113.0.764091d'
make: *** [debian/rules:6: build-arch] Error 2

Tail of log for siconos on armhf:

 6478 |     npy_intp this_vector_dim[1] = { v.size() };
      |                                     ~~~~~~^~
/<<BUILDDIR>>/siconos-4.3.0+dfsg/obj-arm-linux-gnueabihf/wrap/siconos/kernelPYTHON_wrap.cxx: In function 'PyObject* SP_SiconosVector_to_numpy(SP::SiconosVector)':
/<<BUILDDIR>>/siconos-4.3.0+dfsg/obj-arm-linux-gnueabihf/wrap/siconos/kernelPYTHON_wrap.cxx:6488:44: warning: narrowing conversion of '((std::__shared_ptr_access<SiconosVector, __gnu_cxx::_S_mutex, false, false>*)(& v))->std::__shared_ptr_access<SiconosVector, __gnu_cxx::_S_mutex, false, false>::operator->()->SiconosVector::size()' from 'unsigned int' to 'npy_intp' {aka 'int'} [-Wnarrowing]
 6488 |     npy_intp this_vector_dim[1] = { v->size() };
      |                                     ~~~~~~~^~
virtual memory exhausted: Cannot allocate memory
make[3]: *** [kernel/swig/CMakeFiles/_kernel.dir/build.make:85: kernel/swig/CMakeFiles/_kernel.dir/__/__/wrap/siconos/kernelPYTHON_wrap.cxx.o] Error 1
make[3]: Leaving directory '/<<BUILDDIR>>/siconos-4.3.0+dfsg/obj-arm-linux-gnueabihf'
make[2]: *** [CMakeFiles/Makefile2:6035: kernel/swig/CMakeFiles/_kernel.dir/all] Error 2
make[2]: Leaving directory '/<<BUILDDIR>>/siconos-4.3.0+dfsg/obj-arm-linux-gnueabihf'
make[1]: *** [Makefile:163: all] Error 2
make[1]: Leaving directory '/<<BUILDDIR>>/siconos-4.3.0+dfsg/obj-arm-linux-gnueabihf'
dh_auto_build: error: cd obj-arm-linux-gnueabihf && make -j1 "INSTALL=install --strip-program=true" returned exit code 2
make: *** [debian/rules:41: binary-arch] Error 25

Tail of log for vt on armhf:

testing decompose_blocksub of phased even-length blocks
             output VCF file : ok
             output logs     : ok
++++++++++++++++++++++
Tests for vt decompose
++++++++++++++++++++++
testing decompose for a triallelic variant
             output VCF file : ok
             output logs     : ok

Passed tests : 4 / 5
make[1]: *** [Makefile:164: test] Error 1
make[1]: Leaving directory '/<<BUILDDIR>>/vt-0.57721+ds'
dh_auto_test: error: make -j4 test returned exit code 2
make: *** [debian/rules:8: binary-arch] Error 25

Tail of log for cone on armhf:

myserverremoteconfig.C: In member function 'mail::account* myServer::remoteConfig::login2()':
myserverremoteconfig.C:145:11: error: cannot convert 'bool' to 'mail::account*' in return
  145 |    return false;
      |           ^~~~~
make[5]: *** [Makefile:849: myserverremoteconfig.o] Error 1
make[5]: Leaving directory '/<<PKGBUILDDIR>>/cone'
make[4]: *** [Makefile:970: all-recursive] Error 1
make[4]: Leaving directory '/<<PKGBUILDDIR>>/cone'
make[3]: *** [Makefile:617: all] Error 2
make[3]: Leaving directory '/<<PKGBUILDDIR>>/cone'
make[2]: *** [Makefile:370: all-recursive] Error 1
make[2]: Leaving directory '/<<PKGBUILDDIR>>'
make[1]: *** [Makefile:275: all] Error 2
make[1]: Leaving directory '/<<PKGBUILDDIR>>'
make: *** [/usr/share/cdbs/1/class/makefile.mk:77: debian/stamp-makefile-build] Error 2

Tail of log for valentina on armhf:

PASS   : TST_ValentinaCommandLine::TestOpenCollection(Moulage_0.5_armhole_neckline)
QWARN  : TST_ValentinaCommandLine::TestOpenCollection(0.7_Armhole_adjustment_0.10) QProcess: Destroyed while process ("/<<PKGBUILDDIR>>/src/test/CollectionTest/bin/../../../app/valentina/bin/valentina") is still running.
FAIL!  : TST_ValentinaCommandLine::TestOpenCollection(0.7_Armhole_adjustment_0.10) 'exit == exitCode' returned FALSE. (tina-XKYmKf/valentina-0.7.0~~20200923~dfsg/src/test/CollectionTest/bin/../../../app/valentina/bin/valentina 
Arguments: /<<PKGBUILDDIR>>/src/test/CollectionTest/bin/tst_valentina_collection_tmp/0.7_Armhole_adjustment_0.10.val, --test.
QStandardPaths: XDG_RUNTIME_DIR not set, defaulting to '/tmp/runtime-buildd'
)
   Loc: [tst_valentinacommandline.cpp(295)]
PASS   : TST_ValentinaCommandLine::cleanupTestCase()
Totals: 37 passed, 7 failed, 0 skipped, 0 blacklisted, 2689340ms
********* Finished testing of TST_ValentinaCommandLine *********
make[2]: *** [Makefile:448: check] Error 7
make[2]: Leaving directory '/<<PKGBUILDDIR>>/src/test/CollectionTest'
make[1]: *** [debian/rules:34: override_dh_auto_test] Error 2
make[1]: Leaving directory '/<<PKGBUILDDIR>>'
make: *** [debian/rules:70: binary-arch] Error 2

Tail of log for gle-graphics on armhf:

  198 |  glEnd();
      |  ^~~~~
3dviewer.cpp:221:5: error: 'glEndList' was not declared in this scope
  221 |     glEndList();
      |     ^~~~~~~~~
make[4]: *** [Makefile:1860: objects/3dviewer.o] Error 1
make[4]: Leaving directory '/<<PKGBUILDDIR>>/src/gui'
make[3]: *** [MakefileAC:86: domake] Error 2
make[3]: Leaving directory '/<<PKGBUILDDIR>>/src/gui'
make[2]: *** [Makefile:167: make_all] Error 2
make[2]: Leaving directory '/<<PKGBUILDDIR>>'
dh_auto_build: error: make -j1 returned exit code 2
make[1]: *** [debian/rules:42: override_dh_auto_build] Error 25
make[1]: Leaving directory '/<<PKGBUILDDIR>>'
make: *** [debian/rules:38: build-arch] Error 2

Tail of log for iem-plugin-suite on armhf:

/usr/share/juce/modules/juce_audio_plugin_client/VST/juce_VST_Wrapper.cpp:2419:55: internal compiler error: Bus error
 2419 |     __attribute__((destructor))  void myPluginFini() {}
      |                                                       ^
Please submit a full bug report,
with preprocessed source if appropriate.
See <file:///usr/share/doc/gcc-10/README.Bugs> for instructions.
The bug is not reproducible, so it is likely a hardware or OS problem.
make[3]: *** [Makefile:164: build/intermediate/Release/include_juce_audio_plugin_client_VST2_dd551e08.o] Error 1
make[3]: Leaving directory '/<<PKGBUILDDIR>>/DirectionalCompressor/Builds/LinuxMakefile'
make[2]: *** [Makefile:125: DirectionalCompressor-LinuxMakefile-build] Error 2
make[2]: Leaving directory '/<<PKGBUILDDIR>>'
dh_auto_build: error: make -j1 "INSTALL=install --strip-program=true" returned exit code 2
make[1]: *** [debian/rules:42: override_dh_auto_build] Error 25
make[1]: Leaving directory '/<<PKGBUILDDIR>>'
make: *** [debian/rules:39: binary-arch] Error 2

Tail of log for gatb-core on armhf:

/usr/bin/ld: /usr/include/c++/10/bits/atomic_base.h:426: undefined reference to `__atomic_load_8'
/usr/bin/ld: /usr/include/c++/10/bits/atomic_base.h:426: undefined reference to `__atomic_load_8'
/usr/bin/ld: CMakeFiles/gatb-core-cppunit.dir/src/bcalm/TestBcalm.cpp.o: in function `std::__atomic_base<unsigned long long>::compare_exchange_weak(unsigned long long&, unsigned long long, std::memory_order, std::memory_order)':
/usr/include/c++/10/bits/atomic_base.h:464: undefined reference to `__atomic_compare_exchange_8'
collect2: error: ld returned 1 exit status
make[4]: *** [test/unit/CMakeFiles/gatb-core-cppunit.dir/build.make:440: bin/None/gatb-core-cppunit] Error 1
make[4]: Leaving directory '/<<BUILDDIR>>/gatb-core-1.4.2+dfsg/obj-arm-linux-gnueabihf'
make[3]: *** [CMakeFiles/Makefile2:399: test/unit/CMakeFiles/gatb-core-cppunit.dir/all] Error 2
make[3]: Leaving directory '/<<BUILDDIR>>/gatb-core-1.4.2+dfsg/obj-arm-linux-gnueabihf'
make[2]: *** [Makefile:155: all] Error 2
make[2]: Leaving directory '/<<BUILDDIR>>/gatb-core-1.4.2+dfsg/obj-arm-linux-gnueabihf'
dh_auto_build: error: cd obj-arm-linux-gnueabihf && make -j4 "INSTALL=install --strip-program=true" returned exit code 2
make[1]: *** [debian/rules:21: override_dh_auto_build-arch] Error 25
make[1]: Leaving directory '/<<BUILDDIR>>/gatb-core-1.4.2+dfsg'
make: *** [debian/rules:15: binary-arch] Error 2

Tail of log for pyfftw on armhf:

One run: 19.44 ms (versus 65.11 ms for singled threaded)
One run: 21.61 ms (versus 65.10 ms for singled threaded)
One run: 70.56 ms (versus 86.39 ms for numpy.fft)
One run: 72.20 ms (versus 90.63 ms for numpy.fft)
One run: 28.57 ms (versus 112.49 ms for numpy.fft)
One run: 28.37 ms (versus 112.33 ms for numpy.fft)
One run: 70.88 ms (versus 61.93 ms for numpy.fft)
One run: 70.66 ms (versus 61.82 ms for numpy.fft)
One run: 35.94 ms (versus 78.88 ms for numpy.fft)
One run: 36.37 ms (versus 78.81 ms for numpy.fft)
E: pybuild pybuild:352: test: plugin distutils failed with: exit code=1: cd /<<PKGBUILDDIR>>/.pybuild/cpython3_3.8_pyfftw/build; python3.8 -m unittest discover -v 
dh_auto_test: error: pybuild --test -i python{version} -p 3.8 returned exit code 13
make[1]: *** [debian/rules:35: override_dh_auto_test] Error 1
make[1]: Leaving directory '/<<PKGBUILDDIR>>'
make: *** [debian/rules:14: build-arch] Error 2

Tail of log for kodi on armhf:

dh_clean \
	addons/skin.estuary/media/from-debian-logo.png \
	addons/webinterface.default/ \
	debian/dh-addon/*.1 \
	kodi_build_*/ \
	lib/gtest/ \
	media/Fonts/arial.ttf
make[1]: Leaving directory '/<<BUILDDIR>>/kodi-18.6+dfsg1'
 debian/rules build-arch
dh build-arch --buildsystem cmake --with python2,python3
   dh_update_autotools_config -a -O--buildsystem=cmake
   dh_autoreconf -a -O--buildsystem=cmake
   debian/rules override_dh_auto_configure
make[1]: Entering directory '/<<BUILDDIR>>/kodi-18.6+dfsg1'
rsvg-convert -w 250 -h 82 -o addons/skin.estuary/media/from-debian-logo.png debian/from-debian-logo.svg

Tail of log for openms on armhf:

  101 |         return static_cast< QOpenGLFunctions_2_0*>(this);
      |                                                         ^
      |                                                         )
make[5]: *** [src/openms_gui/CMakeFiles/OpenMS_GUI.dir/build.make:99: src/openms_gui/CMakeFiles/OpenMS_GUI.dir/OpenMS_GUI_autogen/mocs_compilation.cpp.o] Error 1
make[5]: Leaving directory '/<<BUILDDIR>>/openms-2.5.0+cleaned1/obj-arm-linux-gnueabihf'
make[4]: *** [CMakeFiles/Makefile2:1908: src/openms_gui/CMakeFiles/OpenMS_GUI.dir/all] Error 2
make[4]: Leaving directory '/<<BUILDDIR>>/openms-2.5.0+cleaned1/obj-arm-linux-gnueabihf'
make[3]: *** [CMakeFiles/Makefile2:1796: src/openms_gui/CMakeFiles/GUI.dir/rule] Error 2
make[3]: Leaving directory '/<<BUILDDIR>>/openms-2.5.0+cleaned1/obj-arm-linux-gnueabihf'
make[2]: *** [Makefile:607: GUI] Error 2
make[2]: Leaving directory '/<<BUILDDIR>>/openms-2.5.0+cleaned1/obj-arm-linux-gnueabihf'
dh_auto_build: error: cd obj-arm-linux-gnueabihf && make -j1 "INSTALL=install --strip-program=true" OpenMS GUI TOPP UTILS returned exit code 2
make[1]: *** [debian/rules:94: override_dh_auto_build] Error 25
make[1]: Leaving directory '/<<BUILDDIR>>/openms-2.5.0+cleaned1'
make: *** [debian/rules:43: build-arch] Error 2

Tail of log for jellyfish on armhf:

                 from ./include/jellyfish/hash_counter.hpp:14,
                 from sub_commands/count_main.cc:38:
./include/jellyfish/rectangular_binary_matrix.hpp: In member function 'bool jellyfish::RectangularBinaryMatrix::is_zero() const':
./include/jellyfish/rectangular_binary_matrix.hpp:121:29: error: comparison of integer expressions of different signedness: 'int' and 'const unsigned int' [-Werror=sign-compare]
  121 |       return (p - _columns) == _c;
      |              ~~~~~~~~~~~~~~~^~~~~
cc1plus: all warnings being treated as errors
make[3]: *** [Makefile:1710: sub_commands/count_main.o] Error 1
make[3]: Leaving directory '/<<PKGBUILDDIR>>'
make[2]: *** [Makefile:1025: all] Error 2
make[2]: Leaving directory '/<<PKGBUILDDIR>>'
dh_auto_build: error: make -j1 all bin/generate_sequence bin/test_all bin/fastq2sam returned exit code 2
make[1]: *** [debian/rules:78: override_dh_auto_build] Error 25
make[1]: Leaving directory '/<<PKGBUILDDIR>>'
make: *** [debian/rules:21: binary-arch] Error 2

Tail of log for paraview on armhf:

[  6%] Building CXX object VTK/Common/Core/CMakeFiles/CommonCore.dir/vtkReferenceCount.cxx.o
cd /<<PKGBUILDDIR>>/build.python3.8/VTK/Common/Core && /usr/bin/c++  -DCommonCore_EXPORTS -DVTK_MODULE_ENABLE_VTK_loguru=1 -I/<<PKGBUILDDIR>>/build.python3.8/VTK/Common/Core -I/<<PKGBUILDDIR>>/VTK/Common/Core -I/<<PKGBUILDDIR>>/build.python3.8/VTK/Common/Core/../DataModel -I/<<PKGBUILDDIR>>/build.python3.8/VTK/ThirdParty/loguru/vtkloguru -I/<<PKGBUILDDIR>>/VTK/ThirdParty/loguru/vtkloguru -isystem /<<PKGBUILDDIR>>/build.python3.8/VTK/Utilities/KWIML -isystem /<<PKGBUILDDIR>>/VTK/Utilities/KWIML -isystem /<<PKGBUILDDIR>>/build.python3.8/VTK/Utilities/KWSys -isystem /<<PKGBUILDDIR>>/VTK/Utilities/KWSys -isystem /<<PKGBUILDDIR>>/build.python3.8/VTK/ThirdParty/utf8 -isystem /<<PKGBUILDDIR>>/VTK/ThirdParty/utf8 -isystem /<<PKGBUILDDIR>>/build.python3.8/VTK/ThirdParty/loguru -isystem /<<PKGBUILDDIR>>/VTK/ThirdParty/loguru  -g -O2 -fdebug-prefix-map=/<<PKGBUILDDIR>>=. -fstack-protector-strong -Wformat -Werror=format-security -Wdate-time -D_FORTIFY_SOURCE=2 -Wdate-time -D_FORTIFY_SOURCE=2  -O3 -DNDEBUG -fPIC -fvisibility=hidden -fvisibility-inlines-hidden   -std=c++11 -o CMakeFiles/CommonCore.dir/vtkReferenceCount.cxx.o -c /<<PKGBUILDDIR>>/VTK/Common/Core/vtkReferenceCount.cxx
[  6%] Linking CXX shared library ../../../lib/arm-linux-gnueabihf/libvtkCommonCore-pv5.7.so
cd /<<PKGBUILDDIR>>/build.python3.8/VTK/Common/Core && /usr/bin/cmake -E cmake_link_script CMakeFiles/CommonCore.dir/link.txt --verbose=1
/usr/bin/c++ -fPIC -g -O2 -fdebug-prefix-map=/<<PKGBUILDDIR>>=. -fstack-protector-strong -Wformat -Werror=format-security -Wdate-time -D_FORTIFY_SOURCE=2 -Wdate-time -D_FORTIFY_SOURCE=2  -O3 -DNDEBUG  -Wl,-lc -Wl,-z,relro -Wl,--as-needed  -shared -Wl,-soname,libvtkCommonCore-pv5.7.so.1 -o ../../../lib/arm-linux-gnueabihf/libvtkCommonCore-pv5.7.so.5.7 CMakeFiles/CommonCore.dir/vtkArrayIteratorTemplateInstantiate.cxx.o CMakeFiles/CommonCore.dir/vtkGenericDataArray.cxx.o CMakeFiles/CommonCore.dir/vtkSOADataArrayTemplateInstantiate.cxx.o CMakeFiles/CommonCore.dir/vtkScalarsToColors.cxx.o CMakeFiles/CommonCore.dir/vtkShortArray.cxx.o CMakeFiles/CommonCore.dir/vtkSignedCharArray.cxx.o CMakeFiles/CommonCore.dir/vtkSimpleCriticalSection.cxx.o CMakeFiles/CommonCore.dir/vtkSmartPointerBase.cxx.o CMakeFiles/CommonCore.dir/vtkSortDataArray.cxx.o CMakeFiles/CommonCore.dir/vtkStdString.cxx.o CMakeFiles/CommonCore.dir/vtkStringArray.cxx.o CMakeFiles/CommonCore.dir/vtkStringOutputWindow.cxx.o CMakeFiles/CommonCore.dir/vtkTimePointUtility.cxx.o CMakeFiles/CommonCore.dir/vtkTimeStamp.cxx.o CMakeFiles/CommonCore.dir/vtkUnicodeString.cxx.o CMakeFiles/CommonCore.dir/vtkUnicodeStringArray.cxx.o CMakeFiles/CommonCore.dir/vtkUnsignedCharArray.cxx.o CMakeFiles/CommonCore.dir/vtkUnsignedIntArray.cxx.o CMakeFiles/CommonCore.dir/vtkUnsignedLongArray.cxx.o CMakeFiles/CommonCore.dir/vtkUnsignedLongLongArray.cxx.o CMakeFiles/CommonCore.dir/vtkUnsignedShortArray.cxx.o CMakeFiles/CommonCore.dir/vtkVariant.cxx.o CMakeFiles/CommonCore.dir/vtkVariantArray.cxx.o CMakeFiles/CommonCore.dir/vtkVersion.cxx.o CMakeFiles/CommonCore.dir/vtkVoidArray.cxx.o CMakeFiles/CommonCore.dir/vtkWeakPointerBase.cxx.o CMakeFiles/CommonCore.dir/vtkWeakReference.cxx.o CMakeFiles/CommonCore.dir/vtkWindow.cxx.o CMakeFiles/CommonCore.dir/vtkXMLFileOutputWindow.cxx.o CMakeFiles/CommonCore.dir/SMP/Sequential/vtkSMPTools.cxx.o CMakeFiles/CommonCore.dir/SMP/Sequential/vtkAtomic.cxx.o CMakeFiles/CommonCore.dir/vtkTypeInt8Array.cxx.o CMakeFiles/CommonCore.dir/vtkTypeInt16Array.cxx.o CMakeFiles/CommonCore.dir/vtkTypeInt32Array.cxx.o CMakeFiles/CommonCore.dir/vtkTypeInt64Array.cxx.o CMakeFiles/CommonCore.dir/vtkTypeUInt8Array.cxx.o CMakeFiles/CommonCore.dir/vtkTypeUInt16Array.cxx.o CMakeFiles/CommonCore.dir/vtkTypeUInt32Array.cxx.o CMakeFiles/CommonCore.dir/vtkTypeUInt64Array.cxx.o CMakeFiles/CommonCore.dir/vtkTypeFloat32Array.cxx.o CMakeFiles/CommonCore.dir/vtkTypeFloat64Array.cxx.o CMakeFiles/CommonCore.dir/vtkAbstractArray.cxx.o CMakeFiles/CommonCore.dir/vtkAnimationCue.cxx.o CMakeFiles/CommonCore.dir/vtkArray.cxx.o CMakeFiles/CommonCore.dir/vtkArrayCoordinates.cxx.o CMakeFiles/CommonCore.dir/vtkArrayExtents.cxx.o CMakeFiles/CommonCore.dir/vtkArrayExtentsList.cxx.o CMakeFiles/CommonCore.dir/vtkArrayIterator.cxx.o CMakeFiles/CommonCore.dir/vtkArrayRange.cxx.o CMakeFiles/CommonCore.dir/vtkArraySort.cxx.o CMakeFiles/CommonCore.dir/vtkArrayWeights.cxx.o CMakeFiles/CommonCore.dir/vtkBitArray.cxx.o CMakeFiles/CommonCore.dir/vtkBitArrayIterator.cxx.o CMakeFiles/CommonCore.dir/vtkBoxMuellerRandomSequence.cxx.o CMakeFiles/CommonCore.dir/vtkBreakPoint.cxx.o CMakeFiles/CommonCore.dir/vtkByteSwap.cxx.o CMakeFiles/CommonCore.dir/vtkCallbackCommand.cxx.o CMakeFiles/CommonCore.dir/vtkCharArray.cxx.o CMakeFiles/CommonCore.dir/vtkCollection.cxx.o CMakeFiles/CommonCore.dir/vtkCollectionIterator.cxx.o CMakeFiles/CommonCore.dir/vtkCommand.cxx.o CMakeFiles/CommonCore.dir/vtkCommonInformationKeyManager.cxx.o CMakeFiles/CommonCore.dir/vtkConditionVariable.cxx.o CMakeFiles/CommonCore.dir/vtkCriticalSection.cxx.o CMakeFiles/CommonCore.dir/vtkDataArray.cxx.o CMakeFiles/CommonCore.dir/vtkDataArrayCollection.cxx.o CMakeFiles/CommonCore.dir/vtkDataArrayCollectionIterator.cxx.o CMakeFiles/CommonCore.dir/vtkDataArraySelection.cxx.o CMakeFiles/CommonCore.dir/vtkDebugLeaks.cxx.o CMakeFiles/CommonCore.dir/vtkDebugLeaksManager.cxx.o CMakeFiles/CommonCore.dir/vtkDoubleArray.cxx.o CMakeFiles/CommonCore.dir/vtkDynamicLoader.cxx.o CMakeFiles/CommonCore.dir/vtkEventForwarderCommand.cxx.o CMakeFiles/CommonCore.dir/vtkFileOutputWindow.cxx.o CMakeFiles/CommonCore.dir/vtkFloatArray.cxx.o CMakeFiles/CommonCore.dir/vtkFloatingPointExceptions.cxx.o CMakeFiles/CommonCore.dir/vtkGarbageCollector.cxx.o CMakeFiles/CommonCore.dir/vtkGarbageCollectorManager.cxx.o CMakeFiles/CommonCore.dir/vtkGaussianRandomSequence.cxx.o CMakeFiles/CommonCore.dir/vtkIdList.cxx.o CMakeFiles/CommonCore.dir/vtkIdListCollection.cxx.o CMakeFiles/CommonCore.dir/vtkIdTypeArray.cxx.o CMakeFiles/CommonCore.dir/vtkIndent.cxx.o CMakeFiles/CommonCore.dir/vtkInformation.cxx.o CMakeFiles/CommonCore.dir/vtkInformationDataObjectKey.cxx.o CMakeFiles/CommonCore.dir/vtkInformationDoubleKey.cxx.o CMakeFiles/CommonCore.dir/vtkInformationDoubleVectorKey.cxx.o CMakeFiles/CommonCore.dir/vtkInformationIdTypeKey.cxx.o CMakeFiles/CommonCore.dir/vtkInformationInformationKey.cxx.o CMakeFiles/CommonCore.dir/vtkInformationInformationVectorKey.cxx.o CMakeFiles/CommonCore.dir/vtkInformationIntegerKey.cxx.o CMakeFiles/CommonCore.dir/vtkInformationIntegerPointerKey.cxx.o CMakeFiles/CommonCore.dir/vtkInformationIntegerVectorKey.cxx.o CMakeFiles/CommonCore.dir/vtkInformationIterator.cxx.o CMakeFiles/CommonCore.dir/vtkInformationKey.cxx.o CMakeFiles/CommonCore.dir/vtkInformationKeyLookup.cxx.o CMakeFiles/CommonCore.dir/vtkInformationKeyVectorKey.cxx.o CMakeFiles/CommonCore.dir/vtkInformationObjectBaseKey.cxx.o CMakeFiles/CommonCore.dir/vtkInformationObjectBaseVectorKey.cxx.o CMakeFiles/CommonCore.dir/vtkInformationRequestKey.cxx.o CMakeFiles/CommonCore.dir/vtkInformationStringKey.cxx.o CMakeFiles/CommonCore.dir/vtkInformationStringVectorKey.cxx.o CMakeFiles/CommonCore.dir/vtkInformationUnsignedLongKey.cxx.o CMakeFiles/CommonCore.dir/vtkInformationVariantKey.cxx.o CMakeFiles/CommonCore.dir/vtkInformationVariantVectorKey.cxx.o CMakeFiles/CommonCore.dir/vtkInformationVector.cxx.o CMakeFiles/CommonCore.dir/vtkIntArray.cxx.o CMakeFiles/CommonCore.dir/vtkLargeInteger.cxx.o CMakeFiles/CommonCore.dir/vtkLogger.cxx.o CMakeFiles/CommonCore.dir/vtkLongArray.cxx.o CMakeFiles/CommonCore.dir/vtkLongLongArray.cxx.o CMakeFiles/CommonCore.dir/vtkLookupTable.cxx.o CMakeFiles/CommonCore.dir/vtkMath.cxx.o CMakeFiles/CommonCore.dir/vtkMersenneTwister.cxx.o CMakeFiles/CommonCore.dir/vtkMinimalStandardRandomSequence.cxx.o CMakeFiles/CommonCore.dir/vtkMultiThreader.cxx.o CMakeFiles/CommonCore.dir/vtkMutexLock.cxx.o CMakeFiles/CommonCore.dir/vtkOStrStreamWrapper.cxx.o CMakeFiles/CommonCore.dir/vtkOStreamWrapper.cxx.o CMakeFiles/CommonCore.dir/vtkObject.cxx.o CMakeFiles/CommonCore.dir/vtkObjectBase.cxx.o CMakeFiles/CommonCore.dir/vtkObjectFactory.cxx.o CMakeFiles/CommonCore.dir/vtkObjectFactoryCollection.cxx.o CMakeFiles/CommonCore.dir/vtkOldStyleCallbackCommand.cxx.o CMakeFiles/CommonCore.dir/vtkOutputWindow.cxx.o CMakeFiles/CommonCore.dir/vtkOverrideInformation.cxx.o CMakeFiles/CommonCore.dir/vtkOverrideInformationCollection.cxx.o CMakeFiles/CommonCore.dir/vtkPoints.cxx.o CMakeFiles/CommonCore.dir/vtkPoints2D.cxx.o CMakeFiles/CommonCore.dir/vtkPriorityQueue.cxx.o CMakeFiles/CommonCore.dir/vtkRandomPool.cxx.o CMakeFiles/CommonCore.dir/vtkRandomSequence.cxx.o CMakeFiles/CommonCore.dir/vtkReferenceCount.cxx.o  -Wl,-rpath,/<<PKGBUILDDIR>>/build.python3.8/lib/arm-linux-gnueabihf: ../../../lib/arm-linux-gnueabihf/libvtksys-pv5.7.so.5.7 ../../../lib/arm-linux-gnueabihf/libvtkloguru-pv5.7.so.5.7 -ldl -lpthread 
cd /<<PKGBUILDDIR>>/build.python3.8/VTK/Common/Core && /usr/bin/cmake -E cmake_symlink_library ../../../lib/arm-linux-gnueabihf/libvtkCommonCore-pv5.7.so.5.7 ../../../lib/arm-linux-gnueabihf/libvtkCommonCore-pv5.7.so.1 ../../../lib/arm-linux-gnueabihf/libvtkCommonCore-pv5.7.so
make[4]: Leaving directory '/<<PKGBUILDDIR>>/build.python3.8'
[  6%] Built target CommonCore
make[3]: Leaving directory '/<<PKGBUILDDIR>>/build.python3.8'
make[2]: *** [Makefile:144: all] Error 2
make[2]: Leaving directory '/<<PKGBUILDDIR>>/build.python3.8'
dh_auto_build: error: cd build.python3.8 && make -j4 "INSTALL=install --strip-program=true" returned exit code 2
make[1]: *** [debian/rules:96: my_build_python3.8] Error 25
make[1]: Leaving directory '/<<PKGBUILDDIR>>'
make: *** [debian/rules:8: build-arch] Error 2

Tail of log for haskell-protobuf on armhf:

    fixed32:                                     OK
      +++ OK, passed 100 tests (100% prop_req :: Fixed Word32).
    fixed64:                                     OK
      +++ OK, passed 100 tests (100% prop_req :: Fixed Word64).
    sfixed32:                                    OK
      +++ OK, passed 100 tests (100% prop_req :: Fixed Int32).
    sfixed64:                                    OK (0.01s)
      +++ OK, passed 100 tests (100% prop_req :: Fixed Int64).
    float:                                       OK
      +++ OK, passed 100 tests (100% prop_req :: Float).
    double:                                      protobuf-test: SignalException 7
Test suite protobuf-test: FAIL
Test suite logged to: dist-ghc/test/protobuf-0.2.1.3-protobuf-test.log
0 of 1 test suites (0 of 1 test cases) passed.
make: *** [/usr/share/cdbs/1/class/hlibrary.mk:154: check-ghc-stamp] Error 1

Tail of log for openstructure on armhf:

unable to open database file
WARNING: skipping mmcif_entity_poly_tests unit test. Compound library is required
unable to open database file

*** No errors detected
make[4]: Leaving directory '/<<PKGBUILDDIR>>/obj-arm-linux-gnueabihf'
[100%] Built target ost_io_tests_run
.
----------------------------------------------------------------------
Ran 2 tests in 154.231s

OK
Could not find CAD score classic executables: ignoring unit tests
make[4]: Leaving directory '/<<PKGBUILDDIR>>/obj-arm-linux-gnueabihf'
[100%] Built target test_cadscore.py_run

Tail of log for haskell-pretty-simple on armhf:

[1 of 2] Compiling Build_doctests   ( dist-ghc/build/pretty-simple-doctest/autogen/Build_doctests.hs, dist-ghc/build/pretty-simple-doctest/pretty-simple-doctest-tmp/Build_doctests.o )
[2 of 2] Compiling Main             ( test/DocTest.hs, dist-ghc/build/pretty-simple-doctest/pretty-simple-doctest-tmp/Main.o )
Linking dist-ghc/build/pretty-simple-doctest/pretty-simple-doctest ...
touch build-ghc-stamp
. /usr/share/haskell-devscripts/Dh_Haskell.sh && \
check_recipe
Running debian/hlibrary.setup test --builddir=dist-ghc --show-details=direct
Running 1 test suites...
Test suite pretty-simple-doctest: RUNNING...
pretty-simple-doctest: fd:13: hGetLine: end of file
Test suite pretty-simple-doctest: FAIL
Test suite logged to:
dist-ghc/test/pretty-simple-3.2.3.0-pretty-simple-doctest.log
0 of 1 test suites (0 of 1 test cases) passed.
make: *** [/usr/share/cdbs/1/class/hlibrary.mk:154: check-ghc-stamp] Error 1

Tail of log for haskell-gi-pango on armhf:

[78 of 94] Compiling GI.Pango.Objects.Context ( GI/Pango/Objects/Context.hs, dist-ghc/build/GI/Pango/Objects/Context.o )
[79 of 94] Compiling GI.Pango.Structs.Rectangle[boot] ( GI/Pango/Structs/Rectangle.hs-boot, dist-ghc/build/GI/Pango/Structs/Rectangle.o-boot )
[80 of 94] Compiling GI.Pango.Structs.Matrix ( GI/Pango/Structs/Matrix.hs, dist-ghc/build/GI/Pango/Structs/Matrix.o )
[81 of 94] Compiling GI.Pango.Structs.LayoutLine ( GI/Pango/Structs/LayoutLine.hs, dist-ghc/build/GI/Pango/Structs/LayoutLine.o )
[82 of 94] Compiling GI.Pango.Structs.LayoutIter ( GI/Pango/Structs/LayoutIter.hs, dist-ghc/build/GI/Pango/Structs/LayoutIter.o )
[83 of 94] Compiling GI.Pango.Structs.GlyphString ( GI/Pango/Structs/GlyphString.hs, dist-ghc/build/GI/Pango/Structs/GlyphString.o )
[84 of 94] Compiling GI.Pango.Structs.AttrShape ( GI/Pango/Structs/AttrShape.hs, dist-ghc/build/GI/Pango/Structs/AttrShape.o )
[85 of 94] Compiling GI.Pango.Objects.Font ( GI/Pango/Objects/Font.hs, dist-ghc/build/GI/Pango/Objects/Font.o )

GI/Pango/Objects/Font.hs:670:9: error:
    parse error on input `HarfBuzz.FeatureT.feature_t'
    |
670 |     Ptr HarfBuzz.FeatureT.feature_t ->      -- features : TCArray False (-1) 2 (TInterface (Name {namespace = "HarfBuzz", name = "feature_t"}))
    |         ^^^^^^^^^^^^^^^^^^^^^^^^^^^
make: *** [/usr/share/cdbs/1/class/hlibrary.mk:147: build-ghc-stamp] Error 1

Tail of log for librandomx on armhf:

collect2: error: ld returned 1 exit status
make[3]: *** [CMakeFiles/randomx-benchmark.dir/build.make:103: randomx-benchmark] Error 1
make[3]: Leaving directory '/<<PKGBUILDDIR>>/obj-arm-linux-gnueabihf'
make[2]: *** [CMakeFiles/Makefile2:85: CMakeFiles/randomx-benchmark.dir/all] Error 2
make[2]: *** Waiting for unfinished jobs....
[100%] Linking CXX executable randomx-tests
/usr/bin/cmake -E cmake_link_script CMakeFiles/randomx-tests.dir/link.txt --verbose=1
/usr/bin/c++  -g -O2 -fdebug-prefix-map=/<<PKGBUILDDIR>>=. -fstack-protector-strong -Wformat -Werror=format-security -Wdate-time -D_FORTIFY_SOURCE=2  -Wl,-z,relro -rdynamic CMakeFiles/randomx-tests.dir/src/tests/tests.cpp.o  -o randomx-tests  -Wl,-rpath,/<<PKGBUILDDIR>>/obj-arm-linux-gnueabihf librandomx.so.0.0.0 
make[3]: Leaving directory '/<<PKGBUILDDIR>>/obj-arm-linux-gnueabihf'
[100%] Built target randomx-tests
make[2]: Leaving directory '/<<PKGBUILDDIR>>/obj-arm-linux-gnueabihf'
make[1]: *** [Makefile:133: all] Error 2
make[1]: Leaving directory '/<<PKGBUILDDIR>>/obj-arm-linux-gnueabihf'
dh_auto_build: error: cd obj-arm-linux-gnueabihf && make -j4 "INSTALL=install --strip-program=true" returned exit code 2
make: *** [debian/rules:46: binary-arch] Error 25

Tail of log for vmemcache on armhf:

make[3]: Leaving directory '/<<PKGBUILDDIR>>/obj-arm-linux-gnueabihf'
make[2]: *** [CMakeFiles/Makefile2:598: tests/CMakeFiles/vmemcache_test_mt.dir/all] Error 2
[ 66%] Linking C executable vmemcache_test_basic
cd /<<PKGBUILDDIR>>/obj-arm-linux-gnueabihf/tests && /usr/bin/cmake -E cmake_link_script CMakeFiles/vmemcache_test_basic.dir/link.txt --verbose=1
/usr/bin/cc -g -O2 -fdebug-prefix-map=/<<PKGBUILDDIR>>=. -fstack-protector-strong -Wformat -Werror=format-security -Wall -pedantic -Wdate-time -D_FORTIFY_SOURCE=2 -fno-common -Wall -Wconversion -Wmissing-field-initializers -Wmissing-prototypes -Wpointer-arith -Wsign-compare -Wsign-conversion -Wunused-macros -Werror=incompatible-pointer-types -fdata-sections -ffunction-sections  -Wl,-z,relro -Wl,-z,now -latomic  -Wl,-z,relro -Wl,--warn-common -rdynamic CMakeFiles/vmemcache_test_basic.dir/vmemcache_test_basic.c.o  -o vmemcache_test_basic  -Wl,-rpath,/<<PKGBUILDDIR>>/obj-arm-linux-gnueabihf/src ../src/libvmemcache.so.0 
/usr/bin/ld: ../src/libvmemcache.so.0: undefined reference to `__atomic_fetch_add_8'
collect2: error: ld returned 1 exit status
make[3]: *** [tests/CMakeFiles/vmemcache_test_basic.dir/build.make:88: tests/vmemcache_test_basic] Error 1
make[3]: Leaving directory '/<<PKGBUILDDIR>>/obj-arm-linux-gnueabihf'
make[2]: *** [CMakeFiles/Makefile2:571: tests/CMakeFiles/vmemcache_test_basic.dir/all] Error 2
make[2]: Leaving directory '/<<PKGBUILDDIR>>/obj-arm-linux-gnueabihf'
make[1]: *** [Makefile:144: all] Error 2
make[1]: Leaving directory '/<<PKGBUILDDIR>>/obj-arm-linux-gnueabihf'
dh_auto_build: error: cd obj-arm-linux-gnueabihf && make -j4 "INSTALL=install --strip-program=true" returned exit code 2
make: *** [debian/rules:10: build-arch] Error 25

Tail of log for haskell-xml-html-qq on armhf:

xml-html-qq-doctest:   -Mgrace=<n>
xml-html-qq-doctest:             The amount of allocation after the program receives a
xml-html-qq-doctest:             HeapOverflow exception before the exception is thrown again, if
xml-html-qq-doctest:             the program is still exceeding the heap limit.
xml-html-qq-doctest: 
xml-html-qq-doctest: RTS options may also be specified using the GHCRTS environment variable.
xml-html-qq-doctest: 
xml-html-qq-doctest: Other RTS options may be available for programs compiled a different way.
xml-html-qq-doctest: The GHC User's Guide has full details.
xml-html-qq-doctest: 
Test suite xml-html-qq-doctest: FAIL
Test suite logged to:
dist-ghc/test/xml-html-qq-0.1.0.1-xml-html-qq-doctest.log
0 of 2 test suites (0 of 2 test cases) passed.
make: *** [/usr/share/cdbs/1/class/hlibrary.mk:154: check-ghc-stamp] Error 1

Tail of log for perftest on armhf:

                 from src/perftest_communication.h:45,
                 from src/perftest_communication.c:17:
src/get_clock.h:109:2: warning: #warning get_cycles not implemented for this architecture: attempt asm/timex.h [-Wcpp]
  109 | #warning get_cycles not implemented for this architecture: attempt asm/timex.h
      |  ^~~~~~~
src/get_clock.h:110:10: fatal error: asm/timex.h: No such file or directory
  110 | #include <asm/timex.h>
      |          ^~~~~~~~~~~~~
compilation terminated.
make[2]: *** [Makefile:857: src/perftest_communication.o] Error 1
make[2]: Leaving directory '/<<BUILDDIR>>/perftest-4.4+0.29'
make[1]: *** [Makefile:581: all] Error 2
make[1]: Leaving directory '/<<BUILDDIR>>/perftest-4.4+0.29'
dh_auto_build: error: make -j4 returned exit code 2
make: *** [debian/rules:7: binary-arch] Error 25

Tail of log for ocamlgsl on armhf:

In file included from mlgsl_matrix.h:9,
                 from mlgsl_matrix_double.h:11,
                 from mlgsl_wavelet.c:13:
wrappers.h:13:2: error: #error "Architectures with double-word alignment for doubles are not supported"
   13 | #error "Architectures with double-word alignment for doubles are not supported"
      |  ^~~~~
arm-linux-gnueabihf-gcc src/mlgsl_cdf.o (exit 1)
(cd _build/default/src && /usr/bin/arm-linux-gnueabihf-gcc -O2 -fno-strict-aliasing -fwrapv -fPIC -D_FILE_OFFSET_BITS=64 -D_REENTRANT -O2 -fno-strict-aliasing -fwrapv -fPIC -fPIC -DPIC -Wno-unused-parameter -g -I /usr/lib/ocaml -o mlgsl_cdf.o -c mlgsl_cdf.c)
In file included from mlgsl_cdf.c:2:
wrappers.h:13:2: error: #error "Architectures with double-word alignment for doubles are not supported"
   13 | #error "Architectures with double-word alignment for doubles are not supported"
      |  ^~~~~
make[1]: *** [debian/rules:11: override_dh_auto_build] Error 1
make[1]: Leaving directory '/<<PKGBUILDDIR>>'
make: *** [debian/rules:8: binary-arch] Error 2

Tail of log for gloo on armhf:

    arg [/usr/lib/gcc/arm-linux-gnueabihf/10/../../../arm-linux-gnueabihf/crtn.o] ==> ignore
  collapse library dir [/usr/lib/gcc/arm-linux-gnueabihf/10] ==> [/usr/lib/gcc/arm-linux-gnueabihf/10]
  collapse library dir [/usr/lib/gcc/arm-linux-gnueabihf/10/../../../arm-linux-gnueabihf] ==> [/usr/lib/arm-linux-gnueabihf]
  collapse library dir [/usr/lib/gcc/arm-linux-gnueabihf/10/../../..] ==> [/usr/lib]
  collapse library dir [/lib/arm-linux-gnueabihf] ==> [/lib/arm-linux-gnueabihf]
  collapse library dir [/usr/lib/arm-linux-gnueabihf] ==> [/usr/lib/arm-linux-gnueabihf]
  implicit libs: [gcc;gcc_s;c;gcc;gcc_s]
  implicit dirs: [/usr/lib/gcc/arm-linux-gnueabihf/10;/usr/lib/arm-linux-gnueabihf;/usr/lib;/lib/arm-linux-gnueabihf]
  implicit fwks: []


dh_auto_configure: error: cd obj-arm-linux-gnueabihf && cmake -DCMAKE_INSTALL_PREFIX=/usr -DCMAKE_BUILD_TYPE=None -DCMAKE_INSTALL_SYSCONFDIR=/etc -DCMAKE_INSTALL_LOCALSTATEDIR=/var -DCMAKE_EXPORT_NO_PACKAGE_REGISTRY=ON -DCMAKE_FIND_PACKAGE_NO_PACKAGE_REGISTRY=ON -DCMAKE_INSTALL_RUNSTATEDIR=/run -DCMAKE_SKIP_INSTALL_ALL_DEPENDENCY=ON "-GUnix Makefiles" -DCMAKE_VERBOSE_MAKEFILE=ON -DCMAKE_INSTALL_LIBDIR=lib/arm-linux-gnueabihf -DCMAKE_BUILD_TYPE=RelWithDebInfo -DUSE_REDIS=ON -DUSE_IBVERBS=ON -DUSE_MPI=ON -DUSE_LIBUV=OFF -DUSE_CUDA=OFF -DUSE_NCCL=OFF -DBUILD_TEST=OFF -DBUILD_BENCHMARK=OFF -DBUILD_SHARED_LIBS=ON .. returned exit code 1
make[1]: *** [debian/rules:13: override_dh_auto_configure] Error 2
make[1]: Leaving directory '/<<PKGBUILDDIR>>'
make: *** [debian/rules:8: binary-arch] Error 2

Tail of log for nix on armhf:

/usr/include/c++/10/bits/vector.tcc:121:21: note: parameter passing for argument of type '__gnu_cxx::__normal_iterator<nlohmann::basic_json<>*, std::vector<nlohmann::basic_json<>, std::allocator<nlohmann::basic_json<> > > >' changed in GCC 7.1
  121 |    _M_realloc_insert(end(), std::forward<_Args>(__args)...);
      |    ~~~~~~~~~~~~~~~~~^~~~~~~~~~~~~~~~~~~~~~~~~~~~~~~~~~~~~~~
g++ -std=c++17 -o /<<BUILDDIR>>/nix-2.3.7+dfsg1/src/libutil/libnixutil.so -shared -L/usr/lib/arm-linux-gnueabihf -Wl,-z,relro -Wl,-z,now -L/usr/lib/arm-linux-gnueabihf -Wl,-z,relro -Wl,-z,now -Wl,--no-copy-dt-needed-entries src/libutil/affinity.o src/libutil/archive.o src/libutil/args.o src/libutil/compression.o src/libutil/config.o src/libutil/hash.o src/libutil/json.o src/libutil/logging.o src/libutil/serialise.o src/libutil/thread-pool.o src/libutil/util.o src/libutil/xml-writer.o -llzma -lbz2 -pthread -lcrypto -lbrotlienc -lbrotlidec -L/usr/lib/arm-linux-gnueabihf -lboost_context -Wl,-z,defs -Wl,-soname=libnixutil.so   
/usr/bin/ld: /usr/bin/ld: DWARF error: could not find variable specification at offset 417e9
/usr/bin/ld: DWARF error: could not find variable specification at offset 41ca2
src/libutil/logging.o: in function `std::__atomic_base<unsigned long long>::fetch_add(unsigned long long, std::memory_order)':
/usr/include/c++/10/bits/atomic_base.h:548: undefined reference to `__atomic_fetch_add_8'
g++ -std=c++17 -o src/libstore/local-store.o -c src/libstore/local-store.cc -fstack-protector-strong -Wformat -Werror=format-security -g -Wall -include config.h -Wdate-time -D_FORTIFY_SOURCE=2 -fPIC -g -I . -I src -I src/libutil -I src/libstore -I src/libmain -I src/libexpr -I src/nix  -DREADLINE -I/usr/include/arm-linux-gnueabihf -I/usr/include -g -O2 -fdebug-prefix-map=/<<BUILDDIR>>/nix-2.3.7+dfsg1=. -fstack-protector-strong -Wformat -Werror=format-security -DNIX_PREFIX=\"/usr\" -DNIX_STORE_DIR=\"/nix/store\" -DNIX_DATA_DIR=\"/usr/share\" -DNIX_STATE_DIR=\"/nix/var/nix\" -DNIX_LOG_DIR=\"/nix/var/log/nix\" -DNIX_CONF_DIR=\"/etc/nix\" -DNIX_LIBEXEC_DIR=\"/usr/libexec\" -DNIX_BIN_DIR=\"/usr/bin\" -DNIX_MAN_DIR=\"/usr/share/man\" -DLSOF=\"lsof\" -MMD -MF src/libstore/.local-store.o.dep -MP
collect2: error: ld returned 1 exit status
make[1]: *** [mk/lib.mk:104: src/libutil/libnixutil.so] Error 1
make[1]: *** Waiting for unfinished jobs....
make[1]: Leaving directory '/<<BUILDDIR>>/nix-2.3.7+dfsg1'
dh_auto_build: error: make -j4 returned exit code 2
make: *** [debian/rules:31: build-arch] Error 25

Tail of log for qtwebengine-opensource-src on armhf:

dpkg-gensymbols: warning: debian/libqt5webenginecore5/DEBIAN/symbols doesn't match completely debian/libqt5webenginecore5.symbols
--- debian/libqt5webenginecore5.symbols (libqt5webenginecore5_5.14.2+dfsg1-5_armhf)
+++ dpkg-gensymbolsPC9UPQ	2020-09-08 12:23:35.737216943 +0000
@@ -1879,7 +1879,8 @@
  _ZTVNSt6thread11_State_implINS_8_InvokerISt5tupleIJMN8perfetto4base16ThreadTaskRunnerEFvSt8functionIFvPNS4_14UnixTaskRunnerEEEEPS5_SA_EEEEEE@Qt_5 5.14.1
  _ZTVNSt6thread11_State_implINS_8_InvokerISt5tupleIJPFvPvEP12SkThreadPoolI8SkTArrayISt8functionIFvvEELb0EEEEEEEEE@Qt_5 5.11.1
  _ZTVNSt6thread11_State_implINS_8_InvokerISt5tupleIJPFvPvEP12SkThreadPoolISt5dequeISt8functionIFvvEESaISA_EEEEEEEEE@Qt_5 5.11.1
- _ZTVSt23_Sp_counted_ptr_inplaceINSt8__detail4_NFAINSt7__cxx1112regex_traitsIcEEEESaIS5_ELN9__gnu_cxx12_Lock_policyE2EE@Qt_5 5.14.1
+ _ZTVSt23_Sp_counted_ptr_inplaceINSt8__detail4_NFAINSt7__cxx1112regex_traitsIcEEEESaIS5_ELN9__gnu_cxx12_Lock_policyE1EE@Qt_5 5.14.2+dfsg1-5
+#MISSING: 5.14.2+dfsg1-5# _ZTVSt23_Sp_counted_ptr_inplaceINSt8__detail4_NFAINSt7__cxx1112regex_traitsIcEEEESaIS5_ELN9__gnu_cxx12_Lock_policyE2EE@Qt_5 5.14.1
  (optional=templinst)_ZZNKSt7__cxx1112regex_traitsIcE16lookup_classnameIPKcEENS1_10_RegexMaskET_S6_bE12__classnames@Qt_5 5.14.1
  (optional=templinst)_ZZNKSt7__cxx1112regex_traitsIcE18lookup_collatenameIPKcEENS_12basic_stringIcSt11char_traitsIcESaIcEEET_SA_E14__collatenames@Qt_5 5.14.1
  (optional=templinst)_ZZNKSt8__detail11_AnyMatcherINSt7__cxx1112regex_traitsIcEELb0ELb0ELb0EEclEcE5__nul@Qt_5 5.14.1
dh_makeshlibs: error: failing due to earlier errors
make: *** [debian/rules:59: binary-arch] Error 25

Tail of log for restinio on armhf:

[ 43%] Linking CXX executable sample.hello_world
cd /<<PKGBUILDDIR>>/obj-arm-linux-gnueabihf/sample/hello_world && /usr/bin/cmake -E cmake_link_script CMakeFiles/sample.hello_world.dir/link.txt --verbose=1
/usr/bin/c++  -g -O2 -fdebug-prefix-map=/<<PKGBUILDDIR>>=. -fstack-protector-strong -Wformat -Werror=format-security -Wdate-time -D_FORTIFY_SOURCE=2  -Wl,-z,relro -Wl,-z,now CMakeFiles/sample.hello_world.dir/main.cpp.o  -o sample.hello_world  /usr/lib/arm-linux-gnueabihf/libfmt.a -lhttp_parser -pthread 
make[3]: Leaving directory '/<<PKGBUILDDIR>>/obj-arm-linux-gnueabihf'
[ 43%] Built target sample.hello_world
[ 44%] Linking CXX executable _unit.test.socket_options_tls
cd /<<PKGBUILDDIR>>/obj-arm-linux-gnueabihf/test/socket_options_tls && /usr/bin/cmake -E cmake_link_script CMakeFiles/_unit.test.socket_options_tls.dir/link.txt --verbose=1
/usr/bin/c++  -g -O2 -fdebug-prefix-map=/<<PKGBUILDDIR>>=. -fstack-protector-strong -Wformat -Werror=format-security -Wdate-time -D_FORTIFY_SOURCE=2  -Wl,-z,relro -Wl,-z,now CMakeFiles/_unit.test.socket_options_tls.dir/main.cpp.o  -o _unit.test.socket_options_tls  ../catch_main/librestinio_catch_main.a /usr/lib/arm-linux-gnueabihf/libssl.so /usr/lib/arm-linux-gnueabihf/libcrypto.so /usr/lib/arm-linux-gnueabihf/libfmt.a -lhttp_parser -pthread 
make[3]: Leaving directory '/<<PKGBUILDDIR>>/obj-arm-linux-gnueabihf'
[ 44%] Built target _unit.test.socket_options_tls
make[2]: Leaving directory '/<<PKGBUILDDIR>>/obj-arm-linux-gnueabihf'
make[1]: *** [Makefile:144: all] Error 2
make[1]: Leaving directory '/<<PKGBUILDDIR>>/obj-arm-linux-gnueabihf'
dh_auto_build: error: cd obj-arm-linux-gnueabihf && make -j4 "INSTALL=install --strip-program=true" returned exit code 2
make: *** [debian/rules:27: binary-arch] Error 25

Tail of log for icinga2 on armhf:

      |     ^
/<<PKGBUILDDIR>>/lib/icinga/timeperiod.cpp:147:5: note: parameter passing for argument of type 'std::initializer_list<std::pair<const icinga::String, icinga::Value> >' changed in GCC 7.1
  147 |    }));
      |     ^
/<<PKGBUILDDIR>>/lib/icinga/timeperiod.cpp: In member function 'void icinga::TimePeriod::AddSegment(double, double)':
/<<PKGBUILDDIR>>/lib/icinga/timeperiod.cpp:87:3: note: parameter passing for argument of type 'std::initializer_list<std::pair<const icinga::String, icinga::Value> >' changed in GCC 7.1
   87 |  });
      |   ^
make[3]: Leaving directory '/<<PKGBUILDDIR>>/obj-arm-linux-gnueabihf'
[ 56%] Built target icinga
make[2]: Leaving directory '/<<PKGBUILDDIR>>/obj-arm-linux-gnueabihf'
make[1]: *** [Makefile:185: all] Error 2
make[1]: Leaving directory '/<<PKGBUILDDIR>>/obj-arm-linux-gnueabihf'
dh_auto_build: error: cd obj-arm-linux-gnueabihf && make -j4 "INSTALL=install --strip-program=true" returned exit code 2
make: *** [debian/rules:18: build-arch] Error 25

Tail of log for megahit on armhf:

 1472 |     iterator erase(iterator it) { _erase(it++); return it; }
      |              ^~~~~
/<<PKGBUILDDIR>>/src/parallel_hashmap/phmap.h: In member function ‘phmap::container_internal::raw_hash_set<Policy, Hash, Eq, Alloc>::iterator phmap::container_internal::raw_hash_set<Policy, Hash, Eq, Alloc>::erase(phmap::container_internal::raw_hash_set<Policy, Hash, Eq, Alloc>::iterator) [with Policy = phmap::container_internal::FlatHashSetPolicy<KmerPlus<Kmer<3, long long unsigned int>, ContigFlankIndex<Kmer<3, long long unsigned int> >::FlankInfo> >; Hash = KmerHash; Eq = phmap::EqualTo<KmerPlus<Kmer<3, long long unsigned int>, ContigFlankIndex<Kmer<3, long long unsigned int> >::FlankInfo> >; Alloc = std::allocator<KmerPlus<Kmer<3, long long unsigned int>, ContigFlankIndex<Kmer<3, long long unsigned int> >::FlankInfo> >]’:
/<<PKGBUILDDIR>>/src/parallel_hashmap/phmap.h:1472:14: note: parameter passing for argument of type ‘phmap::container_internal::raw_hash_set<phmap::container_internal::FlatHashSetPolicy<KmerPlus<Kmer<3, long long unsigned int>, ContigFlankIndex<Kmer<3, long long unsigned int> >::FlankInfo> >, KmerHash, phmap::EqualTo<KmerPlus<Kmer<3, long long unsigned int>, ContigFlankIndex<Kmer<3, long long unsigned int> >::FlankInfo> >, std::allocator<KmerPlus<Kmer<3, long long unsigned int>, ContigFlankIndex<Kmer<3, long long unsigned int> >::FlankInfo> > >::iterator’ changed in GCC 7.1
/<<PKGBUILDDIR>>/src/parallel_hashmap/phmap.h: In member function ‘phmap::container_internal::raw_hash_set<Policy, Hash, Eq, Alloc>::iterator phmap::container_internal::raw_hash_set<Policy, Hash, Eq, Alloc>::erase(phmap::container_internal::raw_hash_set<Policy, Hash, Eq, Alloc>::iterator) [with Policy = phmap::container_internal::FlatHashSetPolicy<KmerPlus<Kmer<2, long long unsigned int>, ContigFlankIndex<Kmer<2, long long unsigned int> >::FlankInfo> >; Hash = KmerHash; Eq = phmap::EqualTo<KmerPlus<Kmer<2, long long unsigned int>, ContigFlankIndex<Kmer<2, long long unsigned int> >::FlankInfo> >; Alloc = std::allocator<KmerPlus<Kmer<2, long long unsigned int>, ContigFlankIndex<Kmer<2, long long unsigned int> >::FlankInfo> >]’:
/<<PKGBUILDDIR>>/src/parallel_hashmap/phmap.h:1472:14: note: parameter passing for argument of type ‘phmap::container_internal::raw_hash_set<phmap::container_internal::FlatHashSetPolicy<KmerPlus<Kmer<2, long long unsigned int>, ContigFlankIndex<Kmer<2, long long unsigned int> >::FlankInfo> >, KmerHash, phmap::EqualTo<KmerPlus<Kmer<2, long long unsigned int>, ContigFlankIndex<Kmer<2, long long unsigned int> >::FlankInfo> >, std::allocator<KmerPlus<Kmer<2, long long unsigned int>, ContigFlankIndex<Kmer<2, long long unsigned int> >::FlankInfo> > >::iterator’ changed in GCC 7.1
/<<PKGBUILDDIR>>/src/parallel_hashmap/phmap.h: In member function ‘phmap::container_internal::raw_hash_set<Policy, Hash, Eq, Alloc>::iterator phmap::container_internal::raw_hash_set<Policy, Hash, Eq, Alloc>::erase(phmap::container_internal::raw_hash_set<Policy, Hash, Eq, Alloc>::iterator) [with Policy = phmap::container_internal::FlatHashSetPolicy<KmerPlus<Kmer<1, long long unsigned int>, ContigFlankIndex<Kmer<1, long long unsigned int> >::FlankInfo> >; Hash = KmerHash; Eq = phmap::EqualTo<KmerPlus<Kmer<1, long long unsigned int>, ContigFlankIndex<Kmer<1, long long unsigned int> >::FlankInfo> >; Alloc = std::allocator<KmerPlus<Kmer<1, long long unsigned int>, ContigFlankIndex<Kmer<1, long long unsigned int> >::FlankInfo> >]’:
/<<PKGBUILDDIR>>/src/parallel_hashmap/phmap.h:1472:14: note: parameter passing for argument of type ‘phmap::container_internal::raw_hash_set<phmap::container_internal::FlatHashSetPolicy<KmerPlus<Kmer<1, long long unsigned int>, ContigFlankIndex<Kmer<1, long long unsigned int> >::FlankInfo> >, KmerHash, phmap::EqualTo<KmerPlus<Kmer<1, long long unsigned int>, ContigFlankIndex<Kmer<1, long long unsigned int> >::FlankInfo> >, std::allocator<KmerPlus<Kmer<1, long long unsigned int>, ContigFlankIndex<Kmer<1, long long unsigned int> >::FlankInfo> > >::iterator’ changed in GCC 7.1
make[3]: Leaving directory '/<<PKGBUILDDIR>>/obj-arm-linux-gnueabihf'
make[2]: *** [CMakeFiles/Makefile2:142: CMakeFiles/megahit_core_no_hw_accel.dir/all] Error 2
make[2]: Leaving directory '/<<PKGBUILDDIR>>/obj-arm-linux-gnueabihf'
make[1]: *** [Makefile:133: all] Error 2
make[1]: Leaving directory '/<<PKGBUILDDIR>>/obj-arm-linux-gnueabihf'
dh_auto_build: error: cd obj-arm-linux-gnueabihf && make -j4 "INSTALL=install --strip-program=true" returned exit code 2
make: *** [debian/rules:12: binary-arch] Error 25

Tail of log for badger on armhf:

runtime/trace
net/http/httptrace
net/http
github.com/spf13/cobra
net/http/pprof
expvar
golang.org/x/net/trace
github.com/dgraph-io/badger/y
github.com/dgraph-io/badger/skl
github.com/dgraph-io/badger/table
github.com/dgraph-io/badger
# github.com/dgraph-io/badger
src/github.com/dgraph-io/badger/value.go:50:5: constant 4294967295 overflows int
dh_auto_build: error: cd obj-arm-linux-gnueabihf && go install -trimpath -v -p 4 github.com/dgraph-io/badger/badger github.com/dgraph-io/badger/badger/cmd github.com/dgraph-io/badger/integration/testgc github.com/dgraph-io/badger/options github.com/dgraph-io/badger/pb github.com/dgraph-io/badger/skl github.com/dgraph-io/badger/table github.com/dgraph-io/badger/trie github.com/dgraph-io/badger/y returned exit code 2
make: *** [debian/rules:7: binary-arch] Error 25

Tail of log for garagemq on armhf:

github.com/magiconair/properties
github.com/spf13/afero
expvar
golang.org/x/net/trace
net/http/pprof
github.com/valinurovam/garagemq/protocol
github.com/dgraph-io/badger/y
github.com/spf13/viper
github.com/dgraph-io/badger/skl
github.com/dgraph-io/badger/table
github.com/dgraph-io/badger
# github.com/dgraph-io/badger
src/github.com/dgraph-io/badger/value.go:50:5: constant 4294967295 overflows int
dh_auto_build: error: cd obj-arm-linux-gnueabihf && go install -trimpath -v -p 4 github.com/valinurovam/garagemq github.com/valinurovam/garagemq/admin github.com/valinurovam/garagemq/amqp github.com/valinurovam/garagemq/auth github.com/valinurovam/garagemq/binding github.com/valinurovam/garagemq/config github.com/valinurovam/garagemq/consumer github.com/valinurovam/garagemq/exchange github.com/valinurovam/garagemq/interfaces github.com/valinurovam/garagemq/metrics github.com/valinurovam/garagemq/msgstorage github.com/valinurovam/garagemq/pool github.com/valinurovam/garagemq/protocol github.com/valinurovam/garagemq/qos github.com/valinurovam/garagemq/queue github.com/valinurovam/garagemq/safequeue github.com/valinurovam/garagemq/server github.com/valinurovam/garagemq/srvstorage github.com/valinurovam/garagemq/storage returned exit code 2
make: *** [debian/rules:4: build-arch] Error 25