Raspbian Package Auto-Building

Buildd status for bagel (buster-staging)

Debian PTSTrackerChangelogBugspackages.d.obuildd.d.o

Package(s): Suite:
Compact mode Co-maintainers

ArchitectureVersionStatusForBuilddStateMiscLogs
Buildd exposure stats armhf  1.2.2-1Build-Attempted164d 7h 48mtestwandboarduncompiledmisc:optionalold | all (18)

Tail of log for bagel on armhf:

mpi_interface.cc:267:32: error: static assertion failed: size_t is assumed to be the same size as unsigned long long
   static_assert(sizeof(size_t) == sizeof(unsigned long long), "size_t is assumed to be the same size as unsigned long long");
                 ~~~~~~~~~~~~~~~^~~~~~~~~~~~~~~~~~~~~~~~~~~~~
make[5]: *** [Makefile:408: mpi_interface.lo] Error 1
make[5]: Leaving directory '/<<PKGBUILDDIR>>/src/util/parallel'
make[4]: *** [Makefile:462: all-recursive] Error 1
make[4]: Leaving directory '/<<PKGBUILDDIR>>/src/util'
make[3]: *** [Makefile:625: all-recursive] Error 1
make[3]: Leaving directory '/<<PKGBUILDDIR>>/src'
make[2]: *** [Makefile:422: all-recursive] Error 1
make[2]: Leaving directory '/<<PKGBUILDDIR>>'
make[1]: *** [Makefile:354: all] Error 2
make[1]: Leaving directory '/<<PKGBUILDDIR>>'
dh_auto_build: make -j1 returned exit code 2
make: *** [debian/rules:12: build-arch] Error 2