Raspbian Package Auto-Building

Buildd status for austin (bullseye-staging)

Debian PTSTrackerChangelogBugspackages.d.obuildd.d.o

Package(s): Suite:
Compact mode Co-maintainers

ArchitectureVersionStatusForBuilddStateMiscLogs
Buildd exposure stats armhf  0.7.0-1Build-Attempted17d 4h 47mbm-wb-04uncompiledmisc:sourceold | all (4)

Tail of log for austin on armhf:

# ERROR: 0
============================================================================
See ./test-suite.log
Please report to https://github.com/p403n1x87/austin/issues
============================================================================
make[4]: *** [Makefile:674: test-suite.log] Error 1
make[4]: Leaving directory '/<<PKGBUILDDIR>>'
make[3]: *** [Makefile:782: check-TESTS] Error 2
make[3]: Leaving directory '/<<PKGBUILDDIR>>'
make[2]: *** [Makefile:1006: check-am] Error 2
make[2]: Leaving directory '/<<PKGBUILDDIR>>'
make[1]: *** [Makefile:559: check-recursive] Error 1
make[1]: Leaving directory '/<<PKGBUILDDIR>>'
dh_auto_test: make -j4 check VERBOSE=1 returned exit code 2
make: *** [debian/rules:4: build-arch] Error 255