Raspbian Package Auto-Building

Buildd status for audacious-analog-vumeter-plugin (jessie-staging)

Debian PTSTrackerChangelogBugspackages.d.obuildd.d.o

Package(s): Suite:
Compact mode Co-maintainers

ArchitectureVersionStatusForBuilddStateMiscLogs
Buildd exposure stats armhf  1.0.0-0.1Build-Attempted183d 13h 9mtestbuildduncompiledsound:sourceold | all (28)

Tail of log for audacious-analog-vumeter-plugin on armhf:

 #include <gtk/gtk.h>
                     ^
compilation terminated.
Makefile:321: recipe for target 'plugin_main.lo' failed
make[3]: *** [plugin_main.lo] Error 1
make[3]: Leaving directory '/<<PKGBUILDDIR>>/src'
Makefile:365: recipe for target 'all-recursive' failed
make[2]: *** [all-recursive] Error 1
make[2]: Leaving directory '/<<PKGBUILDDIR>>'
Makefile:254: recipe for target 'all' failed
make[1]: *** [all] Error 2
make[1]: Leaving directory '/<<PKGBUILDDIR>>'
dh_auto_build: make -j1 returned exit code 2
debian/rules:8: recipe for target 'build-arch' failed
make: *** [build-arch] Error 2