Raspbian Package Auto-Building

Buildd status for audacious-analog-vumeter-plugin (buster-staging)

Debian PTSTrackerChangelogBugspackages.d.obuildd.d.o

Package(s): Suite:
Compact mode Co-maintainers

ArchitectureVersionStatusForBuilddStateMiscLogs
Buildd exposure stats armhf  1.0.0-0.1Build-Attempted166d 7h 50mtest2019uncompiledsound:sourceold | all (30)

Tail of log for audacious-analog-vumeter-plugin on armhf:

make[3]: Entering directory '/<<PKGBUILDDIR>>/src'
/bin/bash ../libtool --tag=CC   --mode=compile gcc -DHAVE_CONFIG_H -I. -I..    -Wall -ggdb  -g -O2 -DSKINDIR=\"/usr/share/audacious\" -g -O2 -c -o plugin_main.lo plugin_main.c
libtool: compile:  gcc -DHAVE_CONFIG_H -I. -I.. -Wall -ggdb -g -O2 -DSKINDIR=\"/usr/share/audacious\" -g -O2 -c plugin_main.c  -fPIC -DPIC -o .libs/plugin_main.o
plugin_main.c:1:10: fatal error: gtk/gtk.h: No such file or directory
 #include <gtk/gtk.h>
          ^~~~~~~~~~~
compilation terminated.
make[3]: *** [Makefile:321: plugin_main.lo] Error 1
make[3]: Leaving directory '/<<PKGBUILDDIR>>/src'
make[2]: *** [Makefile:365: all-recursive] Error 1
make[2]: Leaving directory '/<<PKGBUILDDIR>>'
make[1]: *** [Makefile:254: all] Error 2
make[1]: Leaving directory '/<<PKGBUILDDIR>>'
dh_auto_build: make -j1 returned exit code 2
make: *** [debian/rules:8: build-arch] Error 2