Raspbian Package Auto-Building

Buildd status for asterisk-chan-capi (buster-staging)

Debian PTSTrackerChangelogBugspackages.d.obuildd.d.o

Package(s): Suite:
Compact mode Co-maintainers

ArchitectureVersionStatusForBuilddStateMiscLogs
Buildd exposure stats armhf  1.1.6-1Build-Attempted164d 6htestbuildduncompiledcomm:sourceold | all (23)

Tail of log for asterisk-chan-capi on armhf:

  ^~~~~~~~~~~~~~~~~~~~~~~~~~
chan_capi.c:8883:4: warning: implicit declaration of function 'ast_smoother_free'; did you mean 'ast_std_free'? [-Wimplicit-function-declaration]
    ast_smoother_free(i->smoother);
    ^~~~~~~~~~~~~~~~~
    ast_std_free
In file included from chan_capi.h:27,
                 from chan_capi.c:32:
chan_capi.c: In function 'load_module':
chan_capi.c:9009:2: error: 'AST_MODULE_SELF' undeclared (first use in this function); did you mean 'AST_MODULE_INFO'?
  ast_register_application(commandapp, pbx_capicommand_exec, commandsynopsis, commandtdesc);
  ^~~~~~~~~~~~~~~~~~~~~~~~
make[1]: *** [Makefile:198: chan_capi.o] Error 1
make[1]: Leaving directory '/<<PKGBUILDDIR>>'
dh_auto_build: make -j1 returned exit code 2
make: *** [debian/rules:3: build-arch] Error 2