Raspbian Package Auto-Building

Buildd status for aspectc++, bino, libmateweather, tcpdump, coturn, ceph (jessie-staging)

Bugs

Package(s): Suite:
Compact mode Co-maintainers

Package armhf
Buildd exposure stats
✘ aspectc++  Build-Attempted
✘ bino  Build-Attempted
✘ libmateweather  Build-Attempted
✘ tcpdump  Build-Attempted
✘ coturn  Build-Attempted
✘ ceph  Build-Attempted

Tail of log for aspectc++ on armhf:

/build/aspectc++-eHpgcL/aspectc++-1.2/Puma.copy/gen-release/step1/src/PreExprParser.cc:1797: error: `%anon7373' has no member named `yy'
/build/aspectc++-eHpgcL/aspectc++-1.2/Puma.copy/gen-release/step1/src/PreExprParser.cc:1797: error: invalid operand to binary `-'
/build/aspectc++-eHpgcL/aspectc++-1.2/Puma.copy/gen-release/step1/src/PreExprParser.cc:1797: error: undefined type
/build/aspectc++-eHpgcL/aspectc++-1.2/Puma.copy/gen-release/step1/src/PreExprParser.cc:1797: error: non-lvalue in assignment
/build/aspectc++-eHpgcL/aspectc++-1.2/Puma.copy/gen-release/step1/src/PreExprParser.cc:1797: error: undefined type
weave.mk:72: recipe for target '/build/aspectc++-eHpgcL/aspectc++-1.2/Puma.copy/gen-release/step2/src/PreExprParser.cc' failed
make[3]: *** [/build/aspectc++-eHpgcL/aspectc++-1.2/Puma.copy/gen-release/step2/src/PreExprParser.cc] Error 1
make[3]: *** Waiting for unfinished jobs....
Makefile:50: recipe for target 'step2' failed
make[2]: *** [step2] Error 2
Makefile:55: recipe for target 'src' failed
make[1]: *** [src] Error 2
make[1]: Leaving directory '/build/aspectc++-eHpgcL/aspectc++-1.2/Puma.copy'
debian/rules:52: recipe for target 'build-arch-stamp' failed
make: *** [build-arch-stamp] Error 2

Tail of log for bino on armhf:

Makefile:843: recipe for target 'all-recursive' failed
make[4]: *** [all-recursive] Error 1
make[4]: Leaving directory '/<<PKGBUILDDIR>>/src'
Makefile:578: recipe for target 'all' failed
make[3]: *** [all] Error 2
make[3]: Leaving directory '/<<PKGBUILDDIR>>/src'
Makefile:444: recipe for target 'all-recursive' failed
make[2]: *** [all-recursive] Error 1
make[2]: Leaving directory '/<<PKGBUILDDIR>>'
Makefile:382: recipe for target 'all' failed
make[1]: *** [all] Error 2
make[1]: Leaving directory '/<<PKGBUILDDIR>>'
dh_auto_build: make -j4 returned exit code 2
debian/rules:9: recipe for target 'build-arch' failed
make: *** [build-arch] Error 2

Tail of log for libmateweather on armhf:

make[2]: Leaving directory '/<<PKGBUILDDIR>>/doc'
Making check in data
make[2]: Entering directory '/<<PKGBUILDDIR>>/data'
xmllint --valid --noout ../data/Locations.xml.in
./check-timezones.sh ./Locations.xml.in
Invalid timezones in ./Locations.xml.in: Asia/Yangon
Makefile:638: recipe for target 'check' failed
make[2]: *** [check] Error 1
make[2]: Leaving directory '/<<PKGBUILDDIR>>/data'
Makefile:488: recipe for target 'check-recursive' failed
make[1]: *** [check-recursive] Error 1
make[1]: Leaving directory '/<<PKGBUILDDIR>>'
dh_auto_test: make -j4 check returned exit code 2
debian/rules:6: recipe for target 'build-arch' failed
make: *** [build-arch] Error 2

Tail of log for tcpdump on armhf:

> 	Domain name: , Seq number: 0, Config Rev fb499603
Failed test: vtp_asan-3

2c2
< 	Domain name: , Seq number: 0, Config Rev 4040404[|vtp]
---
> 	Domain name: , Seq number: 0, Config Rev 4040404


Makefile:440: recipe for target 'check' failed
make[1]: *** [check] Error 2
make[1]: Leaving directory '/<<PKGBUILDDIR>>'
dh_auto_test: make -j4 check returned exit code 2
debian/rules:7: recipe for target 'build-arch' failed
make: *** [build-arch] Error 2

Tail of log for coturn on armhf:

mkdir -p include/turn/client
cp -pf src/client/*.h include/turn/client/
cp -pf src/client++/*.h include/turn/client/
cp -pf src/ns_turn_defs.h include/turn/
make[1]: Leaving directory '/<<PKGBUILDDIR>>'
   dh_auto_test -a -O--builddirectory=.
	make -j1 test
make[1]: Entering directory '/<<PKGBUILDDIR>>'
bin/turnutils_rfc5769check
Makefile:93: recipe for target 'check' failed
make[1]: *** [check] Bus error
make[1]: Leaving directory '/<<PKGBUILDDIR>>'
dh_auto_test: make -j1 test returned exit code 2
debian/rules:20: recipe for target 'build-arch' failed
make: *** [build-arch] Error 2

Tail of log for ceph on armhf:

Makefile:13992: recipe for target 'all-recursive' failed
make[4]: *** [all-recursive] Error 1
make[4]: Leaving directory '/<<PKGBUILDDIR>>/src'
Makefile:5430: recipe for target 'all' failed
make[3]: *** [all] Error 2
make[3]: Leaving directory '/<<PKGBUILDDIR>>/src'
Makefile:451: recipe for target 'all-recursive' failed
make[2]: *** [all-recursive] Error 1
make[2]: Leaving directory '/<<PKGBUILDDIR>>'
dh_auto_build: make -j4 returned exit code 2
debian/rules:51: recipe for target 'override_dh_auto_build' failed
make[1]: *** [override_dh_auto_build] Error 2
make[1]: Leaving directory '/<<PKGBUILDDIR>>'
debian/rules:40: recipe for target 'build-arch' failed
make: *** [build-arch] Error 2