Raspbian Package Auto-Building

Buildd status for selected packages (jessie-staging)

Bugs

Package(s): Suite:
Compact mode Co-maintainers

Package armhf
Buildd exposure stats
✘ aspectc++  Build-Attempted
✘ bino  Build-Attempted
✘ libmateweather  Build-Attempted
✔ gfccoreBuild-Attempted
✔ tbbBuild-Attempted
✔ acoveaBuild-Attempted
✔ mercurial-buildpackageBuild-Attempted
✔ ocamlgslBuild-Attempted
✔ uclibcBuild-Attempted
✔ atigBuild-Attempted
✔ cdeBuild-Attempted
✔ ckBuild-Attempted
✔ cpl-plugin-xshBuild-Attempted
✔ doomsdayBuild-Attempted
✔ audacious-analog-vumeter-pluginBuild-Attempted
✔ freefoamBuild-Attempted
✔ gravitBuild-Attempted
✔ haskell-comonads-fdBuild-Attempted
✔ haskell-debianBuild-Attempted
Package armhf
Buildd exposure stats
✔ gambcBuild-Attempted
✔ haskell-trifectaBuild-Attempted
✔ ibamBuild-Attempted
✔ htslibBuild-Attempted
✔ ioappsBuild-Attempted
✔ libodbc-rubyBuild-Attempted
✔ libfusefs-rubyBuild-Attempted
✔ libopengl-rubyBuild-Attempted
✔ libtangoBuild-Attempted
✔ getdpBuild-Attempted
✔ lierolibreBuild-Attempted
✔ msrtoolBuild-Attempted
✔ numactlBuild-Attempted
✔ open-axiomBuild-Attempted
✔ openmprtlBuild-Attempted
✔ pgloaderBuild-Attempted
✔ portslaveBuild-Attempted
✔ patchelfBuild-Attempted
✔ pulseviewBuild-Attempted
✔ pyfftwBuild-Attempted
Package armhf
Buildd exposure stats
✔ pyside-mobilityBuild-Attempted
✔ qtjsbackend-opensource-srcBuild-Attempted
✔ python-pysamBuild-Attempted
✔ openniBuild-Attempted
✔ qtopBuild-Attempted
✔ slang-slirpBuild-Attempted
✔ sra-sdkBuild-Attempted
✔ rhmessagingBuild-Attempted
✔ utopia-documentsBuild-Attempted
✔ varnish-agentBuild-Attempted
✔ vmkitBuild-Attempted
✔ wmmailBuild-Attempted
✔ xhprofBuild-Attempted
✔ sdrangeloveBuild-Attempted
✔ wesnoth-1.8Build-Attempted
✔ 3dldfBuild-Attempted
✔ rheolefBuild-Attempted
✔ groongaBuild-Attempted
✔ poclBuild-Attempted
✔ kamailioBuild-Attempted
Package armhf
Buildd exposure stats
✔ apopheniaBuild-Attempted
✔ libzyppBuild-Attempted
✔ xenBuild-Attempted
✘ tcpdump  Build-Attempted

Tail of log for aspectc++ on armhf:

/build/aspectc++-eHpgcL/aspectc++-1.2/Puma.copy/gen-release/step1/src/PreExprParser.cc:1797: error: `%anon7373' has no member named `yy'
/build/aspectc++-eHpgcL/aspectc++-1.2/Puma.copy/gen-release/step1/src/PreExprParser.cc:1797: error: invalid operand to binary `-'
/build/aspectc++-eHpgcL/aspectc++-1.2/Puma.copy/gen-release/step1/src/PreExprParser.cc:1797: error: undefined type
/build/aspectc++-eHpgcL/aspectc++-1.2/Puma.copy/gen-release/step1/src/PreExprParser.cc:1797: error: non-lvalue in assignment
/build/aspectc++-eHpgcL/aspectc++-1.2/Puma.copy/gen-release/step1/src/PreExprParser.cc:1797: error: undefined type
weave.mk:72: recipe for target '/build/aspectc++-eHpgcL/aspectc++-1.2/Puma.copy/gen-release/step2/src/PreExprParser.cc' failed
make[3]: *** [/build/aspectc++-eHpgcL/aspectc++-1.2/Puma.copy/gen-release/step2/src/PreExprParser.cc] Error 1
make[3]: *** Waiting for unfinished jobs....
Makefile:50: recipe for target 'step2' failed
make[2]: *** [step2] Error 2
Makefile:55: recipe for target 'src' failed
make[1]: *** [src] Error 2
make[1]: Leaving directory '/build/aspectc++-eHpgcL/aspectc++-1.2/Puma.copy'
debian/rules:52: recipe for target 'build-arch-stamp' failed
make: *** [build-arch-stamp] Error 2

Tail of log for bino on armhf:

Makefile:843: recipe for target 'all-recursive' failed
make[4]: *** [all-recursive] Error 1
make[4]: Leaving directory '/<<PKGBUILDDIR>>/src'
Makefile:578: recipe for target 'all' failed
make[3]: *** [all] Error 2
make[3]: Leaving directory '/<<PKGBUILDDIR>>/src'
Makefile:444: recipe for target 'all-recursive' failed
make[2]: *** [all-recursive] Error 1
make[2]: Leaving directory '/<<PKGBUILDDIR>>'
Makefile:382: recipe for target 'all' failed
make[1]: *** [all] Error 2
make[1]: Leaving directory '/<<PKGBUILDDIR>>'
dh_auto_build: make -j4 returned exit code 2
debian/rules:9: recipe for target 'build-arch' failed
make: *** [build-arch] Error 2

Tail of log for libmateweather on armhf:

make[2]: Leaving directory '/<<PKGBUILDDIR>>/doc'
Making check in data
make[2]: Entering directory '/<<PKGBUILDDIR>>/data'
xmllint --valid --noout ../data/Locations.xml.in
./check-timezones.sh ./Locations.xml.in
Invalid timezones in ./Locations.xml.in: Asia/Yangon
Makefile:638: recipe for target 'check' failed
make[2]: *** [check] Error 1
make[2]: Leaving directory '/<<PKGBUILDDIR>>/data'
Makefile:488: recipe for target 'check-recursive' failed
make[1]: *** [check-recursive] Error 1
make[1]: Leaving directory '/<<PKGBUILDDIR>>'
dh_auto_test: make -j4 check returned exit code 2
debian/rules:6: recipe for target 'build-arch' failed
make: *** [build-arch] Error 2

Tail of log for gfccore on armhf:

make[5]: Leaving directory '/<<PKGBUILDDIR>>/gfc/glib'
Makefile:431: recipe for target 'all-recursive' failed
make[4]: *** [all-recursive] Error 1
make[4]: Leaving directory '/<<PKGBUILDDIR>>/gfc/glib'
Makefile:370: recipe for target 'all-recursive' failed
make[3]: *** [all-recursive] Error 1
make[3]: Leaving directory '/<<PKGBUILDDIR>>/gfc'
Makefile:305: recipe for target 'all-recursive' failed
make[2]: *** [all-recursive] Error 1
make[2]: Leaving directory '/<<PKGBUILDDIR>>'
Makefile:198: recipe for target 'all' failed
make[1]: *** [all] Error 2
make[1]: Leaving directory '/<<PKGBUILDDIR>>'
/usr/share/cdbs/1/class/makefile.mk:47: recipe for target 'debian/stamp-makefile-build' failed
make: *** [debian/stamp-makefile-build] Error 2

Tail of log for tbb on armhf:

make[3]: *** [concurrent_hash_map.o] Error 1
../../build/common_rules.inc:85: recipe for target 'concurrent_queue.o' failed
make[3]: *** [concurrent_queue.o] Error 1
../../build/common_rules.inc:85: recipe for target 'concurrent_vector.o' failed
make[3]: *** [concurrent_vector.o] Error 1
make[3]: Leaving directory '/<<PKGBUILDDIR>>/build/linux_armv8l_gcc_cc4.9.2_libc2.19_kernel4.4.0_debug'
Makefile:40: recipe for target 'tbb' failed
make[2]: *** [tbb] Error 2
make[2]: Leaving directory '/<<PKGBUILDDIR>>'
dh_auto_build: make -j4 returned exit code 2
debian/rules:17: recipe for target 'override_dh_auto_build' failed
make[1]: *** [override_dh_auto_build] Error 2
make[1]: Leaving directory '/<<PKGBUILDDIR>>'
debian/rules:12: recipe for target 'build-arch' failed
make: *** [build-arch] Error 2

Tail of log for acovea on armhf:

     class acovea_reporter : public reporter<acovea_organism,acovea_landscape>,
                                            ^
acovea.h:734:44: error: expected '{' before '<' token
acovea.h:734:44: error: expected unqualified-id before '<' token
acovea.cpp:1981:1: error: expected '}' at end of input
 }
 ^
Makefile:288: recipe for target 'acovea.lo' failed
make[2]: *** [acovea.lo] Error 1
make[2]: Leaving directory '/<<PKGBUILDDIR>>/libacovea'
Makefile:231: recipe for target 'all-recursive' failed
make[1]: *** [all-recursive] Error 1
make[1]: Leaving directory '/<<PKGBUILDDIR>>'
debian/rules:36: recipe for target 'build-stamp' failed
make: *** [build-stamp] Error 2

Tail of log for mercurial-buildpackage on armhf:

rm -f *.n mercurial-buildpackage mercurial-tagversion mercurial-importorig mercurial-importdsc mercurial-pristinetar mercurial-port macro-expand unittests mercurial-buildpackage.1 mercurial-tagversion.1 mercurial-importorig.1 mercurial-importdsc.1 mercurial-pristinetar.1 mercurial-port.1
make[1]: Leaving directory '/<<PKGBUILDDIR>>'
dh_clean 
dpkg-buildpackage: warning: debian/rules must be updated to support the 'build-arch' and 'build-indep' targets (at least 'build-arch' seems to be missing)
 debian/rules build
dh_testdir
/usr/bin/make
make[1]: Entering directory '/<<PKGBUILDDIR>>'
haxe -neko mercurial-buildpackage.n -main MercurialBuildPackage -cmd 'nekotools boot mercurial-buildpackage.n'
./MercurialBuildPackage.hx:216: characters 8-37 : Class not found : neko.io.FileOutput
Makefile:28: recipe for target 'mercurial-buildpackage' failed
make[1]: *** [mercurial-buildpackage] Error 1
make[1]: Leaving directory '/<<PKGBUILDDIR>>'
debian/rules:15: recipe for target 'build-stamp' failed
make: *** [build-stamp] Error 2

Tail of log for ocamlgsl on armhf:

make[1]: Leaving directory '/<<PKGBUILDDIR>>'
touch debian/stamp-patched
/usr/bin/make  -C . CFLAGS="-g -O2 -fstack-protector-strong -Wformat -Werror=format-security -Wall" CXXFLAGS="-g -O2 -fstack-protector-strong -Wformat -Werror=format-security -Wall" CPPFLAGS="-D_FORTIFY_SOURCE=2" LDFLAGS="-Wl,-z,relro"  all-opt
make[1]: Entering directory '/<<PKGBUILDDIR>>'
ocamlc -ccopt '-D_FORTIFY_SOURCE=2 -g -O2 -fstack-protector-strong -Wformat -Werror=format-security -Wall ' -c mlgsl_error.c
ocamlc -ccopt '-D_FORTIFY_SOURCE=2 -g -O2 -fstack-protector-strong -Wformat -Werror=format-security -Wall ' -c mlgsl_ieee.c
In file included from mlgsl_ieee.c:12:0:
wrappers.h:13:2: error: #error "Architectures with double-word alignment for doubles are not supported"
 #error "Architectures with double-word alignment for doubles are not supported"
  ^
Makefile:240: recipe for target 'mlgsl_ieee.o' failed
make[1]: *** [mlgsl_ieee.o] Error 2
make[1]: Leaving directory '/<<PKGBUILDDIR>>'
/usr/share/cdbs/1/class/makefile.mk:47: recipe for target 'debian/stamp-makefile-build' failed
make: *** [debian/stamp-makefile-build] Error 2

Tail of log for uclibc on armhf:

dpkg-buildpackage: source version 0.9.32-1
dpkg-buildpackage: source distribution unstable
 dpkg-source --before-build uclibc-0.9.32
dpkg-buildpackage: host architecture armhf
 fakeroot debian/rules clean
dh_testdir
dh_testroot
dh_clean
rm -f -r build
 debian/rules build-arch
make: Nothing to be done for 'build-arch'.
 fakeroot debian/rules binary-arch
make: 'binary-arch' is up to date.
 dpkg-genchanges -B -mRaspbian nitrogen6x test autobuilder <root@raspbian.org> >../uclibc_0.9.32-1_armhf.changes
dpkg-genchanges: error: binary build with no binary artifacts found; cannot distribute

Tail of log for atig on armhf:

    0.00847 seconds average (0.02541 seconds / 3 examples) ./spec/command/destroy_spec.rb:22
  Atig::IFilter::ExpandUrl when enable whole url
    0.00763 seconds average (0.01526 seconds / 2 examples) ./spec/ifilter/expand_url_spec.rb:40

Finished in 1 minute 56.36 seconds
182 examples, 1 failure

Failed examples:

rspec ./spec/command/status_spec.rb:27 # Atig::Command::Status should post with japanese language
/usr/bin/ruby2.1 -S rspec spec/command/autofix_spec.rb spec/command/destroy_spec.rb spec/command/dm_spec.rb spec/command/favorite_spec.rb spec/command/limit_spec.rb spec/command/location_spec.rb spec/command/name_spec.rb spec/command/option_spec.rb spec/command/refresh_spec.rb spec/command/reply_spec.rb spec/command/retweet_spec.rb spec/command/spam_spec.rb spec/command/status_spec.rb spec/command/thread_spec.rb spec/command/time_spec.rb spec/command/uptime_spec.rb spec/command/user_info_spec.rb spec/command/user_spec.rb spec/command/version_spec.rb spec/command/whois_spec.rb spec/db/followings_spec.rb spec/db/listenable_spec.rb spec/db/lists_spec.rb spec/db/roman_spec.rb spec/db/sized_uniq_array_spec.rb spec/db/statuses_spec.rb spec/ifilter/expand_url_spec.rb spec/ifilter/retweet_spec.rb spec/ifilter/retweet_time_spec.rb spec/ifilter/sanitize_spec.rb spec/ifilter/sid_spec.rb spec/ifilter/strip_spec.rb spec/ifilter/tid_spec.rb spec/levenshtein_spec.rb spec/ofilter/escape_url_spec.rb spec/ofilter/footer_spec.rb spec/ofilter/geo_spec.rb spec/ofilter/short_url_spec.rb spec/option_spec.rb spec/sized_hash_spec.rb failed
ERROR: Test "ruby2.1" failed. Exiting.
dh_auto_install: dh_ruby --install /<<PKGBUILDDIR>>/debian/atig returned exit code 1
debian/rules:6: recipe for target 'binary-arch' failed
make: *** [binary-arch] Error 1

Tail of log for cde on armhf:

Makefile:543: recipe for target 'strace.o' failed
make[4]: *** [strace.o] Error 1
make[4]: Leaving directory '/<<BUILDDIR>>/cde-0.1+git9-g551e54d/strace-4.6'
Makefile:601: recipe for target 'all-recursive' failed
make[3]: *** [all-recursive] Error 1
make[3]: Leaving directory '/<<BUILDDIR>>/cde-0.1+git9-g551e54d/strace-4.6'
Makefile:375: recipe for target 'all' failed
make[2]: *** [all] Error 2
make[2]: Leaving directory '/<<BUILDDIR>>/cde-0.1+git9-g551e54d/strace-4.6'
Makefile:6: recipe for target 'all' failed
make[1]: *** [all] Error 2
make[1]: Leaving directory '/<<BUILDDIR>>/cde-0.1+git9-g551e54d'
dh_auto_build: make -j1 returned exit code 2
debian/rules:38: recipe for target 'build-arch' failed
make: *** [build-arch] Error 2

Tail of log for ck on armhf:

   dh_auto_clean
   dh_clean
 debian/rules build-arch
dh build-arch
   dh_testdir -a
   debian/rules override_dh_auto_configure
make[1]: Entering directory '/<<PKGBUILDDIR>>'
./configure --includedir=/usr/include --libdir=/usr/lib/arm-linux-gnueabihf --mandir=/usr/share/man --prefix=/usr
Detecting operating system.......success [linux]
Detecting machine architecture...failed  [unsupported]
debian/rules:4: recipe for target 'override_dh_auto_configure' failed
make[1]: *** [override_dh_auto_configure] Error 1
make[1]: Leaving directory '/<<PKGBUILDDIR>>'
debian/rules:7: recipe for target 'build-arch' failed
make: *** [build-arch] Error 2

Tail of log for cpl-plugin-xsh on armhf:

Makefile:1718: recipe for target 'check-TESTS' failed
make[4]: *** [check-TESTS] Error 1
make[4]: Leaving directory '/<<BUILDDIR>>/cpl-plugin-xsh-2.3.0+dfsg/xsh/tests'
Makefile:1841: recipe for target 'check-am' failed
make[3]: *** [check-am] Error 2
make[3]: Leaving directory '/<<BUILDDIR>>/cpl-plugin-xsh-2.3.0+dfsg/xsh/tests'
Makefile:874: recipe for target 'check-recursive' failed
make[2]: *** [check-recursive] Error 1
make[2]: Leaving directory '/<<BUILDDIR>>/cpl-plugin-xsh-2.3.0+dfsg/xsh'
Makefile:518: recipe for target 'check-recursive' failed
make[1]: *** [check-recursive] Error 1
make[1]: Leaving directory '/<<BUILDDIR>>/cpl-plugin-xsh-2.3.0+dfsg'
dh_auto_test: make -j1 check returned exit code 2
debian/rules:14: recipe for target 'build-arch' failed
make: *** [build-arch] Error 2

Tail of log for doomsday on armhf:

                              ^
src/con_main.cpp: In function 'void conPrintf(int, const char*, va_list)':
src/con_main.cpp:1842:31: error: invalid operands of types 'va_list {aka __va_list}' and 'int' to binary 'operator!='
     if(format && format[0] && args)
                               ^
Makefile:822: recipe for target 'con_main.o' failed
make[2]: *** [con_main.o] Error 1
make[2]: *** Waiting for unfinished jobs....
make[2]: Leaving directory '/<<PKGBUILDDIR>>/doomsday/client'
Makefile:229: recipe for target 'sub-client-make_default-ordered' failed
make[1]: *** [sub-client-make_default-ordered] Error 2
make[1]: Leaving directory '/<<PKGBUILDDIR>>/doomsday'
dh_auto_build: make -j4 returned exit code 2
debian/rules:10: recipe for target 'build-arch' failed
make: *** [build-arch] Error 25

Tail of log for audacious-analog-vumeter-plugin on armhf:

 #include <gtk/gtk.h>
                     ^
compilation terminated.
Makefile:321: recipe for target 'plugin_main.lo' failed
make[3]: *** [plugin_main.lo] Error 1
make[3]: Leaving directory '/<<PKGBUILDDIR>>/src'
Makefile:365: recipe for target 'all-recursive' failed
make[2]: *** [all-recursive] Error 1
make[2]: Leaving directory '/<<PKGBUILDDIR>>'
Makefile:254: recipe for target 'all' failed
make[1]: *** [all] Error 2
make[1]: Leaving directory '/<<PKGBUILDDIR>>'
dh_auto_build: make -j1 returned exit code 2
debian/rules:8: recipe for target 'build-arch' failed
make: *** [build-arch] Error 2

Tail of log for freefoam on armhf:

c++: error: CMakeFiles/OSspecific.dir/__/OSspecific/sigQuit.C.o: No such file or directory
src/OSspecific/POSIX/CMakeFiles/OSspecific.dir/build.make:103: recipe for target 'src/OSspecific/POSIX/CMakeFiles/OSspecific.dir/__/OSspecific/sigInt.C.o' failed
make[3]: *** [src/OSspecific/POSIX/CMakeFiles/OSspecific.dir/__/OSspecific/sigInt.C.o] Error 1
src/OSspecific/POSIX/CMakeFiles/OSspecific.dir/build.make:126: recipe for target 'src/OSspecific/POSIX/CMakeFiles/OSspecific.dir/__/OSspecific/sigQuit.C.o' failed
make[3]: *** [src/OSspecific/POSIX/CMakeFiles/OSspecific.dir/__/OSspecific/sigQuit.C.o] Error 1
make[3]: Leaving directory '/<<BUILDDIR>>/freefoam-0.1.0+dfsg+1/obj-arm-linux-gnueabihf'
CMakeFiles/Makefile2:463: recipe for target 'src/OSspecific/POSIX/CMakeFiles/OSspecific.dir/all' failed
make[2]: *** [src/OSspecific/POSIX/CMakeFiles/OSspecific.dir/all] Error 2
make[2]: Leaving directory '/<<BUILDDIR>>/freefoam-0.1.0+dfsg+1/obj-arm-linux-gnueabihf'
Makefile:120: recipe for target 'all' failed
make[1]: *** [all] Error 2
make[1]: Leaving directory '/<<BUILDDIR>>/freefoam-0.1.0+dfsg+1/obj-arm-linux-gnueabihf'
dh_auto_build: make -j4 returned exit code 2
debian/rules:3: recipe for target 'build-arch' failed
make: *** [build-arch] Error 2

Tail of log for gravit on armhf:

#define HAVE_SYS_TYPES_H 1
#define HAVE_SYS_STAT_H 1
#define HAVE_STDLIB_H 1
#define HAVE_STRING_H 1
#define HAVE_MEMORY_H 1
#define HAVE_STRINGS_H 1
#define HAVE_INTTYPES_H 1
#define HAVE_STDINT_H 1
#define HAVE_UNISTD_H 1
#define HAVE_OMP_H 1

configure: exit 1
dh_auto_configure: ./configure --build=arm-linux-gnueabihf --prefix=/usr --includedir=${prefix}/include --mandir=${prefix}/share/man --infodir=${prefix}/share/info --sysconfdir=/etc --localstatedir=/var --libdir=${prefix}/lib/arm-linux-gnueabihf --libexecdir=${prefix}/lib/arm-linux-gnueabihf --disable-maintainer-mode --disable-dependency-tracking returned exit code 1
debian/rules:11: recipe for target 'build-arch' failed
make: *** [build-arch] Error 255

Tail of log for haskell-comonads-fd on armhf:

Using ranlib found on system at: /usr/bin/ranlib
Using strip found on system at: /usr/bin/strip
Using tar found on system at: /bin/tar
No uhc found
touch configure-ghc-stamp
debian/hlibrary.setup build --builddir=dist-ghc
Building comonads-fd-3.0.1...
Preprocessing library comonads-fd-3.0.1...

src/Control/Comonad/Env.hs:38:8:
    Ambiguous module name `Control.Comonad.Trans.Env':
      it was found in multiple packages:
      comonad-transformers-3.0.1 comonad-4.2
/usr/share/cdbs/1/class/hlibrary.mk:120: recipe for target 'build-ghc-stamp' failed
make: *** [build-ghc-stamp] Error 1

Tail of log for haskell-debian on armhf:

      [| ($(litE (integerL (fromIntegral (fst (loc_end x))))), 
          $(litE (integerL (fromIntegral (snd (loc_end x)))))) ::
           (Int, Int) |]

Debian/Loc.hs:18:60:
    Template Haskell splice requires GHC with interpreter support
    Perhaps you are using a stage-1 compiler?
      litE (integerL (fromIntegral (fst (loc_end x))))

Debian/Loc.hs:19:60:
    Template Haskell splice requires GHC with interpreter support
    Perhaps you are using a stage-1 compiler?
      litE (integerL (fromIntegral (snd (loc_end x))))
/usr/share/cdbs/1/class/hlibrary.mk:120: recipe for target 'build-ghc-stamp' failed
make: *** [build-ghc-stamp] Error 1

Tail of log for gambc on armhf:

making all in gsi
make[2]: Entering directory '/<<PKGBUILDDIR>>/gsi'
make[2]: Leaving directory '/<<PKGBUILDDIR>>/gsi'
making all in gsc
make[2]: Entering directory '/<<PKGBUILDDIR>>/gsc'
LD_LIBRARY_PATH=../lib:../gsi:../gsc: ../gsc-comp -:=.. -f -c -check _gsclib.scm
Segmentation fault
makefile:176: recipe for target '_gsclib.c' failed
make[2]: *** [_gsclib.c] Error 139
make[2]: Leaving directory '/<<PKGBUILDDIR>>/gsc'
makefile:216: recipe for target 'all-recursive' failed
make[1]: *** [all-recursive] Error 1
make[1]: Leaving directory '/<<PKGBUILDDIR>>'
debian/rules:43: recipe for target 'build-stamp' failed
make: *** [build-stamp] Error 2

Tail of log for haskell-trifecta on armhf:

[ 5 of 13] Compiling Text.Trifecta.Delta ( src/Text/Trifecta/Delta.hs, dist-ghc/build/Text/Trifecta/Delta.o )
You are using a new version of LLVM that hasn't been tested yet!
We will try though...
[ 6 of 13] Compiling Text.Trifecta.Rope ( src/Text/Trifecta/Rope.hs, dist-ghc/build/Text/Trifecta/Rope.o )
You are using a new version of LLVM that hasn't been tested yet!
We will try though...
[ 7 of 13] Compiling Text.Trifecta.Util.It ( src/Text/Trifecta/Util/It.hs, dist-ghc/build/Text/Trifecta/Util/It.o )
You are using a new version of LLVM that hasn't been tested yet!
We will try though...
[ 8 of 13] Compiling Text.Trifecta.Highlight ( src/Text/Trifecta/Highlight.hs, dist-ghc/build/Text/Trifecta/Highlight.o )

src/Text/Trifecta/Highlight.hs:1:1:
    Can't do a top-level splice; need a bootstrapped compiler
/usr/share/cdbs/1/class/hlibrary.mk:120: recipe for target 'build-ghc-stamp' failed
make: *** [build-ghc-stamp] Error 1

Tail of log for ibam on armhf:

/usr/bin/make ibam-krell.so 
make[1]: Entering directory '/<<PKGBUILDDIR>>'
make[1]: 'ibam-krell.so' is up to date.
make[1]: Leaving directory '/<<PKGBUILDDIR>>'
touch build-stamp
dh_testdir
dh_testroot
dh_clean
dh_installdirs
# Add here commands to install the package into debian/tmp.
install -m0755 ibam `pwd`/debian/ibam/usr/bin
install -m0644 ibam-krell.so `pwd`/debian/gkrellm-ibam/usr/lib/gkrellm2/plugins
install: cannot create regular file '/<<PKGBUILDDIR>>/debian/gkrellm-ibam/usr/lib/gkrellm2/plugins': No such file or directory
debian/rules:51: recipe for target 'install' failed
make: *** [install] Error 1

Tail of log for htslib on armhf:

dh_auto_test
	make -j4 test
make[2]: Entering directory '/<<PKGBUILDDIR>>'
test/fieldarith test/fieldarith.sam
test/hfile
test/sam
Makefile:240: recipe for target 'test' failed
make[2]: *** [test] Bus error
make[2]: Leaving directory '/<<PKGBUILDDIR>>'
dh_auto_test: make -j4 test returned exit code 2
debian/rules:10: recipe for target 'override_dh_auto_test' failed
make[1]: *** [override_dh_auto_test] Error 2
make[1]: Leaving directory '/<<PKGBUILDDIR>>'
debian/rules:7: recipe for target 'build-arch' failed
make: *** [build-arch] Error 2

Tail of log for ioapps on armhf:

           ^
replicate.c:104:36: warning: 'last_call_orig' may be used uninitialized in this function [-Wmaybe-uninitialized]
      diff_orig = CALL_TIME(x##_it) - last_call_orig; \
                                    ^
replicate.c:1396:11: note: 'last_call_orig' was declared here
  uint64_t last_call_orig; ///< when was the last original call made
           ^
Makefile:46: recipe for target 'replicate.o' failed
make[2]: *** [replicate.o] Error 1
make[2]: Leaving directory '/<<PKGBUILDDIR>>'
debian/rules:18: recipe for target 'override_dh_auto_build' failed
make[1]: *** [override_dh_auto_build] Error 2
make[1]: Leaving directory '/<<PKGBUILDDIR>>'
debian/rules:14: recipe for target 'build-arch' failed
make: *** [build-arch] Error 2

Tail of log for libodbc-ruby on armhf:

	--without-opt-lib=${opt-dir}/lib
	--with-make-prog
	--without-make-prog
	--srcdir=.
	--curdir
	--ruby=/usr/bin/ruby1.8
	--with-odbc-dir
	--without-odbc-dir
	--with-odbc-include
	--without-odbc-include=${odbc-dir}/include
	--with-odbc-lib
	--without-odbc-lib=${odbc-dir}/lib
ERROR: sql.h not found
debian/rules:17: recipe for target 'configure/libodbc-ruby1.8' failed
make: *** [configure/libodbc-ruby1.8] Error 1

Tail of log for libfusefs-ruby on armhf:

-----------------

dpkg-buildpackage: source package libfusefs-ruby
dpkg-buildpackage: source version 0.6.0-3
dpkg-buildpackage: source distribution unstable
 dpkg-source --before-build libfusefs-ruby-0.6.0
dpkg-buildpackage: host architecture armhf
 fakeroot debian/rules clean
test -x debian/rules
dh_clean 
if [ ! -L debian-setup.rb ] ; then if [ -f debian-setup.rb ] ; then mv debian-setup.rb debian-setup.rb.moved_away_by_debian_build ; fi ; ln -s /usr/lib/ruby/1.8/setup.rb debian-setup.rb ; fi
/usr/bin/ruby1.8 debian-setup.rb config --installdirs=std
/usr/bin/ruby1.8: No such file or directory -- debian-setup.rb (LoadError)
/usr/share/ruby-pkg-tools/1/class/ruby-setup-rb.mk:87: recipe for target 'clean' failed
make: *** [clean] Error 1

Tail of log for libopengl-ruby on armhf:

dpkg-buildpackage: source package libopengl-ruby
dpkg-buildpackage: source version 0.60.1-1
dpkg-buildpackage: source distribution unstable
 dpkg-source --before-build libopengl-ruby-0.60.1
dpkg-buildpackage: host architecture armhf
dpkg-source: warning: unknown information field 'Dm-Upload-Allowed' in input data in general section of control info file
 fakeroot debian/rules clean
test -x debian/rules
dh_clean 
if [ ! -L debian-setup.rb ] ; then if [ -f debian-setup.rb ] ; then mv debian-setup.rb debian-setup.rb.moved_away_by_debian_build ; fi ; ln -s /usr/lib/ruby/1.8/setup.rb debian-setup.rb ; fi
/usr/bin/ruby1.8 debian-setup.rb config --installdirs=std
/usr/bin/ruby1.8: No such file or directory -- debian-setup.rb (LoadError)
/usr/share/ruby-pkg-tools/1/class/ruby-setup-rb.mk:87: recipe for target 'clean' failed
make: *** [clean] Error 1

Tail of log for libtango on armhf:

/usr/bin/ldc -I. -I./tango/core -I./tango/core/rt/compiler/ldc -g -c tango/core/tools/Cpuid.d -ofobjs/base/tango-core-tools-Cpuid.o
make[3]: /usr/bin/ldc: Command not found
Makefile:109: recipe for target 'stamps/build-d-file-tango-core-tools-Cpuid.d' failed
make[3]: *** [stamps/build-d-file-tango-core-tools-Cpuid.d] Error 127
/usr/bin/ldc -I. -I./tango/core -I./tango/core/rt/compiler/ldc -g -c tango/core/tools/LinuxStackTrace.d -ofobjs/base/tango-core-tools-LinuxStackTrace.o
make[3]: /usr/bin/ldc: Command not found
Makefile:109: recipe for target 'stamps/build-d-file-tango-core-tools-LinuxStackTrace.d' failed
make[3]: *** [stamps/build-d-file-tango-core-tools-LinuxStackTrace.d] Error 127
Makefile:112: recipe for target 'stamps/build-dir-tango-core-tools' failed
make[2]: *** [stamps/build-dir-tango-core-tools] Error 2
Makefile:121: recipe for target 'stamps/build-lib-base' failed
make[1]: *** [stamps/build-lib-base] Error 2
make[1]: Leaving directory '/<<PKGBUILDDIR>>'
debian/rules:13: recipe for target 'build-stamp-ldc' failed
make: *** [build-stamp-ldc] Error 2

Tail of log for getdp on armhf:

SCHROOT_USER=buildd
SHELL=/bin/sh
TERM=linux
USER=buildd

dpkg-buildpackage
-----------------

dpkg-buildpackage: source package getdp
dpkg-buildpackage: source version 2.4.2-1
dpkg-buildpackage: source distribution unstable
 dpkg-source --before-build getdp-2.4.2
dpkg-buildpackage: host architecture armhf
 fakeroot debian/rules clean
debian/rules:19: *** missing separator (did you mean TAB instead of 8 spaces?).  Stop.

Tail of log for lierolibre on armhf:

make[1]: *** [src/gvl/crypt/curve25519.lo] Error 1
make[1]: *** Waiting for unfinished jobs....
In file included from src/gvl/containers/../support/platform.hpp:29:0,
                 from src/gvl/containers/list.h:29,
                 from src/gvl/containers/list.hpp:35,
                 from src/gvl/containers/list.cpp:26:
src/gvl/containers/../support/platform.h:91:4: error: #error "Unknown architecture, please add it"
 #  error "Unknown architecture, please add it"
    ^
Makefile:1721: recipe for target 'src/gvl/containers/list.lo' failed
make[1]: *** [src/gvl/containers/list.lo] Error 1
make[1]: Leaving directory '/<<PKGBUILDDIR>>'
dh_auto_build: make -j4 returned exit code 2
debian/rules:13: recipe for target 'build-arch' failed
make: *** [build-arch] Error 2

Tail of log for msrtool on armhf:

gcc -MM msrtool.c msrutils.c sys.c linux.c geodelx.c cs5536.c k8.c > Makefile.deps
gcc -g -O2 -fstack-protector-strong -Wformat -Werror=format-security -Wall -DVERSION='"4091"' -c msrtool.c -o msrtool.o
gcc -g -O2 -fstack-protector-strong -Wformat -Werror=format-security -Wall -D_FORTIFY_SOURCE=2  -c -o msrutils.o msrutils.c
gcc -g -O2 -fstack-protector-strong -Wformat -Werror=format-security -Wall -D_FORTIFY_SOURCE=2  -c -o sys.o sys.c
sys.c: In function 'cpuid':
sys.c:28:2: error: unknown register name '%edx' in 'asm'
  asm ("cpuid" : "=a" (outeax) : "a" (1) : "%ebx", "%ecx", "%edx");
  ^
sys.c:28:2: error: unknown register name '%ecx' in 'asm'
sys.c:28:2: error: unknown register name '%ebx' in 'asm'
<builtin>: recipe for target 'sys.o' failed
make[1]: *** [sys.o] Error 1
make[1]: Leaving directory '/<<BUILDDIR>>/msrtool-0.0+r4091'
/usr/share/cdbs/1/class/makefile.mk:47: recipe for target 'debian/stamp-makefile-build' failed
make: *** [debian/stamp-makefile-build] Error 2

Tail of log for numactl on armhf:

syscall.c:209:17: error: '__NR_migrate_pages' undeclared (first use in this function)
  return syscall(__NR_migrate_pages, pid, maxnode, frommask, tomask);
                 ^
syscall.c:209:17: note: each undeclared identifier is reported only once for each function it appears in
syscall.c:210:1: warning: control reaches end of non-void function [-Wreturn-type]
 }
 ^
Makefile:1013: recipe for target 'syscall.lo' failed
make[2]: *** [syscall.lo] Error 1
make[2]: Leaving directory '/<<PKGBUILDDIR>>'
Makefile:688: recipe for target 'all' failed
make[1]: *** [all] Error 2
make[1]: Leaving directory '/<<PKGBUILDDIR>>'
/usr/share/cdbs/1/class/makefile.mk:47: recipe for target 'debian/stamp-makefile-build' failed
make: *** [debian/stamp-makefile-build] Error 2

Tail of log for open-axiom on armhf:

checking whether we are using the GNU C compiler... yes
checking whether gcc accepts -g... yes
checking for gcc option to accept ISO C89... none needed
checking dependency style of gcc... none
checking for g++... g++
checking whether we are using the GNU C++ compiler... yes
checking whether g++ accepts -g... yes
checking dependency style of g++... none
checking how to run the C preprocessor... /lib/cpp
configure: error: in `/<<BUILDDIR>>/open-axiom-1.5.0~svn3056+ds/build-tree':
configure: error: C preprocessor "/lib/cpp" fails sanity check
See `config.log' for more details
dh_auto_configure: ../configure --build=arm-linux-gnueabihf --prefix=/usr --includedir=${prefix}/include --mandir=${prefix}/share/man --infodir=${prefix}/share/info --sysconfdir=/etc --localstatedir=/var --disable-silent-rules --libexecdir=${prefix}/lib/open-axiom --disable-maintainer-mode --disable-dependency-tracking --with-lisp=sbcl --with-x --disable-gcl returned exit code 1
debian/rules:45: recipe for target 'configure-stamp' failed
make: *** [configure-stamp] Error 2

Tail of log for openmprtl on armhf:

./tools/build.pl  --arch=armv8l --mode=release lib inc common
Possible precedence issue with control flow operator at /<<PKGBUILDDIR>>/tools/lib/LibOMP.pm line 39.
Unsupported machine ("armv8l") returned by POSIX::uname(); stopped at /<<PKGBUILDDIR>>/tools/lib/Uname.pm line 172.
Compilation failed in require at /<<PKGBUILDDIR>>/tools/lib/Build.pm line 39.
BEGIN failed--compilation aborted at /<<PKGBUILDDIR>>/tools/lib/Build.pm line 39.
Compilation failed in require at ./tools/build.pl line 45.
BEGIN failed--compilation aborted at ./tools/build.pl line 45.
Makefile:40: recipe for target 'omp' failed
make[2]: *** [omp] Error 2
make[2]: Leaving directory '/<<PKGBUILDDIR>>'
debian/rules:10: recipe for target 'override_dh_auto_build' failed
make[1]: *** [override_dh_auto_build] Error 2
make[1]: Leaving directory '/<<PKGBUILDDIR>>'
debian/rules:7: recipe for target 'build-arch' failed
make: *** [build-arch] Error 2

Tail of log for pgloader on armhf:

The integrity of this image is possibly compromised.
Continuing with fingers crossed.
CORRUPTION WARNING in SBCL pid 7441:
Memory fault at ffffffd7 (pc=0x4f063d08, sp=(nil))
The integrity of this image is possibly compromised.
Continuing with fingers crossed.
fatal error encountered in SBCL pid 7441:
maximum interrupt nesting depth (1024) exceeded


debian/rules:31: recipe for target 'override_dh_auto_build' failed
make[1]: *** [override_dh_auto_build] Error 1
make[1]: Leaving directory '/<<BUILDDIR>>/pgloader-3.1.0+dfsg'
debian/rules:55: recipe for target 'build-arch' failed
make: *** [build-arch] Error 2

Tail of log for portslave on armhf:

gcc -O2  -Wall -W -Wshadow -Wpointer-arith -Wwrite-strings -pedantic -I../ppp-2.4.1/pppd -DNO_CHAP -I/usr/include/pppd   -c -o rot_getty.o rot_getty.c
gcc -O2  -Wall -W -Wshadow -Wpointer-arith -Wwrite-strings -pedantic -I../ppp-2.4.1/pppd -DNO_CHAP -I/usr/include/pppd   -c -o spawnit.o spawnit.c
gcc -O2  -Wall -W -Wshadow -Wpointer-arith -Wwrite-strings -pedantic -I../ppp-2.4.1/pppd -DNO_CHAP -I/usr/include/pppd   -c -o slip.o slip.c
gcc -O2  -Wall -W -Wshadow -Wpointer-arith -Wwrite-strings -pedantic -I../ppp-2.4.1/pppd -DNO_CHAP -I/usr/include/pppd   -c -o ctlp-subs.o ctlp-subs.c
gcc -o portslave main.o getty.o rot_getty.o spawnit.o slip.o ctlp-subs.o -L. -lportslave
./libportslave.so: undefined reference to `crypt'
collect2: error: ld returned 1 exit status
Makefile:22: recipe for target 'portslave' failed
make[2]: *** [portslave] Error 1
make[2]: Leaving directory '/<<PKGBUILDDIR>>/src'
Makefile:24: recipe for target 'ALL' failed
make[1]: *** [ALL] Error 2
make[1]: Leaving directory '/<<PKGBUILDDIR>>'
debian/rules:25: recipe for target 'build-stamp' failed
make: *** [build-stamp] Error 2

Tail of log for patchelf on armhf:

Makefile:700: recipe for target 'test-suite.log' failed
make[4]: *** [test-suite.log] Error 1
make[4]: Leaving directory '/<<PKGBUILDDIR>>/tests'
Makefile:806: recipe for target 'check-TESTS' failed
make[3]: *** [check-TESTS] Error 2
make[3]: Leaving directory '/<<PKGBUILDDIR>>/tests'
Makefile:935: recipe for target 'check-am' failed
make[2]: *** [check-am] Error 2
make[2]: Leaving directory '/<<PKGBUILDDIR>>/tests'
Makefile:427: recipe for target 'check-recursive' failed
make[1]: *** [check-recursive] Error 1
make[1]: Leaving directory '/<<PKGBUILDDIR>>'
dh_auto_test: make -j1 check returned exit code 2
debian/rules:8: recipe for target 'build-arch' failed
make: *** [build-arch] Error 2

Tail of log for pulseview on armhf:

 #include <Python.h> /* First, so we avoid a _POSIX_C_SOURCE warning. */
                                                                        ^
compilation terminated.
CMakeFiles/pulseview.dir/build.make:280: recipe for target 'CMakeFiles/pulseview.dir/main.cpp.o' failed
make[3]: *** [CMakeFiles/pulseview.dir/main.cpp.o] Error 1
make[3]: Leaving directory '/<<PKGBUILDDIR>>/obj-arm-linux-gnueabihf'
CMakeFiles/Makefile2:63: recipe for target 'CMakeFiles/pulseview.dir/all' failed
make[2]: *** [CMakeFiles/pulseview.dir/all] Error 2
make[2]: Leaving directory '/<<PKGBUILDDIR>>/obj-arm-linux-gnueabihf'
Makefile:140: recipe for target 'all' failed
make[1]: *** [all] Error 2
make[1]: Leaving directory '/<<PKGBUILDDIR>>/obj-arm-linux-gnueabihf'
dh_auto_build: make -j1 returned exit code 2
debian/rules:6: recipe for target 'build-arch' failed
make: *** [build-arch] Error 2

Tail of log for pyfftw on armhf:

/<<BUILDDIR>>/pyfftw-0.9.2+dfsg/pyfftw/pyfftw.c:2452:6: warning: '__pyx_v_update_dtype' may be used uninitialized in this function [-Wmaybe-uninitialized]
   if (__pyx_t_2) {
      ^
/<<BUILDDIR>>/pyfftw-0.9.2+dfsg/pyfftw/pyfftw.c:2305:7: note: '__pyx_v_update_dtype' was declared here
   int __pyx_v_update_dtype;
       ^
arm-linux-gnueabihf-gcc -pthread -shared -Wl,-O1 -Wl,-Bsymbolic-functions -Wl,-z,relro -fno-strict-aliasing -DNDEBUG -g -fwrapv -O2 -Wall -Wstrict-prototypes -D_FORTIFY_SOURCE=2 -g -fstack-protector-strong -Wformat -Werror=format-security -Wl,-z,relro -g -O2 -fstack-protector-strong -Wformat -Werror=format-security -D_FORTIFY_SOURCE=2 build/temp.linux-armv7l-2.7/<<BUILDDIR>>/pyfftw-0.9.2+dfsg/pyfftw/pyfftw.o -lfftw3 -lfftw3f -lfftw3l -lfftw3_threads -lfftw3f_threads -lfftw3l_threads -o /<<BUILDDIR>>/pyfftw-0.9.2+dfsg/.pybuild/pythonX.Y_2.7/build/pyfftw/pyfftw.so
/usr/bin/ld: cannot find -lfftw3l
/usr/bin/ld: cannot find -lfftw3l_threads
collect2: error: ld returned 1 exit status
error: command 'arm-linux-gnueabihf-gcc' failed with exit status 1
E: pybuild pybuild:256: build: plugin distutils failed with: exit code=1: /usr/bin/python setup.py build 
dh_auto_build: pybuild --build -i python{version} -p 2.7 --dir . returned exit code 13
debian/rules:12: recipe for target 'build-arch' failed
make: *** [build-arch] Error 13

Tail of log for pyside-mobility on armhf:

-- Using QtMobility version: system's default
-- QtMobility version: 1.2.0
CMake Error at CMakeLists.txt:55 (message):
  You need to specify GENERATOR variable (-DGENERATOR=value)


-- Configuring incomplete, errors occurred!
See also "/<<BUILDDIR>>/pyside-mobility-0.2.3+git4~8118106/build-2.7/CMakeFiles/CMakeOutput.log".
See also "/<<BUILDDIR>>/pyside-mobility-0.2.3+git4~8118106/build-2.7/CMakeFiles/CMakeError.log".
dh_auto_configure: cmake .. -DCMAKE_INSTALL_PREFIX=/usr -DCMAKE_VERBOSE_MAKEFILE=ON -DCMAKE_BUILD_TYPE=None -DCMAKE_VERBOSE_MAKEFILE=ON -DCMAKE_BUILD_TYPE:STRING=Release -DCMAKE_SKIP_RPATH=true -DCMAKE_USE_PYTHON_VERSION=2.7 -DPython_ADDITIONAL_VERSIONS=2.7 -DPythonInterp_FIND_VERSION=2.7 -DPYTHON_BASENAME=-python2.7 -DPYTHON_SUFFIX=-python2.7 returned exit code 1
debian/rules:52: recipe for target 'override_dh_auto_configure-2.7' failed
make[1]: *** [override_dh_auto_configure-2.7] Error 2
make[1]: Leaving directory '/<<BUILDDIR>>/pyside-mobility-0.2.3+git4~8118106'
debian/rules:4: recipe for target 'build-arch' failed
make: *** [build-arch] Error 2

Tail of log for qtjsbackend-opensource-src on armhf:

make[3]: Leaving directory '/<<PKGBUILDDIR>>/src'
make[2]: Leaving directory '/<<PKGBUILDDIR>>'
# Remove libtool-like files
rm -f debian/tmp/usr/lib/arm-linux-gnueabihf/*.la
make[1]: Leaving directory '/<<PKGBUILDDIR>>'
   debian/rules override_dh_install
make[1]: Entering directory '/<<PKGBUILDDIR>>'
dh_install --fail-missing
cp: cannot stat 'debian/tmp/usr/include/qt5/QtV8/QtV8': No such file or directory
dh_install: cp -a debian/tmp/usr/include/qt5/QtV8/QtV8 debian/libqt5v8-5-dev//usr/include/qt5/QtV8/ returned exit code 1
debian/rules:26: recipe for target 'override_dh_install' failed
make[1]: *** [override_dh_install] Error 2
make[1]: Leaving directory '/<<PKGBUILDDIR>>'
debian/rules:14: recipe for target 'binary-arch' failed
make: *** [binary-arch] Error 2

Tail of log for python-pysam on armhf:

make[2]: *** [ex10.bam] Bus error
make[2]: *** Deleting file 'ex10.bam'
make[2]: Leaving directory '/<<PKGBUILDDIR>>/tests'
building data files
starting tests
.....................E...E../pysam_test_offline.py:473: UserWarning: fetch called for samfile without header
  result = list(infile.fetch())
................................................................EE.....................Bus error
E: pybuild pybuild:256: test: plugin custom failed with: exit code=135: cd tests && PYTHONPATH=/<<PKGBUILDDIR>>/.pybuild/pythonX.Y_2.7/build python2.7 ./pysam_test_offline.py
dh_auto_test: pybuild --test -i python{version} -p 2.7 --dir . returned exit code 13
debian/rules:29: recipe for target 'override_dh_auto_test' failed
make[1]: *** [override_dh_auto_test] Error 13
make[1]: Leaving directory '/<<PKGBUILDDIR>>'
debian/rules:9: recipe for target 'build-arch' failed
make: *** [build-arch] Error 2

Tail of log for openni on armhf:

*     2017-06-18 10:22:52       *
*********************************

Target: Linux-Arm
Version: 1.5.4.0
Num of compile jobs: 8

* Building OpenNI...
failed to execute: make  -C /<<PKGBUILDDIR>>/Platform/Linux/CreateRedist/../Build > /<<PKGBUILDDIR>>/Platform/Linux/CreateRedist/Output/BuildOpenNI.txt
Building Failed!
debian/rules:7: recipe for target 'override_dh_auto_build' failed
make[1]: *** [override_dh_auto_build] Error 1
make[1]: Leaving directory '/<<PKGBUILDDIR>>'
debian/rules:4: recipe for target 'build-arch' failed
make: *** [build-arch] Error 2

Tail of log for qtop on armhf:

/<<PKGBUILDDIR>>/base-qt/CustomPixmap.cpp:198:34: note:   deduced conflicting types for parameter 'const T' ('float' and 'double')
     opacity = qMin( opacity, 1.0 );
                                  ^
base-qt/CMakeFiles/base-qt.dir/build.make:1015: recipe for target 'base-qt/CMakeFiles/base-qt.dir/CustomPixmap.cpp.o' failed
make[3]: *** [base-qt/CMakeFiles/base-qt.dir/CustomPixmap.cpp.o] Error 1
make[3]: Leaving directory '/<<PKGBUILDDIR>>/obj-arm-linux-gnueabihf'
CMakeFiles/Makefile2:162: recipe for target 'base-qt/CMakeFiles/base-qt.dir/all' failed
make[2]: *** [base-qt/CMakeFiles/base-qt.dir/all] Error 2
make[2]: Leaving directory '/<<PKGBUILDDIR>>/obj-arm-linux-gnueabihf'
Makefile:140: recipe for target 'all' failed
make[1]: *** [all] Error 2
make[1]: Leaving directory '/<<PKGBUILDDIR>>/obj-arm-linux-gnueabihf'
dh_auto_build: make -j1 returned exit code 2
debian/rules:5: recipe for target 'build-arch' failed
make: *** [build-arch] Error 2

Tail of log for slang-slirp on armhf:

checking for dlopen in -ldl... yes
checking for g++... g++
checking whether we are using the GNU C++ compiler... yes
checking whether g++ accepts -g... yes
checking for gfortran... gfortran
checking whether we are using the GNU Fortran compiler... yes
checking whether gfortran accepts -g... yes
checking how to get verbose linking output from gfortran... -v
checking for Fortran libraries of gfortran...  -L/usr/lib/gcc/arm-linux-gnueabihf/4.9 -L/usr/lib/gcc/arm-linux-gnueabihf/4.9/../../../arm-linux-gnueabihf -L/usr/lib/gcc/arm-linux-gnueabihf/4.9/../../.. -L/lib/arm-linux-gnueabihf -L/usr/lib/arm-linux-gnueabihf -lgfortran -lm
checking for dummy main to link with Fortran libraries... none
checking for Fortran name-mangling scheme... lower case, underscore, no extra underscore
checking for the slang library and header files ... no
configure: error: unable to find the slang library and header file slang.h
/usr/share/cdbs/1/class/autotools.mk:42: recipe for target 'debian/stamp-autotools' failed
make: *** [debian/stamp-autotools] Error 1

Tail of log for sra-sdk on armhf:

make[5]: Leaving directory '/<<BUILDDIR>>/sra-sdk-2.3.5-2+dfsg/libs/klib/judy'
Makefile:43: recipe for target 'all' failed
make[4]: *** [all] Error 2
make[4]: Leaving directory '/<<BUILDDIR>>/sra-sdk-2.3.5-2+dfsg/libs/klib'
Makefile:64: recipe for target 'klib' failed
make[3]: *** [klib] Error 2
make[3]: Leaving directory '/<<BUILDDIR>>/sra-sdk-2.3.5-2+dfsg/libs'
Makefile:48: recipe for target 'libs' failed
make[2]: *** [libs] Error 2
make[2]: Leaving directory '/<<BUILDDIR>>/sra-sdk-2.3.5-2+dfsg'
debian/rules:18: recipe for target 'override_dh_auto_build' failed
make[1]: *** [override_dh_auto_build] Error 2
make[1]: Leaving directory '/<<BUILDDIR>>/sra-sdk-2.3.5-2+dfsg'
debian/rules:3: recipe for target 'build-arch' failed
make: *** [build-arch] Error 2

Tail of log for rhmessaging on armhf:

#define _GNU_SOURCE 1
#define _POSIX_PTHREAD_SEMANTICS 1
#define _TANDEM_SOURCE 1
#define lint 1
#define HAVE_DLFCN_H 1
#define LT_OBJDIR ".libs/"
#define HAVE_LIBAIO 1

configure: exit 1
dh_auto_configure: ./configure --build=arm-linux-gnueabihf --prefix=/usr --includedir=${prefix}/include --mandir=${prefix}/share/man --infodir=${prefix}/share/info --sysconfdir=/etc --localstatedir=/var --libdir=${prefix}/lib/arm-linux-gnueabihf --libexecdir=${prefix}/lib/arm-linux-gnueabihf --disable-maintainer-mode --disable-dependency-tracking --with-qpid-prefix=/usr --with-sysconfigdir=/etc/qpid returned exit code 1
debian/rules:26: recipe for target 'override_dh_auto_configure' failed
make[1]: *** [override_dh_auto_configure] Error 255
make[1]: Leaving directory '/<<PKGBUILDDIR>>'
debian/rules:34: recipe for target 'build-arch' failed
make: *** [build-arch] Error 2

Tail of log for utopia-documents on armhf:

[ 36%] Building CXX object libutopia2_auth/utopia2/auth/CMakeFiles/utopia2_auth.dir/moc_user_p.cxx.o
cd /<<PKGBUILDDIR>>/utopia-build/libutopia2_auth/utopia2/auth && /usr/bin/c++   -DQT_CORE_LIB -DQT_GUI_LIB -DQT_NETWORK_LIB -DQT_NO_DEBUG -DQT_NO_DEBUG_OUTPUT=1 -DQT_NO_WARNING_OUTPUT=1 -DQT_OPENGL_LIB -DQT_SCRIPT_LIB -DQT_SVG_LIB -DQT_WEBKIT_LIB -DQT_XML_LIB -Dutopia2_auth_EXPORTS -g -O2 -fstack-protector-strong -Wformat -Werror=format-security  -O3 -DNDEBUG -fPIC -isystem /usr/include/qt4 -isystem /usr/include/qt4/QtOpenGL -isystem /usr/include/qt4/QtScript -isystem /usr/include/qt4/QtSvg -isystem /usr/include/qt4/QtWebKit -isystem /usr/include/qt4/QtGui -isystem /usr/include/qt4/QtXml -isystem /usr/include/qt4/QtNetwork -isystem /usr/include/qt4/QtCore -I/<<PKGBUILDDIR>>/libutopia2_auth -I/<<PKGBUILDDIR>>/utopia-build/libutopia2_auth -I/<<PKGBUILDDIR>>/utopia-build/libutopia2_auth/utopia2/auth -I/<<PKGBUILDDIR>>/libutf8 -I/<<PKGBUILDDIR>>/libutopia2    -fPIC -o CMakeFiles/utopia2_auth.dir/moc_user_p.cxx.o -c /<<PKGBUILDDIR>>/utopia-build/libutopia2_auth/utopia2/auth/moc_user_p.cxx
Linking CXX shared library ../../../lib/utopia-documents/lib/libutopia2_auth.so
cd /<<PKGBUILDDIR>>/utopia-build/libutopia2_auth/utopia2/auth && /usr/bin/cmake -E cmake_link_script CMakeFiles/utopia2_auth.dir/link.txt --verbose=1
/usr/bin/c++  -fPIC -g -O2 -fstack-protector-strong -Wformat -Werror=format-security  -O3 -DNDEBUG  -Wl,-z,relro -shared -Wl,-soname,libutopia2_auth.so -o ../../../lib/utopia-documents/lib/libutopia2_auth.so CMakeFiles/utopia2_auth.dir/authagent.cpp.o CMakeFiles/utopia2_auth.dir/cJSON.c.o CMakeFiles/utopia2_auth.dir/credentialmanager.cpp.o CMakeFiles/utopia2_auth.dir/service.cpp.o CMakeFiles/utopia2_auth.dir/servicemanager.cpp.o CMakeFiles/utopia2_auth.dir/servicemanagermodel.cpp.o CMakeFiles/utopia2_auth.dir/servicemanagerfilterproxymodel.cpp.o CMakeFiles/utopia2_auth.dir/servicemanagernotifier.cpp.o CMakeFiles/utopia2_auth.dir/user.cpp.o CMakeFiles/utopia2_auth.dir/moc_authagent.cxx.o CMakeFiles/utopia2_auth.dir/moc_authagent_p.cxx.o CMakeFiles/utopia2_auth.dir/moc_service.cxx.o CMakeFiles/utopia2_auth.dir/moc_service_p.cxx.o CMakeFiles/utopia2_auth.dir/moc_servicemanager.cxx.o CMakeFiles/utopia2_auth.dir/moc_servicemanager_p.cxx.o CMakeFiles/utopia2_auth.dir/moc_servicemanagermodel.cxx.o CMakeFiles/utopia2_auth.dir/moc_servicemanagermodel_p.cxx.o CMakeFiles/utopia2_auth.dir/moc_servicemanagerfilterproxymodel.cxx.o CMakeFiles/utopia2_auth.dir/moc_servicemanagernotifier.cxx.o CMakeFiles/utopia2_auth.dir/moc_servicemanagernotifier_p.cxx.o CMakeFiles/utopia2_auth.dir/moc_user.cxx.o CMakeFiles/utopia2_auth.dir/moc_user_p.cxx.o ../../../lib/utopia-documents/lib/libutopia2.so -lQtOpenGL -lQtScript -lQtSvg -lQtWebKit -lQtXmlPatterns -lQtGui -lQtXml -lQtNetwork -lQtCore ../../../lib/utopia-documents/lib/libutf8.a -lboost_thread -lboost_system -lboost_python -lpthread -lpython2.7 -lqjson -lssl -lcrypto -ldl -Wl,-rpath,/<<PKGBUILDDIR>>/utopia-build/lib/utopia-documents/lib: 
make[3]: Leaving directory '/<<PKGBUILDDIR>>/utopia-build'
/usr/bin/cmake -E cmake_progress_report /<<PKGBUILDDIR>>/utopia-build/CMakeFiles  61 62 63 64 65
[ 36%] Built target utopia2_auth
make[2]: Leaving directory '/<<PKGBUILDDIR>>/utopia-build'
Makefile:140: recipe for target 'all' failed
make[1]: *** [all] Error 2
make[1]: Leaving directory '/<<PKGBUILDDIR>>/utopia-build'
dh_auto_build: make -j4 returned exit code 2
debian/rules:4: recipe for target 'build-arch' failed
make: *** [build-arch] Error 2

Tail of log for varnish-agent on armhf:

src/Makefile.am:8: but option 'subdir-objects' is disabled
src/Makefile.am:8: warning: source file 'modules/vban.c' is in a subdirectory,
src/Makefile.am:8: but option 'subdir-objects' is disabled
src/Makefile.am:8: warning: source file 'modules/curl.c' is in a subdirectory,
src/Makefile.am:8: but option 'subdir-objects' is disabled
src/Makefile.am:8: warning: source file 'modules/vdirect.c' is in a subdirectory,
src/Makefile.am:8: but option 'subdir-objects' is disabled
src/Makefile.am:8: warning: source file 'modules/vac_register.c' is in a subdirectory,
src/Makefile.am:8: but option 'subdir-objects' is disabled
src/Makefile.am: installing './depcomp'
parallel-tests: installing './test-driver'
autoreconf: automake failed with exit status: 1
dh_autoreconf: autoreconf -f -i returned exit code 1
debian/rules:46: recipe for target 'build-arch' failed
make: *** [build-arch] Error 2

Tail of log for vmkit on armhf:

dpkg-buildpackage: source distribution unstable
 dpkg-source --before-build vmkit-0.32~r185341
dpkg-buildpackage: host architecture armhf
 fakeroot debian/rules clean
dh clean  --with autotools-dev
   dh_testdir
   dh_auto_clean
	make -j1 distclean
make[1]: Entering directory '/<<PKGBUILDDIR>>'
Makefile:14: Makefile.common: No such file or directory
make[1]: *** No rule to make target 'Makefile.common'.  Stop.
make[1]: Leaving directory '/<<PKGBUILDDIR>>'
dh_auto_clean: make -j1 distclean returned exit code 2
debian/rules:14: recipe for target 'clean' failed
make: *** [clean] Error 2

Tail of log for wmmail on armhf:

make[2]: Entering directory '/<<PKGBUILDDIR>>/src'
gcc -DPACKAGE=\"WMMail\" -DVERSION=\"0.64\" -DHAVE_LIBNSL=1 -DHAVE_LIBX11=1 -DHAVE_LIBXEXT=1 -DHAVE_LIBXT=1 -DHAVE_LIBXPM=1 -DHAVE_LIBWUTIL=1 -DSTDC_HEADERS=1 -DHAVE_LIMITS_H=1 -DHAVE_STRINGS_H=1 -DHAVE_UNISTD_H=1 -DRETSIGTYPE=int -DHAVE_VPRINTF=1 -DHAVE_SOCKET=1 -DHAVE_STRSTR=1  -I. -I.      -g -O2 -I  -c global.c
In file included from global.c:27:0:
wmmail.h:32:35: fatal error: WINGs/proplist-compat.h: No such file or directory
 #include <WINGs/proplist-compat.h>
                                   ^
compilation terminated.
Makefile:247: recipe for target 'global.o' failed
make[2]: *** [global.o] Error 1
make[2]: Leaving directory '/<<PKGBUILDDIR>>/src'
Makefile:125: recipe for target 'all-recursive' failed
make[1]: *** [all-recursive] Error 1
make[1]: Leaving directory '/<<PKGBUILDDIR>>'
debian/rules:13: recipe for target 'build-stamp' failed
make: *** [build-stamp] Error 2

Tail of log for xhprof on armhf:

/usr/include/php5/main/php_config.h:2487:0: warning: "_GNU_SOURCE" redefined
 #define _GNU_SOURCE 1
 ^
/<<PKGBUILDDIR>>/extension/xhprof.c:24:0: note: this is the location of the previous definition
 # define _GNU_SOURCE
 ^
/<<PKGBUILDDIR>>/extension/xhprof.c: In function 'hp_mode_hier_beginfn_cb':
/<<PKGBUILDDIR>>/extension/xhprof.c:1224:3: error: impossible constraint in 'asm'
   asm volatile("rdtsc" : "=a" (__a), "=d" (__d));
   ^
Makefile:180: recipe for target 'xhprof.lo' failed
make[1]: *** [xhprof.lo] Error 1
make[1]: Leaving directory '/<<PKGBUILDDIR>>/extension'
debian/rules:37: recipe for target 'build-stamp' failed
make: *** [build-stamp] Error 2

Tail of log for sdrangelove on armhf:

-- Detecting CXX compiler ABI info
-- Detecting CXX compiler ABI info - done
CMake Error at /usr/share/cmake-3.0/Modules/FindPackageHandleStandardArgs.cmake:136 (message):
  Could NOT find OpenGL (missing: OPENGL_gl_LIBRARY OPENGL_INCLUDE_DIR)
Call Stack (most recent call first):
  /usr/share/cmake-3.0/Modules/FindPackageHandleStandardArgs.cmake:343 (_FPHSA_FAILURE_MESSAGE)
  /usr/share/cmake-3.0/Modules/FindOpenGL.cmake:175 (FIND_PACKAGE_HANDLE_STANDARD_ARGS)
  CMakeLists.txt:21 (find_package)


-- Configuring incomplete, errors occurred!
See also "/<<PKGBUILDDIR>>/obj-arm-linux-gnueabihf/CMakeFiles/CMakeOutput.log".
dh_auto_configure: cmake .. -DCMAKE_INSTALL_PREFIX=/usr -DCMAKE_VERBOSE_MAKEFILE=ON -DCMAKE_BUILD_TYPE=None returned exit code 1
debian/rules:10: recipe for target 'build-arch' failed
make: *** [build-arch] Error 2

Tail of log for wesnoth-1.8 on armhf:

display.hpp:111:33: warning: narrowing conversion of 'display::w()' from 'int' to 'Uint16 {aka short unsigned int}' inside { } is ill-formed in C++11 [-Wnarrowing]
   { const SDL_Rect res = {0,0,w(),h()}; return res; }
                                 ^
display.hpp:111:37: warning: narrowing conversion of 'display::h()' from 'int' to 'Uint16 {aka short unsigned int}' inside { } is ill-formed in C++11 [-Wnarrowing]
   { const SDL_Rect res = {0,0,w(),h()}; return res; }
                                     ^
make[3]: Leaving directory '/<<PKGBUILDDIR>>/src'
Makefile:639: recipe for target 'all-recursive' failed
make[2]: *** [all-recursive] Error 1
make[2]: Leaving directory '/<<PKGBUILDDIR>>'
Makefile:496: recipe for target 'all' failed
make[1]: *** [all] Error 2
make[1]: Leaving directory '/<<PKGBUILDDIR>>'
debian/rules:79: recipe for target 'build-stamp' failed
make: *** [build-stamp] Error 2

Tail of log for 3dldf on armhf:

In `runit'
*** Error in `./3dldf': free(): invalid pointer: 0x0048c840 ***
./runit: line 76: 15779 Aborted                 (core dumped) ./3dldf sample2.ldf
Makefile:1664: recipe for target 'sample2.mp' failed
make[3]: *** [sample2.mp] Error 134
make[3]: Leaving directory '/<<BUILDDIR>>/3dldf-2.0.3+dfsg/src'
Makefile:774: recipe for target 'check-am' failed
make[2]: *** [check-am] Error 2
make[2]: Leaving directory '/<<BUILDDIR>>/3dldf-2.0.3+dfsg/src'
Makefile:535: recipe for target 'check-recursive' failed
make[1]: *** [check-recursive] Error 1
make[1]: Leaving directory '/<<BUILDDIR>>/3dldf-2.0.3+dfsg'
dh_auto_test: make -j1 check returned exit code 2
debian/rules:7: recipe for target 'build-arch' failed
make: *** [build-arch] Error 2

Tail of log for rheolef on armhf:

../plib/.libs/libfem.a(geo.o):(.rodata+0x2c): first defined here
../plib/.libs/libfem.a(geo_domain_seq.o):(.data.rel.ro+0x0): multiple definition of `typeinfo for rheolef::geo_rep<double, rheolef::sequential>'
../plib/.libs/libfem.a(geo.o):(.data.rel.ro+0xc): first defined here
collect2: error: ld returned 1 exit status
Makefile:796: recipe for target 'librheolef.la' failed
make[4]: *** [librheolef.la] Error 1
Makefile:707: recipe for target 'all' failed
make[3]: *** [all] Error 2
Makefile:449: recipe for target 'all-recursive' failed
make[2]: *** [all-recursive] Error 1
Makefile:551: recipe for target 'all-recursive' failed
make[1]: *** [all-recursive] Error 1
make[1]: Leaving directory '/<<PKGBUILDDIR>>'
debian/rules:59: recipe for target 'build-stamp' failed
make: *** [build-stamp] Error 2

Tail of log for groonga on armhf:

Makefile:629: recipe for target 'groonga-suggest-create-dataset' failed
make[4]: *** [groonga-suggest-create-dataset] Error 1
make[4]: Leaving directory '/<<PKGBUILDDIR>>/src/suggest'
Makefile:708: recipe for target 'all-recursive' failed
make[3]: *** [all-recursive] Error 1
make[3]: Leaving directory '/<<PKGBUILDDIR>>/src'
Makefile:587: recipe for target 'all-recursive' failed
make[2]: *** [all-recursive] Error 1
make[2]: Leaving directory '/<<PKGBUILDDIR>>'
Makefile:489: recipe for target 'all' failed
make[1]: *** [all] Error 2
make[1]: Leaving directory '/<<PKGBUILDDIR>>'
dh_auto_build: make -j1 returned exit code 2
debian/rules:15: recipe for target 'build-arch' failed
make: *** [build-arch] Error 2

Tail of log for pocl on armhf:

+ _ZTVSt23_Sp_counted_ptr_inplaceIN5clang19DependencyCollectorESaIS1_ELN9__gnu_cxx12_Lock_policyE1EE@Base 0.10-10
+#MISSING: 0.10-10# _ZTVSt23_Sp_counted_ptr_inplaceIN5clang19DependencyCollectorESaIS1_ELN9__gnu_cxx12_Lock_policyE2EE@Base 0.10
+ _ZTVSt23_Sp_counted_ptr_inplaceIN5clang25ModuleDependencyCollectorESaIS1_ELN9__gnu_cxx12_Lock_policyE1EE@Base 0.10-10
+#MISSING: 0.10-10# _ZTVSt23_Sp_counted_ptr_inplaceIN5clang25ModuleDependencyCollectorESaIS1_ELN9__gnu_cxx12_Lock_policyE2EE@Base 0.10
+ _ZTVSt23_Sp_counted_ptr_inplaceISt5stackIN5clang3vfs18directory_iteratorESt6vectorIS3_SaIS3_EEESaIS7_ELN9__gnu_cxx12_Lock_policyE1EE@Base 0.10-10
+#MISSING: 0.10-10# _ZTVSt23_Sp_counted_ptr_inplaceISt5stackIN5clang3vfs18directory_iteratorESt6vectorIS3_SaIS3_EEESaIS7_ELN9__gnu_cxx12_Lock_policyE2EE@Base 0.10
  _ZZN4llvm7hashing6detail18get_execution_seedEvE4seed@Base 0.10
  (subst)_ZnwIN4llvm15MallocAllocatorEL{size_t}4096EL{size_t}4096EEPv{size_t}RNS0_20BumpPtrAllocatorImplIT_XT0_EXT1_EEE@Base 0.10
  check_compiler_cache@Base 0.10
dh_makeshlibs: failing due to earlier errors
debian/rules:74: recipe for target 'override_dh_makeshlibs' failed
make[1]: *** [override_dh_makeshlibs] Error 2
make[1]: Leaving directory '/<<PKGBUILDDIR>>'
debian/rules:33: recipe for target 'binary-arch' failed
make: *** [binary-arch] Error 2

Tail of log for kamailio on armhf:

removing extra lib libsrdb2.so.1.0 present also in /<<PKGBUILDDIR>>/debian/kamailio/usr/lib/arm-linux-gnueabihf/kamailio
removing extra lib libtrie.so.1.0 present also in /<<PKGBUILDDIR>>/debian/kamailio/usr/lib/arm-linux-gnueabihf/kamailio
removing extra lib libkmi.so.1 present also in /<<PKGBUILDDIR>>/debian/kamailio/usr/lib/arm-linux-gnueabihf/kamailio
removing extra lib libbinrpc.so.0.1 present also in /<<PKGBUILDDIR>>/debian/kamailio/usr/lib/arm-linux-gnueabihf/kamailio
removing extra lib libkcore.so.1 present also in /<<PKGBUILDDIR>>/debian/kamailio/usr/lib/arm-linux-gnueabihf/kamailio
removing extra lib libsrdb1.so.1.0 present also in /<<PKGBUILDDIR>>/debian/kamailio/usr/lib/arm-linux-gnueabihf/kamailio
removing extra lib libkcore.so present also in /<<PKGBUILDDIR>>/debian/kamailio/usr/lib/arm-linux-gnueabihf/kamailio
removing extra lib libkmi.so present also in /<<PKGBUILDDIR>>/debian/kamailio/usr/lib/arm-linux-gnueabihf/kamailio
find: `/<<PKGBUILDDIR>>/debian/kamailio-db-modules/usr/lib/arm-linux-gnueabihf/kamailio': No such file or directory
find /<<PKGBUILDDIR>>/debian/kamailio-extra-modules -depth -empty -type d -exec rmdir {} \;
mv /<<PKGBUILDDIR>>/debian/kamailio-berkeley-modules/usr/sbin/kambdb_recover \
	/<<PKGBUILDDIR>>/debian/kamailio-berkeley-bin/usr/sbin/kambdb_recover
mv: cannot move '/<<PKGBUILDDIR>>/debian/kamailio-berkeley-modules/usr/sbin/kambdb_recover' to '/<<PKGBUILDDIR>>/debian/kamailio-berkeley-bin/usr/sbin/kambdb_recover': No such file or directory
debian/rules:163: recipe for target 'install' failed
make: *** [install] Error 1

Tail of log for apophenia on armhf:

E: Caught signal ‘Terminated’: terminating immediately
Terminated
make[4]: *** Deleting file 'utilities_test.log'
make[4]: *** wait: No child processes.  Stop.
make[4]: *** Waiting for unfinished jobs....
make[4]: *** wait: No child processes.  Stop.
make[1]: *** wait: No child processes.  Stop.
make[1]: *** Waiting for unfinished jobs....
make[1]: *** wait: No child processes.  Stop.
Makefile:1545: recipe for target 'check-TESTS' failed
make[3]: *** [check-TESTS] Terminated
debian/rules:20: recipe for target 'build-arch' failed
make: *** [build-arch] Terminated
Makefile:1863: recipe for target 'check-am' failed
make[2]: *** [check-am] Terminated

Tail of log for libzypp on armhf:

      Start  8: CpeId_test

8: Test command: /<<PKGBUILDDIR>>/obj-arm-linux-gnueabihf/tests/zypp/CpeId_test "--catch_system_errors=no"
8: Test timeout computed to be: 9.99988e+06
tests/CMakeFiles/ctest.dir/build.make:52: recipe for target 'tests/CMakeFiles/ctest' failed
make[4]: *** [tests/CMakeFiles/ctest] Terminated
CMakeFiles/Makefile2:2791: recipe for target 'tests/CMakeFiles/ctest.dir/all' failed
make[3]: *** [tests/CMakeFiles/ctest.dir/all] Terminated
CMakeFiles/Makefile2:2799: recipe for target 'tests/CMakeFiles/ctest.dir/rule' failed
make[2]: *** [tests/CMakeFiles/ctest.dir/rule] Terminated
Makefile:1185: recipe for target 'ctest' failed
make[1]: *** [ctest] Terminated
/usr/share/cdbs/1/class/makefile.mk:67: recipe for target 'debian/stamp-makefile-check' failed
make: *** [debian/stamp-makefile-check] Terminated
E: Caught signal ‘Terminated’: terminating immediately

Tail of log for xen on armhf:

make[5]: Leaving directory '/<<PKGBUILDDIR>>/debian/build/build-utils_armhf/tools/xenstore'
/<<PKGBUILDDIR>>/debian/build/build-utils_armhf/tools/../tools/Rules.mk:103: recipe for target 'subdir-all-xenstore' failed
make[4]: *** [subdir-all-xenstore] Error 2
make[4]: Leaving directory '/<<PKGBUILDDIR>>/debian/build/build-utils_armhf/tools'
/<<PKGBUILDDIR>>/debian/build/build-utils_armhf/tools/../tools/Rules.mk:98: recipe for target 'subdirs-all' failed
make[3]: *** [subdirs-all] Error 2
make[3]: Leaving directory '/<<PKGBUILDDIR>>/debian/build/build-utils_armhf/tools'
debian/rules.real:102: recipe for target 'debian/stamps/build-utils_armhf' failed
make[2]: *** [debian/stamps/build-utils_armhf] Error 2
make[2]: Leaving directory '/<<PKGBUILDDIR>>'
debian/rules.gen:72: recipe for target 'build-arch_armhf_real' failed
make[1]: *** [build-arch_armhf_real] Error 2
make[1]: Leaving directory '/<<PKGBUILDDIR>>'
debian/rules:20: recipe for target 'build-arch' failed
make: *** [build-arch] Error 2

Tail of log for tcpdump on armhf:

> 	Domain name: , Seq number: 0, Config Rev fb499603
Failed test: vtp_asan-3

2c2
< 	Domain name: , Seq number: 0, Config Rev 4040404[|vtp]
---
> 	Domain name: , Seq number: 0, Config Rev 4040404


Makefile:440: recipe for target 'check' failed
make[1]: *** [check] Error 2
make[1]: Leaving directory '/<<PKGBUILDDIR>>'
dh_auto_test: make -j4 check returned exit code 2
debian/rules:7: recipe for target 'build-arch' failed
make: *** [build-arch] Error 2