Raspbian Package Auto-Building

Buildd status for aspectc++ (jessie-staging)

Debian PTSTrackerChangelogBugspackages.d.obuildd.d.o

Package(s): Suite:
Compact mode Co-maintainers

ArchitectureVersionStatusForBuilddStateMiscLogs
Buildd exposure stats armhf  1:1.2-1Build-Attempted124d 23h 45mtestwandboardout-of-datedevel:sourceold | all (11)

Tail of log for aspectc++ on armhf:

/build/aspectc++-eHpgcL/aspectc++-1.2/Puma.copy/gen-release/step1/src/PreExprParser.cc:1797: error: `%anon7373' has no member named `yy'
/build/aspectc++-eHpgcL/aspectc++-1.2/Puma.copy/gen-release/step1/src/PreExprParser.cc:1797: error: invalid operand to binary `-'
/build/aspectc++-eHpgcL/aspectc++-1.2/Puma.copy/gen-release/step1/src/PreExprParser.cc:1797: error: undefined type
/build/aspectc++-eHpgcL/aspectc++-1.2/Puma.copy/gen-release/step1/src/PreExprParser.cc:1797: error: non-lvalue in assignment
/build/aspectc++-eHpgcL/aspectc++-1.2/Puma.copy/gen-release/step1/src/PreExprParser.cc:1797: error: undefined type
weave.mk:72: recipe for target '/build/aspectc++-eHpgcL/aspectc++-1.2/Puma.copy/gen-release/step2/src/PreExprParser.cc' failed
make[3]: *** [/build/aspectc++-eHpgcL/aspectc++-1.2/Puma.copy/gen-release/step2/src/PreExprParser.cc] Error 1
make[3]: *** Waiting for unfinished jobs....
Makefile:50: recipe for target 'step2' failed
make[2]: *** [step2] Error 2
Makefile:55: recipe for target 'src' failed
make[1]: *** [src] Error 2
make[1]: Leaving directory '/build/aspectc++-eHpgcL/aspectc++-1.2/Puma.copy'
debian/rules:52: recipe for target 'build-arch-stamp' failed
make: *** [build-arch-stamp] Error 2