Raspbian Package Auto-Building

Buildd status for aseba (bullseye-staging)

Debian PTSTrackerChangelogBugspackages.d.obuildd.d.o

Package(s): Suite:
Compact mode Co-maintainers

ArchitectureVersionStatusForBuilddStateMiscLogs
Buildd exposure stats armhf  1.6.0-5Build-Attempted10d 7h 20mmb-lxc-01uncompiledmisc:extraold | all (5)

Tail of log for aseba on armhf:

/usr/bin/ld: CMakeFiles/asebamarxbot.dir/EnkiMarxbot.cpp.o:(.data.rel.ro._ZTVN4Enki13MarxbotViewerE[_ZTVN4Enki13MarxbotViewerE]+0x110): undefined reference to `Enki::ViewerWidget::renderScene(double, double, double, double, double, double)'
/usr/bin/ld: CMakeFiles/asebamarxbot.dir/EnkiMarxbot.cpp.o:(.data.rel.ro._ZTVN4Enki13MarxbotViewerE[_ZTVN4Enki13MarxbotViewerE]+0x114): undefined reference to `Enki::ViewerWidget::picking(double, double, double, double, double, double)'
/usr/bin/ld: CMakeFiles/asebamarxbot.dir/EnkiMarxbot.cpp.o:(.data.rel.ro._ZTVN4Enki13MarxbotViewerE[_ZTVN4Enki13MarxbotViewerE]+0x118): undefined reference to `Enki::ViewerWidget::displayMessages()'
/usr/bin/ld: CMakeFiles/asebamarxbot.dir/EnkiMarxbot.cpp.o:(.data.rel.ro._ZTVN4Enki13MarxbotViewerE[_ZTVN4Enki13MarxbotViewerE]+0x11c): undefined reference to `Enki::ViewerWidget::displayWidgets()'
/usr/bin/ld: CMakeFiles/asebamarxbot.dir/EnkiMarxbot.cpp.o:(.data.rel.ro._ZTVN4Enki13MarxbotViewerE[_ZTVN4Enki13MarxbotViewerE]+0x120): undefined reference to `Enki::ViewerWidget::clickWidget(QMouseEvent*)'
/usr/bin/ld: CMakeFiles/asebamarxbot.dir/EnkiMarxbot.cpp.o:(.data.rel.ro._ZTVN4Enki13MarxbotViewerE[_ZTVN4Enki13MarxbotViewerE]+0x124): undefined reference to `Enki::ViewerWidget::helpActivated()'
collect2: error: ld returned 1 exit status
make[3]: *** [targets/enki-marxbot/CMakeFiles/asebamarxbot.dir/build.make:129: targets/enki-marxbot/asebamarxbot] Error 1
make[3]: Leaving directory '/<<PKGBUILDDIR>>/obj-arm-linux-gnueabihf'
make[2]: *** [CMakeFiles/Makefile2:1806: targets/enki-marxbot/CMakeFiles/asebamarxbot.dir/all] Error 2
make[2]: Leaving directory '/<<PKGBUILDDIR>>/obj-arm-linux-gnueabihf'
make[1]: *** [Makefile:144: all] Error 2
make[1]: Leaving directory '/<<PKGBUILDDIR>>/obj-arm-linux-gnueabihf'
dh_auto_build: cd obj-arm-linux-gnueabihf && make -j1 returned exit code 2
make: *** [debian/rules:14: build-arch] Error 255