Raspbian Package Auto-Building

Buildd status for appstream-generator, libundead, phast, gnome-mplayer, waylandpp, scamp (bullseye-staging)

Bugs

Package(s): Suite:
Compact mode Co-maintainers

Package armhf
Buildd exposure stats
✔ appstream-generatorBuild-Attempted
✔ libundeadBuild-Attempted
✘ phast  Build-Attempted
✘ gnome-mplayer  Build-Attempted
✔ waylandppInstalled
✘ scamp  Build-Attempted

Tail of log for appstream-generator on armhf:

../src/asgen/config.d:579:84: error: undefined identifier ‘JSONType’
  579 |                             feature.processLocale = featuresObj[featureId].type == JSONType.true_;
      |                                                                                    ^
../src/asgen/config.d:582:87: error: undefined identifier ‘JSONType’
  582 |                             feature.screenshotVideos = featuresObj[featureId].type == JSONType.true_;
      |                                                                                       ^
../src/asgen/config.d:585:97: error: undefined identifier ‘JSONType’
  585 |                             feature.propagateMetainfoArtifacts = featuresObj[featureId].type == JSONType.true_;
      |                                                                                                 ^
[45/157] gdc -Isrc/asgen/55ff84b@@appstream-generator@exe -Isrc/asgen -I../src/asgen -Isrc -I../src -Igirepo -I../girepo -I/usr/include/d/glibd-2 -I/usr/include/libmount -I/usr/include/blkid -I/usr/include/glib-2.0 -I/usr/lib/arm-linux-gnueabihf/glib-2.0/include -I/usr/include/appstream -I/usr/include/libsoup-2.4 -I/usr/include/libxml2 -I/usr/include/cairo -I/usr/include/pixman-1 -I/usr/include/uuid -I/usr/include/freetype2 -I/usr/include/libpng16 -I/usr/include/gdk-pixbuf-2.0 -I/usr/include/librsvg-2.0 -I/usr/include/pango-1.0 -I/usr/include/fribidi -I/usr/include/harfbuzz -g -O2 -fdebug-prefix-map=/<<PKGBUILDDIR>>=. -fstack-protector-strong -frelease -pthread -J../src/asgen/../../data -MD -MQ 'src/asgen/55ff84b@@appstream-generator@exe/.._app.d.o' -MF 'src/asgen/55ff84b@@appstream-generator@exe/.._app.d.o.deps' -o 'src/asgen/55ff84b@@appstream-generator@exe/.._app.d.o' -c ../src/app.d
[46/157] gdc -Isrc/asgen/55ff84b@@appstream-generator@exe -Isrc/asgen -I../src/asgen -Isrc -I../src -Igirepo -I../girepo -I/usr/include/d/glibd-2 -I/usr/include/libmount -I/usr/include/blkid -I/usr/include/glib-2.0 -I/usr/lib/arm-linux-gnueabihf/glib-2.0/include -I/usr/include/appstream -I/usr/include/libsoup-2.4 -I/usr/include/libxml2 -I/usr/include/cairo -I/usr/include/pixman-1 -I/usr/include/uuid -I/usr/include/freetype2 -I/usr/include/libpng16 -I/usr/include/gdk-pixbuf-2.0 -I/usr/include/librsvg-2.0 -I/usr/include/pango-1.0 -I/usr/include/fribidi -I/usr/include/harfbuzz -g -O2 -fdebug-prefix-map=/<<PKGBUILDDIR>>=. -fstack-protector-strong -frelease -pthread -J../src/asgen/../../data -MD -MQ 'src/asgen/55ff84b@@appstream-generator@exe/datainjectpkg.d.o' -MF 'src/asgen/55ff84b@@appstream-generator@exe/datainjectpkg.d.o.deps' -o 'src/asgen/55ff84b@@appstream-generator@exe/datainjectpkg.d.o' -c ../src/asgen/datainjectpkg.d
[47/157] gdc -Isrc/asgen/55ff84b@@appstream-generator@exe -Isrc/asgen -I../src/asgen -Isrc -I../src -Igirepo -I../girepo -I/usr/include/d/glibd-2 -I/usr/include/libmount -I/usr/include/blkid -I/usr/include/glib-2.0 -I/usr/lib/arm-linux-gnueabihf/glib-2.0/include -I/usr/include/appstream -I/usr/include/libsoup-2.4 -I/usr/include/libxml2 -I/usr/include/cairo -I/usr/include/pixman-1 -I/usr/include/uuid -I/usr/include/freetype2 -I/usr/include/libpng16 -I/usr/include/gdk-pixbuf-2.0 -I/usr/include/librsvg-2.0 -I/usr/include/pango-1.0 -I/usr/include/fribidi -I/usr/include/harfbuzz -g -O2 -fdebug-prefix-map=/<<PKGBUILDDIR>>=. -fstack-protector-strong -frelease -pthread -J../src/asgen/../../data -MD -MQ 'src/asgen/55ff84b@@appstream-generator@exe/contentsstore.d.o' -MF 'src/asgen/55ff84b@@appstream-generator@exe/contentsstore.d.o.deps' -o 'src/asgen/55ff84b@@appstream-generator@exe/contentsstore.d.o' -c ../src/asgen/contentsstore.d
ninja: build stopped: subcommand failed.
dh_auto_build: error: cd obj-arm-linux-gnueabihf && LC_ALL=C.UTF-8 ninja -j4 -v returned exit code 1
make: *** [debian/rules:18: binary-arch] Error 25

Tail of log for libundead on armhf:

/<<PKGBUILDDIR>>/src/undead/stream.d:1222:16: error: generic thunk code fails for method ‘_DT12_D6undead6stream6Stream6writefMFYC6undead6stream12OutputStream’ which uses ‘...’
 1222 |   OutputStream writef(...) {
      |                ^
/<<PKGBUILDDIR>>/src/undead/stream.d:1207:10: error: generic thunk code fails for method ‘_DT12_D6undead6stream6Stream6printfMFAxaYk’ which uses ‘...’
 1207 |   size_t printf(const(char)[] format, ...) {
      |          ^
/<<PKGBUILDDIR>>/src/undead/stream.d:1069:7: error: generic thunk code fails for method ‘_DT8_D6undead6stream6Stream5readfMFYi’ which uses ‘...’
 1069 |   int readf(...) {
      |       ^
[3/29] gdc -Iundead@sha -I. -I.. -I../src -g -O2 -fdebug-prefix-map=/<<PKGBUILDDIR>>=. -fstack-protector-strong -frelease -fPIC -MD -MQ 'undead@sha/src_undead_bitarray.d.o' -MF 'undead@sha/src_undead_bitarray.d.o.deps' -o 'undead@sha/src_undead_bitarray.d.o' -c ../src/undead/bitarray.d
[4/29] gdc -Iundead@sha -I. -I.. -I../src -g -O2 -fdebug-prefix-map=/<<PKGBUILDDIR>>=. -fstack-protector-strong -frelease -fPIC -MD -MQ 'undead@sha/src_undead_dateparse.d.o' -MF 'undead@sha/src_undead_dateparse.d.o.deps' -o 'undead@sha/src_undead_dateparse.d.o' -c ../src/undead/dateparse.d
[5/29] gdc -Iundead@sha -I. -I.. -I../src -g -O2 -fdebug-prefix-map=/<<PKGBUILDDIR>>=. -fstack-protector-strong -frelease -fPIC -MD -MQ 'undead@sha/src_undead_date.d.o' -MF 'undead@sha/src_undead_date.d.o.deps' -o 'undead@sha/src_undead_date.d.o' -c ../src/undead/date.d
ninja: build stopped: subcommand failed.
dh_auto_build: error: cd obj-arm-linux-gnueabihf && LC_ALL=C.UTF-8 ninja -j4 -v returned exit code 1
make: *** [debian/rules:9: build-arch] Error 25

Tail of log for phast on armhf:

Done.
make[2]: Leaving directory '/<<BUILDDIR>>/phast-1.5+dfsg/src'
make[1]: Leaving directory '/<<BUILDDIR>>/phast-1.5+dfsg'
   debian/rules override_dh_auto_test
make[1]: Entering directory '/<<BUILDDIR>>/phast-1.5+dfsg'
cd test && PATH=/<<BUILDDIR>>/phast-1.5+dfsg/bin:/usr/local/sbin:/usr/local/bin:/usr/sbin:/usr/bin:/sbin:/bin:/usr/games make msa_view
make[2]: Entering directory '/<<BUILDDIR>>/phast-1.5+dfsg/test'
*** Testing msa_view ***
msa_view hmrc.ss -i SS --end 10000 > hmrc.fa
make[2]: *** wait: No child processes.  Stop.
make[2]: *** Waiting for unfinished jobs....
make[2]: *** wait: No child processes.  Stop.
E: Caught signal ‘Terminated’: terminating immediately
make: *** [debian/rules:8: build-arch] Terminated
make[1]: *** [debian/rules:16: override_dh_auto_test] Terminated

BinNMU changelog for gnome-mplayer on armhf:

rebuild due to debcheck failure

Tail of log for gnome-mplayer on armhf:

      |          ^~~~~~~~~~~~~~~~~~
gcc -fPIC -pthread -I/usr/include/nautilus -I/usr/include/gtk-3.0 -I/usr/include/at-spi2-atk/2.0 -I/usr/include/at-spi-2.0 -I/usr/include/dbus-1.0 -I/usr/lib/arm-linux-gnueabihf/dbus-1.0/include -I/usr/include/gtk-3.0 -I/usr/include/gio-unix-2.0 -I/usr/include/cairo -I/usr/include/pango-1.0 -I/usr/include/fribidi -I/usr/include/harfbuzz -I/usr/include/atk-1.0 -I/usr/include/cairo -I/usr/include/pixman-1 -I/usr/include/uuid -I/usr/include/freetype2 -I/usr/include/libpng16 -I/usr/include/gdk-pixbuf-2.0 -I/usr/include/libmount -I/usr/include/blkid -I/usr/include/glib-2.0 -I/usr/lib/arm-linux-gnueabihf/glib-2.0/include -pthread -I/usr/include/gtk-3.0 -I/usr/include/at-spi2-atk/2.0 -I/usr/include/at-spi-2.0 -I/usr/include/dbus-1.0 -I/usr/lib/arm-linux-gnueabihf/dbus-1.0/include -I/usr/include/gtk-3.0 -I/usr/include/gio-unix-2.0 -I/usr/include/cairo -I/usr/include/pango-1.0 -I/usr/include/fribidi -I/usr/include/harfbuzz -I/usr/include/atk-1.0 -I/usr/include/cairo -I/usr/include/pixman-1 -I/usr/include/uuid -I/usr/include/freetype2 -I/usr/include/libpng16 -I/usr/include/gdk-pixbuf-2.0 -I/usr/include/libmount -I/usr/include/blkid -I/usr/include/glib-2.0 -I/usr/lib/arm-linux-gnueabihf/glib-2.0/include -pthread -I/usr/include/libmount -I/usr/include/blkid -I/usr/include/glib-2.0 -I/usr/lib/arm-linux-gnueabihf/glib-2.0/include -Wall -g   -DGIO_ENABLED -DHAVE_ASOUNDLIB  -DNOTIFY_ENABLED -DHAVE_GPOD -DGPOD_07 -DHAVE_MUSICBRAINZ -DLIBGDA_05 -g -O2 -fdebug-prefix-map=/<<PKGBUILDDIR>>=. -fstack-protector-strong -Wformat -Werror=format-security -shared -Wl,-z,relro -Wl,--as-needed -o libgnome-mplayer-properties-page.so libgnome_mplayer_properties_page_so-nautilus_property_page.o libgnome_mplayer_properties_page_so-property_page_common.o -lnautilus-extension -lgtk-3 -lgdk-3 -lpangocairo-1.0 -lpango-1.0 -lharfbuzz -latk-1.0 -lcairo-gobject -lcairo -lgdk_pixbuf-2.0 -lgio-2.0 -lgobject-2.0 -lglib-2.0 -lgtk-3 -lgdk-3 -lpangocairo-1.0 -lpango-1.0 -lharfbuzz -latk-1.0 -lcairo-gobject -lcairo -lgdk_pixbuf-2.0 -lgio-2.0 -lgobject-2.0 -lgthread-2.0 -pthread -lglib-2.0 -lgmlib -lgio-2.0 -lgobject-2.0 -lglib-2.0 
/usr/bin/ld: libgnome_mplayer_properties_page_so-property_page_common.o:./src/property_page_common.h:48: multiple definition of `verbose'; libgnome_mplayer_properties_page_so-nautilus_property_page.o:./src/property_page_common.h:48: first defined here
collect2: error: ld returned 1 exit status
make[4]: *** [Makefile:757: libgnome-mplayer-properties-page.so] Error 1
make[4]: *** Waiting for unfinished jobs....
make[4]: Leaving directory '/<<PKGBUILDDIR>>/src'
make[3]: *** [Makefile:861: all-recursive] Error 1
make[3]: Leaving directory '/<<PKGBUILDDIR>>/src'
make[2]: *** [Makefile:631: all-recursive] Error 1
make[2]: Leaving directory '/<<PKGBUILDDIR>>'
make[1]: *** [Makefile:463: all] Error 2
make[1]: Leaving directory '/<<PKGBUILDDIR>>'
dh_auto_build: error: make -j4 returned exit code 2
make: *** [debian/rules:12: build-arch] Error 25

Tail of log for scamp on armhf:

# ERROR: 0
============================================================================
See tests/test-suite.log
Please report to astromatic@astromatic.net
============================================================================
make[4]: *** [Makefile:781: test-suite.log] Error 1
make[4]: Leaving directory '/<<PKGBUILDDIR>>/tests'
make[3]: *** [Makefile:889: check-TESTS] Error 2
make[3]: Leaving directory '/<<PKGBUILDDIR>>/tests'
make[2]: *** [Makefile:991: check-am] Error 2
make[2]: Leaving directory '/<<PKGBUILDDIR>>/tests'
make[1]: *** [Makefile:535: check-recursive] Error 1
make[1]: Leaving directory '/<<PKGBUILDDIR>>'
dh_auto_test: error: make -j4 check VERBOSE=1 returned exit code 2
make: *** [debian/rules:7: binary-arch] Error 25