Raspbian Package Auto-Building

Buildd status for appstream-generator (bullseye-staging)

Debian PTSTrackerChangelogBugspackages.d.obuildd.d.o

Package(s): Suite:
Compact mode Co-maintainers

ArchitectureVersionStatusForBuilddStateMiscLogs
Buildd exposure stats armhf  0.8.2-2Build-Attempted39d 56mtest2019uncompiledmisc:optionalold | all (3)

Tail of log for appstream-generator on armhf:

../src/asgen/config.d:579:84: error: undefined identifier ‘JSONType’
  579 |                             feature.processLocale = featuresObj[featureId].type == JSONType.true_;
      |                                                                                    ^
../src/asgen/config.d:582:87: error: undefined identifier ‘JSONType’
  582 |                             feature.screenshotVideos = featuresObj[featureId].type == JSONType.true_;
      |                                                                                       ^
../src/asgen/config.d:585:97: error: undefined identifier ‘JSONType’
  585 |                             feature.propagateMetainfoArtifacts = featuresObj[featureId].type == JSONType.true_;
      |                                                                                                 ^
[45/157] gdc -Isrc/asgen/55ff84b@@appstream-generator@exe -Isrc/asgen -I../src/asgen -Isrc -I../src -Igirepo -I../girepo -I/usr/include/d/glibd-2 -I/usr/include/libmount -I/usr/include/blkid -I/usr/include/glib-2.0 -I/usr/lib/arm-linux-gnueabihf/glib-2.0/include -I/usr/include/appstream -I/usr/include/libsoup-2.4 -I/usr/include/libxml2 -I/usr/include/cairo -I/usr/include/pixman-1 -I/usr/include/uuid -I/usr/include/freetype2 -I/usr/include/libpng16 -I/usr/include/gdk-pixbuf-2.0 -I/usr/include/librsvg-2.0 -I/usr/include/pango-1.0 -I/usr/include/fribidi -I/usr/include/harfbuzz -g -O2 -fdebug-prefix-map=/<<PKGBUILDDIR>>=. -fstack-protector-strong -frelease -pthread -J../src/asgen/../../data -MD -MQ 'src/asgen/55ff84b@@appstream-generator@exe/.._app.d.o' -MF 'src/asgen/55ff84b@@appstream-generator@exe/.._app.d.o.deps' -o 'src/asgen/55ff84b@@appstream-generator@exe/.._app.d.o' -c ../src/app.d
[46/157] gdc -Isrc/asgen/55ff84b@@appstream-generator@exe -Isrc/asgen -I../src/asgen -Isrc -I../src -Igirepo -I../girepo -I/usr/include/d/glibd-2 -I/usr/include/libmount -I/usr/include/blkid -I/usr/include/glib-2.0 -I/usr/lib/arm-linux-gnueabihf/glib-2.0/include -I/usr/include/appstream -I/usr/include/libsoup-2.4 -I/usr/include/libxml2 -I/usr/include/cairo -I/usr/include/pixman-1 -I/usr/include/uuid -I/usr/include/freetype2 -I/usr/include/libpng16 -I/usr/include/gdk-pixbuf-2.0 -I/usr/include/librsvg-2.0 -I/usr/include/pango-1.0 -I/usr/include/fribidi -I/usr/include/harfbuzz -g -O2 -fdebug-prefix-map=/<<PKGBUILDDIR>>=. -fstack-protector-strong -frelease -pthread -J../src/asgen/../../data -MD -MQ 'src/asgen/55ff84b@@appstream-generator@exe/datainjectpkg.d.o' -MF 'src/asgen/55ff84b@@appstream-generator@exe/datainjectpkg.d.o.deps' -o 'src/asgen/55ff84b@@appstream-generator@exe/datainjectpkg.d.o' -c ../src/asgen/datainjectpkg.d
[47/157] gdc -Isrc/asgen/55ff84b@@appstream-generator@exe -Isrc/asgen -I../src/asgen -Isrc -I../src -Igirepo -I../girepo -I/usr/include/d/glibd-2 -I/usr/include/libmount -I/usr/include/blkid -I/usr/include/glib-2.0 -I/usr/lib/arm-linux-gnueabihf/glib-2.0/include -I/usr/include/appstream -I/usr/include/libsoup-2.4 -I/usr/include/libxml2 -I/usr/include/cairo -I/usr/include/pixman-1 -I/usr/include/uuid -I/usr/include/freetype2 -I/usr/include/libpng16 -I/usr/include/gdk-pixbuf-2.0 -I/usr/include/librsvg-2.0 -I/usr/include/pango-1.0 -I/usr/include/fribidi -I/usr/include/harfbuzz -g -O2 -fdebug-prefix-map=/<<PKGBUILDDIR>>=. -fstack-protector-strong -frelease -pthread -J../src/asgen/../../data -MD -MQ 'src/asgen/55ff84b@@appstream-generator@exe/contentsstore.d.o' -MF 'src/asgen/55ff84b@@appstream-generator@exe/contentsstore.d.o.deps' -o 'src/asgen/55ff84b@@appstream-generator@exe/contentsstore.d.o' -c ../src/asgen/contentsstore.d
ninja: build stopped: subcommand failed.
dh_auto_build: error: cd obj-arm-linux-gnueabihf && LC_ALL=C.UTF-8 ninja -j4 -v returned exit code 1
make: *** [debian/rules:18: binary-arch] Error 25