Raspbian Package Auto-Building

Buildd status for apophenia (jessie-staging)

Debian PTSTrackerChangelogBugspackages.d.obuildd.d.o

Package(s): Suite:
Compact mode Co-maintainers

ArchitectureVersionStatusForBuilddStateMiscLogs
Buildd exposure stats armhf  0.999b+ds3-2Build-Attempted123d 16h 38mtestbuildduncompiledmisc:sourceold | all (11)

Tail of log for apophenia on armhf:

E: Caught signal ‘Terminated’: terminating immediately
Terminated
make[4]: *** Deleting file 'utilities_test.log'
make[4]: *** wait: No child processes.  Stop.
make[4]: *** Waiting for unfinished jobs....
make[4]: *** wait: No child processes.  Stop.
make[1]: *** wait: No child processes.  Stop.
make[1]: *** Waiting for unfinished jobs....
make[1]: *** wait: No child processes.  Stop.
Makefile:1545: recipe for target 'check-TESTS' failed
make[3]: *** [check-TESTS] Terminated
debian/rules:20: recipe for target 'build-arch' failed
make: *** [build-arch] Terminated
Makefile:1863: recipe for target 'check-am' failed
make[2]: *** [check-am] Terminated