Raspbian Package Auto-Building

Buildd status for selected packages (bullseye-staging)

Bugs

Package(s): Suite:
Compact mode Co-maintainers

Package armhf
Buildd exposure stats
✔ akonadi-import-wizardBD-Uninstallable
✔ akregatorBD-Uninstallable
✔ pim-sieve-editorBD-Uninstallable
✔ libkgapiBD-Uninstallable
✔ kalarmBD-Uninstallable
✔ kontactBD-Uninstallable
✔ kmailBD-Uninstallable
✔ kitineraryInstalled
✔ libkf5ksieveBD-Uninstallable
✔ mbox-importerBD-Uninstallable
✔ kf5-messagelibBD-Uninstallable
✔ grantlee-editorBD-Uninstallable
✔ kdepim-addonsBD-Uninstallable
✔ libkf5mailcommonBD-Uninstallable
✔ mldemosBD-Uninstallable
✔ srst2BD-Uninstallable
✔ pim-data-exporterBD-Uninstallable
✔ semidef-octBD-Uninstallable
✔ ulogdBD-Uninstallable
Package armhf
Buildd exposure stats
✔ xen-api-libsBD-Uninstallable
✔ libaugeas-rubyBD-Uninstallable
✘ discosnp  BD-Uninstallable
✔ paleomixBD-Uninstallable
✔ networkmanagementBD-Uninstallable
✔ foobillardBD-Uninstallable
✔ libfcgi-rubyBD-Uninstallable
✔ libfabricBD-Uninstallable
✔ fcitx-libpinyinBD-Uninstallable
✔ libnora-rubyBD-Uninstallable
✔ radare2-cutterBD-Uninstallable
✔ soyaBD-Uninstallable
✔ qtpfsguiBD-Uninstallable
✔ canuBD-Uninstallable
✘ fraqtive  BD-Uninstallable
✔ portslaveBD-Uninstallable
✔ guest-templatesBD-Uninstallable
✔ haskell-xml-html-qqBD-Uninstallable
✔ raconBD-Uninstallable
✔ fuse-umfuse-ext2BD-Uninstallable
Package armhf
Buildd exposure stats
✔ xhprofBD-Uninstallable
✔ binoBD-Uninstallable
✔ sikuliBD-Uninstallable
✔ sugar-hulahopBD-Uninstallable
✔ php-apcBD-Uninstallable
✔ salmonBD-Uninstallable
✔ godBD-Uninstallable
✔ qwtplot3dBD-Uninstallable
✔ fsm-liteBD-Uninstallable
✔ fuse-umfuse-fatBD-Uninstallable
✔ libkrb5-rubyBD-Uninstallable
✔ simpleitkBD-Uninstallable
✔ libdr-tarantool-perlBD-Uninstallable
✔ xserver-xorg-video-glideBD-Uninstallable
✔ openaisBD-Uninstallable
✔ gubbinsBD-Uninstallable
✔ wooBD-Uninstallable
✔ giiraBD-Uninstallable
✔ psortbBD-Uninstallable
✔ ncbi-vdbBD-Uninstallable
Package armhf
Buildd exposure stats
✔ viteBD-Uninstallable
✔ pyqwt3dBD-Uninstallable
✔ tpm-toolsBD-Uninstallable
✔ fw4splBD-Uninstallable
✔ libguac-client-vncBD-Uninstallable
✔ libopengl-rubyBD-Uninstallable
✔ blogiloBD-Uninstallable
✔ mod-proxy-htmlBD-Uninstallable
✔ openmsBD-Uninstallable
✔ trinityrnaseqBD-Uninstallable
✘ virtualjaguar  BD-Uninstallable
✔ libbiodBD-Uninstallable
✔ spadesBD-Uninstallable
✔ sambambaBD-Uninstallable
✔ rhmessagingBD-Uninstallable
✔ pep8-simulBD-Uninstallable
✔ unicyclerBD-Uninstallable
✔ libfusefs-rubyBD-Uninstallable
✔ linux-signedBD-Uninstallable
✔ nagios-pluginsBD-Uninstallable
Package armhf
Buildd exposure stats
✔ libuconv-rubyBD-Uninstallable
✔ libodbc-rubyBD-Uninstallable
✘ enki-aseba  BD-Uninstallable
✔ clangBD-Uninstallable
✔ haskell-termonadBD-Uninstallable
✔ quorumBD-Uninstallable
✔ opencryptokiBD-Uninstallable
✔ mingw32BD-Uninstallable
✔ arrayprobeBD-Uninstallable
✔ itksnapBD-Uninstallable
✔ simple-tpm-pk11BD-Uninstallable
✔ libguac-client-rdpBD-Uninstallable
✔ guacdBD-Uninstallable
✔ haskell-hledger-chartBD-Uninstallable
✔ ballBD-Uninstallable
✔ haskell-hledger-vtyBD-Uninstallable
✔ akonadiconsoleBD-Uninstallable
✔ fracplanetBD-Uninstallable
✔ openjdk-12BD-Uninstallable
✔ cracBD-Uninstallable
Package armhf
Buildd exposure stats
✔ freebayesBD-Uninstallable
✔ ginkgocadxBD-Uninstallable
✔ bpftraceBD-Uninstallable
✔ plastimatchBD-Uninstallable
✔ openscadBD-Uninstallable
✔ acl2BD-Uninstallable
✔ balboaBD-Uninstallable
✔ libseqlibBD-Uninstallable
✔ skesaBD-Uninstallable
✔ gammarayBD-Uninstallable
✔ libvcflibBD-Uninstallable
✔ cloudcompareBD-Uninstallable
✔ libmaxmind-db-reader-xs-perlBD-Uninstallable
✘ sigil  BD-Uninstallable
✔ debian-installerBD-Uninstallable
✘ fmit  BD-Uninstallable
✔ centrifugeBD-Uninstallable
✔ otbBD-Uninstallable
✔ deal.iiBD-Uninstallable
✔ aribaBD-Uninstallable
Package armhf
Buildd exposure stats
✔ haskell-hledger-uiInstalled
✔ haskell-hledger-webInstalled
✔ sdrangeloveBD-Uninstallable
✔ debug-meBD-Uninstallable
✔ nextcloud-desktopBD-Uninstallable
✔ kritaBD-Uninstallable
✔ gasicBD-Uninstallable
✔ goldencheetahBD-Uninstallable
✔ pyqt5webengineBD-Uninstallable
✘ mm3d  BD-Uninstallable
✔ openjdk-13BD-Uninstallable
✘ algobox  BD-Uninstallable
✔ deepin-movie-rebornBD-Uninstallable
✔ openemsBD-Uninstallable
✔ rust-clapInstalled
✔ rust-memsecBD-Uninstallable
✘ pysvn  BD-Uninstallable
✔ haskell-optparse-simpleInstalled
✔ haskell-brickInstalled
✔ haskell-yesod-staticInstalled
Package armhf
Buildd exposure stats
✔ qtwebview-opensource-srcBD-Uninstallable
✘ tetzle  BD-Uninstallable
✔ qmapshackBD-Uninstallable
✔ minimac4BD-Uninstallable
✔ qca2-plugin-osslBD-Uninstallable
✔ varnish-agentBD-Uninstallable
✔ qca-cyrus-saslBD-Uninstallable
✔ html5-parserInstalled
✔ kio-gdriveBD-Uninstallable
✔ kipi-pluginsBD-Uninstallable
✔ falkonBD-Uninstallable
✔ calibreBD-Uninstallable
✘ shelxle  BD-Uninstallable
✔ r-bioc-variantannotationInstalled
✔ r-bioc-dada2Build-Attempted
✔ r-bioc-rtracklayerInstalled
✔ r-bioc-genomicrangesInstalled
✔ liquidsoapInstalled
✔ r-bioc-shortreadInstalled
✔ r-bioc-biostringsInstalled
Package armhf
Buildd exposure stats
✔ r-bioc-tfbstoolsInstalled
✔ r-bioc-deseq2Installed
✔ r-bioc-bitseqInstalled
✔ r-bioc-cnerInstalled
✔ r-bioc-genomicalignmentsInstalled
✔ r-bioc-rsamtoolsInstalled
✔ r-bioc-biovizbaseInstalled

Dependency installability problem for akonadi-import-wizard on armhf:

akonadi-import-wizard build-depends on missing:
- libkf5mailcommon-dev:armhf (>= 4:19.08.3~)

Dependency installability problem for akregator on armhf:

akregator build-depends on missing:
- libkf5messageviewer-dev:armhf (>= 4:19.08.3~)

Dependency installability problem for pim-sieve-editor on armhf:

pim-sieve-editor build-depends on missing:
- libkf5ksieve-dev:armhf (>= 4:19.08.3~)

Dependency installability problem for libkgapi on armhf:

libkgapi build-depends on missing:
- qtwebengine5-dev:armhf (>= 5.11.0~)

Dependency installability problem for kalarm on armhf:

kalarm build-depends on missing:
- libkf5mailcommon-dev:armhf (>= 4:19.08.3~)

Dependency installability problem for kontact on armhf:

kontact build-depends on missing:
- qtwebengine5-dev:armhf (>= 5.11.0~)

Dependency installability problem for kmail on armhf:

kmail build-depends on missing:
- libkf5ksieve-dev:armhf (>= 4:19.08.3~)

Dependency installability problem for libkf5ksieve on armhf:

libkf5ksieve build-depends on missing:
- qtwebengine5-dev:armhf (>= 5.11.0~)

Dependency installability problem for mbox-importer on armhf:

mbox-importer build-depends on missing:
- libkf5mailcommon-dev:armhf (>= 4:19.08.3~)

Dependency installability problem for kf5-messagelib on armhf:

kf5-messagelib build-depends on missing:
- qtwebengine5-dev:armhf (>= 5.11.0~)

Dependency installability problem for grantlee-editor on armhf:

grantlee-editor build-depends on missing:
- libkf5messageviewer-dev:armhf (>= 4:19.08.3~)

Dependency installability problem for kdepim-addons on armhf:

kdepim-addons build-depends on missing:
- libkf5ksieve-dev:armhf (>= 4:19.08.3~)

Dependency installability problem for libkf5mailcommon on armhf:

libkf5mailcommon build-depends on missing:
- libkf5messagecomposer-dev:armhf (>= 4:19.08.3~)

Dependency installability problem for mldemos on armhf:

mldemos build-depends on missing:
- libqt5opengl5-desktop-dev:armhf

Dependency installability problem for srst2 on armhf:

srst2 build-depends on missing:
- bowtie2:armhf

Dependency installability problem for pim-data-exporter on armhf:

pim-data-exporter build-depends on missing:
- libkf5mailcommon-dev:armhf (>= 4:19.08.3~)

Dependency installability problem for semidef-oct on armhf:

semidef-oct build-depends on missing:
- octave3.2-headers:armhf

Dependency installability problem for ulogd on armhf:

ulogd build-depends on missing:
- libmysqlclient-dev:armhf

Dependency installability problem for xen-api-libs on armhf:

xen-api-libs build-depends on missing:
- libxen-ocaml-dev:armhf

Dependency installability problem for libaugeas-ruby on armhf:

libaugeas-ruby build-depends on missing:
- ruby1.8:armhf

Dependency installability problem for discosnp on armhf:

discosnp build-depends on missing:
- libgatbcore-dev:armhf (>= 1.4.1+git20180206.6f8fce8~)

Dependency installability problem for paleomix on armhf:

paleomix build-depends on missing:
- bowtie2:armhf

Dependency installability problem for networkmanagement on armhf:

networkmanagement build-depends on missing:
- kdelibs5-dev:armhf (>= 4:4.6.0)

Dependency installability problem for foobillard on armhf:

foobillard build-depends on missing:
- libpng3-dev:armhf

Dependency installability problem for libfcgi-ruby on armhf:

libfcgi-ruby build-depends on missing:
- ruby1.8:armhf

Dependency installability problem for libfabric on armhf:

libfabric build-depends on missing:
- libpsm-infinipath1-dev:armhf

Dependency installability problem for fcitx-libpinyin on armhf:

fcitx-libpinyin build-depends on missing:
- qtwebengine5-dev:armhf

Dependency installability problem for libnora-ruby on armhf:

libnora-ruby build-depends on missing:
- ruby1.8:armhf

Dependency installability problem for radare2-cutter on armhf:

radare2-cutter build-depends on missing:
- qtwebengine5-dev:armhf

Dependency installability problem for soya on armhf:

soya build-depends on missing:
- libode-sp-dev:armhf

Dependency installability problem for qtpfsgui on armhf:

qtpfsgui build-depends on missing:
- libtiff4-dev:armhf

Dependency installability problem for canu on armhf:

canu build-depends on:
- mhap:armhf (>= 2.1.3)
mhap depends on missing:
- libssw-java:armhf

Dependency installability problem for fraqtive on armhf:

fraqtive build-depends on missing:
- libqt5opengl5-desktop-dev:armhf

Dependency installability problem for portslave on armhf:

portslave build-depends on missing:
- libradius1-dev:armhf

Dependency installability problem for guest-templates on armhf:

guest-templates build-depends on missing:
- libxenapi-ocaml-dev:armhf

Dependency installability problem for haskell-xml-html-qq on armhf:

haskell-xml-html-qq build-depends on missing:
- libghc-heterocephalus-dev:armhf (>= 1.0.4.0)

Dependency installability problem for racon on armhf:

racon build-depends on missing:
- libspoa-dev:armhf

Dependency installability problem for fuse-umfuse-ext2 on armhf:

fuse-umfuse-ext2 build-depends on missing:
- libumlib-dev:armhf

Dependency installability problem for xhprof on armhf:

xhprof build-depends on missing:
- php5-dev:armhf (>= 5.2.0)

Dependency installability problem for bino on armhf:

bino build-depends on missing:
- libqt5opengl5-desktop-dev:armhf

Dependency installability problem for sikuli on armhf:

sikuli build-depends on missing:
- libjxgrabkey-doc:armhf

Dependency installability problem for sugar-hulahop on armhf:

sugar-hulahop build-depends on missing:
- python-xpcom:armhf (>= 1.9~rc2)

Dependency installability problem for php-apc on armhf:

php-apc build-depends on missing:
- php5-dev:armhf

Dependency installability problem for salmon on armhf:

salmon build-depends on missing:
- libjellyfish-2.0-dev:armhf (> 2.2.3-2)

Dependency installability problem for god on armhf:

god build-depends on missing:
- ruby1.8-dev:armhf

Dependency installability problem for qwtplot3d on armhf:

qwtplot3d build-depends on missing:
- libqt5opengl5-desktop-dev:armhf

Dependency installability problem for fsm-lite on armhf:

fsm-lite build-depends on missing:
- libsdsl-dev:armhf

Dependency installability problem for fuse-umfuse-fat on armhf:

fuse-umfuse-fat build-depends on missing:
- libumlib-dev:armhf

Dependency installability problem for libkrb5-ruby on armhf:

libkrb5-ruby build-depends on:
- ruby-pkg-tools:armhf (>= 0.17)
ruby-pkg-tools depends on missing:
- ruby1.8:armhf

Dependency installability problem for simpleitk on armhf:

simpleitk build-depends on missing:
- libinsighttoolkit4-dev:armhf (>= 4.11)

Dependency installability problem for libdr-tarantool-perl on armhf:

libdr-tarantool-perl build-depends on missing:
- tarantool-lts:armhf

Dependency installability problem for xserver-xorg-video-glide on armhf:

xserver-xorg-video-glide build-depends on missing:
- libglide3-dev:armhf

Dependency installability problem for openais on armhf:

openais build-depends on missing:
- libcorosync-dev:armhf (>= 1.1.0)

Dependency installability problem for gubbins on armhf:

gubbins build-depends on missing:
- raxml:armhf (>= 8)

Dependency installability problem for woo on armhf:

woo build-depends on missing:
- libqglviewer-dev-qt4:armhf

Dependency installability problem for giira on armhf:

giira build-depends on missing:
- bowtie2:armhf

Dependency installability problem for psortb on armhf:

psortb build-depends on missing:
- pftools:armhf

Dependency installability problem for ncbi-vdb on armhf:

ncbi-vdb build-depends on missing:
- libngs-sdk-dev:armhf

Dependency installability problem for vite on armhf:

vite build-depends on missing:
- libqt5opengl5-desktop-dev:armhf

Dependency installability problem for pyqwt3d on armhf:

pyqwt3d build-depends on missing:
- libqwtplot3d-qt5-dev:armhf

Dependency installability problem for tpm-tools on armhf:

tpm-tools build-depends on missing:
- libopencryptoki-dev:armhf

Dependency installability problem for fw4spl on armhf:

fw4spl build-depends on missing:
- libgdcm2-dev:armhf

Dependency installability problem for libguac-client-vnc on armhf:

libguac-client-vnc build-depends on missing:
- libguac-dev:armhf (>= 0.6)

Dependency installability problem for libopengl-ruby on armhf:

libopengl-ruby build-depends on:
- ruby-pkg-tools:armhf
ruby-pkg-tools depends on missing:
- ruby1.8:armhf

Dependency installability problem for blogilo on armhf:

blogilo build-depends on missing:
- libkf5webengineviewer-dev:armhf (>= 4:17.08.3~)

Dependency installability problem for mod-proxy-html on armhf:

mod-proxy-html build-depends on missing:
- apache2-prefork-dev:armhf (>= 2.2.22-5~)

Dependency installability problem for openms on armhf:

openms build-depends on missing:
- libqt5opengl5-desktop-dev:armhf (>= 5.7.0)

Dependency installability problem for trinityrnaseq on armhf:

trinityrnaseq build-depends on missing:
- jellyfish:armhf (>= 2.1.4)

Dependency installability problem for virtualjaguar on armhf:

virtualjaguar build-depends on missing:
- libqt5opengl5-desktop-dev:armhf

Dependency installability problem for libbiod on armhf:

libbiod build-depends on missing:
- libundead-dev:armhf

Dependency installability problem for spades on armhf:

spades build-depends on missing:
- libssw-dev:armhf

Dependency installability problem for sambamba on armhf:

sambamba build-depends on missing:
- libbiod-dev:armhf (>= 0.1.0-5)

Dependency installability problem for rhmessaging on armhf:

rhmessaging build-depends on missing:
- libqpidtypes1-dev:armhf (>= 0.12)

Dependency installability problem for pep8-simul on armhf:

pep8-simul build-depends on missing:
- qtwebengine5-dev:armhf

Dependency installability problem for unicycler on armhf:

unicycler build-depends on missing:
- bowtie2:armhf

Dependency installability problem for libfusefs-ruby on armhf:

libfusefs-ruby build-depends on:
- ruby-pkg-tools:armhf (>= 0.8)
ruby-pkg-tools depends on missing:
- ruby1.8:armhf

Dependency installability problem for linux-signed on armhf:

linux-signed build-depends on missing:
- linux-kbuild-4.9:armhf

Dependency installability problem for nagios-plugins on armhf:

nagios-plugins build-depends on missing:
- libmysqlclient-dev:armhf

Dependency installability problem for libuconv-ruby on armhf:

libuconv-ruby build-depends on missing:
- ruby1.9.1:armhf

Dependency installability problem for libodbc-ruby on armhf:

libodbc-ruby build-depends on:
- ruby-pkg-tools:armhf
ruby-pkg-tools depends on missing:
- ruby1.8:armhf

Dependency installability problem for enki-aseba on armhf:

enki-aseba build-depends on missing:
- libqt5opengl5-desktop-dev:armhf

Dependency installability problem for clang on armhf:

clang build-depends on missing:
- llvm-3.0-dev:armhf (>= 3.0)

Dependency installability problem for haskell-termonad on armhf:

haskell-termonad build-depends on missing:
- libghc-pretty-simple-dev:armhf

Dependency installability problem for quorum on armhf:

quorum build-depends on missing:
- libjellyfish-2.0-dev:armhf (>= 2.2.6-1~)

Dependency installability problem for opencryptoki on armhf:

opencryptoki build-depends on missing:
- libitm1:armhf

Dependency installability problem for mingw32 on armhf:

mingw32 build-depends on missing:
- mingw32-binutils:armhf

Dependency installability problem for arrayprobe on armhf:

arrayprobe build-depends on missing:
- linux-source-2.6:armhf

Dependency installability problem for itksnap on armhf:

itksnap build-depends on missing:
- libinsighttoolkit4-dev:armhf

Dependency installability problem for simple-tpm-pk11 on armhf:

simple-tpm-pk11 build-depends on missing:
- libopencryptoki-dev:armhf

Dependency installability problem for libguac-client-rdp on armhf:

libguac-client-rdp build-depends on missing:
- libguac-dev:armhf (>= 0.6)

Dependency installability problem for guacd on armhf:

guacd build-depends on missing:
- libguac-dev:armhf (>= 0.6)

Dependency installability problem for haskell-hledger-chart on armhf:

haskell-hledger-chart build-depends on missing:
- libghc-chart-dev:armhf (< 0.16)

Dependency installability problem for ball on armhf:

ball build-depends on missing:
- qtwebengine5-dev:armhf

Dependency installability problem for haskell-hledger-vty on armhf:

haskell-hledger-vty build-depends on missing:
- libghc-cmdargs-dev:armhf (< 0.10)

Dependency installability problem for akonadiconsole on armhf:

akonadiconsole build-depends on missing:
- libkf5messageviewer-dev:armhf (>= 4:19.08.3~)

Dependency installability problem for fracplanet on armhf:

fracplanet build-depends on missing:
- libqt5opengl5-desktop-dev:armhf

Dependency installability problem for openjdk-12 on armhf:

openjdk-12 build-depends on missing:
- openjdk-12-jdk-headless:armhf

Dependency installability problem for crac on armhf:

crac build-depends on missing:
- libjellyfish-2.0-dev:armhf

Dependency installability problem for freebayes on armhf:

freebayes build-depends on missing:
- libvcflib-dev:armhf (>= 1.0.0~rc2+dfsg-3~)

Dependency installability problem for ginkgocadx on armhf:

ginkgocadx build-depends on missing:
- libinsighttoolkit4-dev:armhf

Dependency installability problem for bpftrace on armhf:

bpftrace build-depends on missing:
- libbpfcc-dev:armhf

Dependency installability problem for plastimatch on armhf:

plastimatch build-depends on missing:
- libgdcm2-dev:armhf

Dependency installability problem for openscad on armhf:

openscad build-depends on missing:
- libcgal-qt5-dev:armhf

Dependency installability problem for acl2 on armhf:

acl2 build-depends on missing:
- emacs25:armhf

Dependency installability problem for balboa on armhf:

balboa build-depends on missing:
- librocksdb-dev:armhf (>= 5.15)

Dependency installability problem for libseqlib on armhf:

libseqlib build-depends on missing:
- libfml-dev:armhf (>= 0.1-3)

Dependency installability problem for skesa on armhf:

skesa build-depends on missing:
- libncbi-vdb-dev:armhf

Dependency installability problem for gammaray on armhf:

gammaray build-depends on missing:
- qtwebengine5-dev:armhf

Dependency installability problem for libvcflib on armhf:

libvcflib build-depends on missing:
- libssw-dev:armhf

Dependency installability problem for cloudcompare on armhf:

cloudcompare build-depends on missing:
- libcgal-qt5-dev:armhf

Dependency installability problem for libmaxmind-db-reader-xs-perl on armhf:

libmaxmind-db-reader-xs-perl build-depends on missing:
- libmath-int128-perl:armhf

Dependency installability problem for sigil on armhf:

sigil build-depends on missing:
- qtwebengine5-dev:armhf (>= 5.9.4)

Dependency installability problem for debian-installer on armhf:

debian-installer build-depends on missing:
- debian-archive-keyring:armhf (>= 2006.11.22) | debian-archive-keyring:armhf (>= 2006.11.22)

Dependency installability problem for fmit on armhf:

fmit build-depends on missing:
- libqt5opengl5-desktop-dev:armhf

Dependency installability problem for centrifuge on armhf:

centrifuge build-depends on missing:
- hisat2:armhf

Dependency installability problem for otb on armhf:

otb build-depends on missing:
- libinsighttoolkit4-dev:armhf

Dependency installability problem for deal.ii on armhf:

deal.ii build-depends on missing:
- libp4est-dev:armhf (>= 2.0)

Dependency installability problem for ariba on armhf:

ariba build-depends on missing:
- bowtie2:armhf (>= 2.1.0)

Dependency installability problem for sdrangelove on armhf:

sdrangelove build-depends on missing:
- libqt5opengl5-desktop-dev:armhf

Dependency installability problem for debug-me on armhf:

debug-me build-depends on missing:
- libghc-protobuf-dev:armhf (>= 0.2)

Dependency installability problem for nextcloud-desktop on armhf:

nextcloud-desktop build-depends on missing:
- qtwebengine5-dev:armhf (>= 5.6~)

Dependency installability problem for krita on armhf:

krita build-depends on missing:
- libqt5opengl5-desktop-dev:armhf

Dependency installability problem for gasic on armhf:

gasic build-depends on missing:
- bowtie2:armhf

Dependency installability problem for goldencheetah on armhf:

goldencheetah build-depends on missing:
- libqwtplot3d-qt5-dev:armhf

Dependency installability problem for pyqt5webengine on armhf:

pyqt5webengine build-depends on missing:
- qtwebengine5-dev:armhf

Dependency installability problem for mm3d on armhf:

mm3d build-depends on missing:
- libqt5opengl5-desktop-dev:armhf

Dependency installability problem for openjdk-13 on armhf:

openjdk-13 build-depends on missing:
- openjdk-13-jdk-headless:armhf

Dependency installability problem for algobox on armhf:

algobox build-depends on missing:
- qtwebengine5-dev:armhf

Dependency installability problem for deepin-movie-reborn on armhf:

deepin-movie-reborn build-depends on missing:
- libqt5opengl5-desktop-dev:armhf

Dependency installability problem for openems on armhf:

openems build-depends on missing:
- libcgal-qt5-dev:armhf

Dependency installability problem for rust-memsec on armhf:

rust-memsec build-depends on missing:
- librust-mach-o-sys-0.1+default-dev:armhf

Dependency installability problem for pysvn on armhf:

pysvn build-depends on missing:
- python-cxx-dev:armhf (>= 7.0.1)

Dependency installability problem for qtwebview-opensource-src on armhf:

qtwebview-opensource-src build-depends on missing:
- qtwebengine5-dev:armhf (>= 5.12.5+dfsg~)

Dependency installability problem for tetzle on armhf:

tetzle build-depends on missing:
- libqt5opengl5-desktop-dev:armhf

Dependency installability problem for qmapshack on armhf:

qmapshack build-depends on missing:
- qtwebengine5-dev:armhf

Dependency installability problem for minimac4 on armhf:

minimac4 build-depends on missing:
- libstatgen-dev:armhf

Dependency installability problem for qca2-plugin-ossl on armhf:

qca2-plugin-ossl build-depends on missing:
- libqca2-dev:armhf (>= 2.0.0)

Dependency installability problem for varnish-agent on armhf:

varnish-agent build-depends on missing:
- python-demjson:armhf

Dependency installability problem for qca-cyrus-sasl on armhf:

qca-cyrus-sasl build-depends on missing:
- libqca2-dev:armhf

Dependency installability problem for kio-gdrive on armhf:

kio-gdrive build-depends on missing:
- libkpimgapi-dev:armhf (>= 17.04.0~)

Dependency installability problem for kipi-plugins on armhf:

kipi-plugins build-depends on missing:
- libgphoto2-2-dev:armhf

Dependency installability problem for falkon on armhf:

falkon build-depends on missing:
- qtwebengine5-dev:armhf

Dependency installability problem for calibre on armhf:

calibre build-depends on missing:
- python-pyqt5.qtwebengine:armhf

Dependency installability problem for shelxle on armhf:

shelxle build-depends on missing:
- libqt5opengl5-desktop-dev:armhf

Tail of log for r-bioc-dada2 on armhf:

make[1]: Entering directory '/<<BUILDDIR>>/r-bioc-dada2-1.14.0+dfsg/src'
g++ -std=gnu++11 -I"/usr/share/R/include" -DNDEBUG  -I"/usr/lib/R/site-library/Rcpp/include" -I"/usr/lib/R/site-library/RcppParallel/include"   -fpic  -g -O2 -fdebug-prefix-map=/build/r-base-jEdEmw/r-base-3.6.1=. -fstack-protector-strong -Wformat -Werror=format-security -Wdate-time -D_FORTIFY_SOURCE=2 -g  -c RcppExports.cpp -o RcppExports.o
g++ -std=gnu++11 -I"/usr/share/R/include" -DNDEBUG  -I"/usr/lib/R/site-library/Rcpp/include" -I"/usr/lib/R/site-library/RcppParallel/include"   -fpic  -g -O2 -fdebug-prefix-map=/build/r-base-jEdEmw/r-base-3.6.1=. -fstack-protector-strong -Wformat -Werror=format-security -Wdate-time -D_FORTIFY_SOURCE=2 -g  -c Rmain.cpp -o Rmain.o
Rmain.cpp:7:10: fatal error: cpuid.h: No such file or directory
    7 | #include <cpuid.h>
      |          ^~~~~~~~~
compilation terminated.
make[1]: *** [/usr/lib/R/etc/Makeconf:176: Rmain.o] Error 1
make[1]: Leaving directory '/<<BUILDDIR>>/r-bioc-dada2-1.14.0+dfsg/src'
make[1]: Entering directory '/<<BUILDDIR>>/r-bioc-dada2-1.14.0+dfsg/src'
make[1]: Leaving directory '/<<BUILDDIR>>/r-bioc-dada2-1.14.0+dfsg/src'
ERROR: compilation failed for package 'dada2'
* removing '/<<BUILDDIR>>/r-bioc-dada2-1.14.0+dfsg/debian/r-bioc-dada2/usr/lib/R/site-library/dada2'
dh_auto_install: R CMD INSTALL -l /<<BUILDDIR>>/r-bioc-dada2-1.14.0\+dfsg/debian/r-bioc-dada2/usr/lib/R/site-library --clean . "--built-timestamp='Tue, 12 Nov 2019 00:07:38 +0100'" returned exit code 1
make: *** [debian/rules:4: binary-arch] Error 255