Raspbian Package Auto-Building

Buildd status for selected packages (bullseye-staging)

Bugs

Package(s): Suite:
Compact mode Co-maintainers

Package armhf
Buildd exposure stats
✘ afnix  Build-Attempted
✔ blastemBuild-Attempted
✔ bustoolsBuild-Attempted
✔ criuBuild-Attempted
✔ debimanBuild-Attempted
✔ fairy-stockfishBuild-Attempted
✔ ibamBuild-Attempted
✔ jocamlBuild-Attempted
✔ leela-zeroBuild-Attempted
✔ open-axiomBuild-Attempted
✔ openmmBuild-Attempted
✔ projectmBuild-Attempted
✔ r-bioc-rsubreadBuild-Attempted
✔ rust-mach-o-sysBuild-Attempted
✔ rust-servo-freetype-sysBuild-Attempted
✔ scrappieBuild-Attempted
✔ tarantoolBuild-Attempted
✔ vtBuild-Attempted
✔ pyfftwBuild-Attempted
Package armhf
Buildd exposure stats
✔ perftestBuild-Attempted
✔ nixBuild-Attempted
✔ cpp-hoconInstalled

Tail of log for afnix on armhf:

rm -rf bld
dh_clean
make[1]: Leaving directory '/<<PKGBUILDDIR>>'
   dh_clean
 debian/rules build-arch
dh build-arch
   dh_update_autotools_config -a
   dh_autoreconf -a
   debian/rules override_dh_auto_configure
make[1]: Entering directory '/<<PKGBUILDDIR>>'
./cnf/bin/afnix-setup -o --prefix=/usr
afnix-setup: cannot find compiler file error: cannot find version for compiler gcc
make[1]: *** [debian/rules:14: override_dh_auto_configure] Error 1
make[1]: Leaving directory '/<<PKGBUILDDIR>>'
make: *** [debian/rules:11: build-arch] Error 2

Tail of log for blastem on armhf:

      |                                                                     ~~~~~~~~~^~~
z80_to_x86.c: In function 'zremove_breakpoint':
z80_to_x86.c:3872:22: warning: assignment to 'code_ptr' {aka 'unsigned int *'} from incompatible pointer type 'uint8_t *' {aka 'unsigned char *'} [-Wincompatible-pointer-types]
 3872 |   opts->gen.code.cur = native;
      |                      ^
z80_to_x86.c:3873:23: warning: assignment to 'code_ptr' {aka 'unsigned int *'} from incompatible pointer type 'uint8_t *' {aka 'unsigned char *'} [-Wincompatible-pointer-types]
 3873 |   opts->gen.code.last = native + 128;
      |                       ^
make[2]: *** [Makefile:356: z80_to_x86.o] Error 1
make[2]: *** Waiting for unfinished jobs....
make[2]: Leaving directory '/<<PKGBUILDDIR>>'
dh_auto_build: error: make -j4 "INSTALL=install --strip-program=true" HOST_ZLIB=1 CONFIG_PATH=/etc/blastem DATA_PATH=/usr/share/games/blastem returned exit code 2
make[1]: *** [debian/rules:10: override_dh_auto_build] Error 25
make[1]: Leaving directory '/<<PKGBUILDDIR>>'
make: *** [debian/rules:7: binary-arch] Error 2

Tail of log for bustools on armhf:

   73 | inline size_t rndup(size_t v) {
      |               ^~~~~
make[4]: *** [src/CMakeFiles/bustools_core.dir/build.make:79: src/CMakeFiles/bustools_core.dir/Common.cpp.o] Error 1
make[4]: *** Waiting for unfinished jobs....
make[4]: *** [src/CMakeFiles/bustools_core.dir/build.make:92: src/CMakeFiles/bustools_core.dir/bustools_capture.cpp.o] Error 1
make[4]: *** [src/CMakeFiles/bustools_core.dir/build.make:105: src/CMakeFiles/bustools_core.dir/bustools_correct.cpp.o] Error 1
make[4]: Leaving directory '/<<PKGBUILDDIR>>/obj-arm-linux-gnueabihf'
make[3]: *** [CMakeFiles/Makefile2:126: src/CMakeFiles/bustools_core.dir/all] Error 2
make[3]: Leaving directory '/<<PKGBUILDDIR>>/obj-arm-linux-gnueabihf'
make[2]: *** [Makefile:133: all] Error 2
make[2]: Leaving directory '/<<PKGBUILDDIR>>/obj-arm-linux-gnueabihf'
dh_auto_build: error: cd obj-arm-linux-gnueabihf && make -j4 "INSTALL=install --strip-program=true" returned exit code 2
make[1]: *** [debian/rules:17: override_dh_auto_build] Error 25
make[1]: Leaving directory '/<<PKGBUILDDIR>>'
make: *** [debian/rules:9: binary-arch] Error 2

Tail of log for criu on armhf:

  192 | #define PTRACE_SETSIGMASK PTRACE_SETSIGMASK
      | 
In file included from include/protobuf.h:8,
                 from arch/arm/crtools.c:9:
include/util.h: In function 'kdev_to_odev':
include/util.h:158:9: error: implicit declaration of function 'makedev' [-Werror=implicit-function-declaration]
  158 |  return makedev(major, minor);
      |         ^~~~~~~
cc1: all warnings being treated as errors
make[2]: *** [scripts/Makefile.build:185: arch/arm/crtools.o] Error 1
make[2]: Leaving directory '/<<PKGBUILDDIR>>'
make[1]: *** [Makefile:208: arch/arm] Error 2
make[1]: Leaving directory '/<<PKGBUILDDIR>>'
dh_auto_build: error: make -j4 returned exit code 2
make: *** [debian/rules:6: build-arch] Error 25

Tail of log for debiman on armhf:

--- PASS: TestCronSection (0.00s)
    --- PASS: TestCronSection/cron (0.00s)
PASS
ok  	github.com/Debian/debiman/internal/redirect	0.176s
=== RUN   TestSitemap
--- PASS: TestSitemap (0.00s)
=== RUN   TestSitemapIndex
--- PASS: TestSitemapIndex (0.00s)
PASS
ok  	github.com/Debian/debiman/internal/sitemap	0.019s
?   	github.com/Debian/debiman/internal/tag	[no test files]
?   	github.com/Debian/debiman/internal/write	[no test files]
FAIL
dh_auto_test: error: cd obj-arm-linux-gnueabihf && go test -vet=off -v -p 4 github.com/Debian/debiman github.com/Debian/debiman/cmd/debiman github.com/Debian/debiman/cmd/debiman-auxserver github.com/Debian/debiman/cmd/debiman-idx2rwmap github.com/Debian/debiman/cmd/debiman-minisrv github.com/Debian/debiman/internal/auxserver github.com/Debian/debiman/internal/bundled github.com/Debian/debiman/internal/commontmpl github.com/Debian/debiman/internal/convert github.com/Debian/debiman/internal/manpage github.com/Debian/debiman/internal/proto github.com/Debian/debiman/internal/recode github.com/Debian/debiman/internal/redirect github.com/Debian/debiman/internal/sitemap github.com/Debian/debiman/internal/tag github.com/Debian/debiman/internal/write returned exit code 1
make: *** [debian/rules:4: binary-arch] Error 25

Tail of log for fairy-stockfish on armhf:

/usr/bin/ld: /usr/include/c++/10/bits/atomic_base.h:426: undefined reference to `__atomic_load_8'
/usr/bin/ld: /tmp/stockfish.svZ7Id.ltrans6.ltrans.o: in function `UCI::loop(int, char**)':
/usr/include/c++/10/bits/atomic_base.h:426: undefined reference to `__atomic_load_8'
/usr/bin/ld: /tmp/stockfish.svZ7Id.ltrans9.ltrans.o: in function `ThreadPool::start_thinking(Position&, std::unique_ptr<std::deque<StateInfo, std::allocator<StateInfo> >, std::default_delete<std::deque<StateInfo, std::allocator<StateInfo> > > >&, Search::LimitsType const&, bool) [clone .constprop.0]':
/usr/include/c++/10/bits/atomic_base.h:404: undefined reference to `__atomic_store_8'
/usr/bin/ld: /usr/include/c++/10/bits/atomic_base.h:404: undefined reference to `__atomic_store_8'
collect2: error: ld returned 1 exit status
make[3]: *** [Makefile:516: stockfish] Error 1
make[3]: Leaving directory '/<<PKGBUILDDIR>>/src'
make[2]: *** [Makefile:433: build] Error 2
make[2]: Leaving directory '/<<PKGBUILDDIR>>/src'
dh_auto_build: error: cd src && make -j4 build ARCH=general-32 returned exit code 2
make[1]: *** [debian/rules:105: override_dh_auto_build] Error 25
make[1]: Leaving directory '/<<PKGBUILDDIR>>'
make: *** [debian/rules:99: build-arch] Error 2

Tail of log for ibam on armhf:

make[1]: Entering directory '/<<PKGBUILDDIR>>'
make[1]: 'ibam-krell.so' is up to date.
make[1]: Leaving directory '/<<PKGBUILDDIR>>'
touch build-stamp
dh_testdir
dh_testroot
dh_clean
dh_clean: warning: Compatibility levels before 10 are deprecated (level 7 in use)
dh_installdirs
dh_installdirs: warning: Compatibility levels before 10 are deprecated (level 7 in use)
# Add here commands to install the package into debian/tmp.
install -m0755 ibam `pwd`/debian/ibam/usr/bin
install -m0644 ibam-krell.so `pwd`/debian/gkrellm-ibam/usr/lib/gkrellm2/plugins
install: cannot create regular file '/<<PKGBUILDDIR>>/debian/gkrellm-ibam/usr/lib/gkrellm2/plugins': No such file or directory
make: *** [debian/rules:58: install] Error 1

Tail of log for jocaml on armhf:

|---
| tools/ocamlmklib.ml | 5 +++++
| 1 file changed, 5 insertions(+)
|
|diff --git a/tools/ocamlmklib.ml b/tools/ocamlmklib.ml
|index b5c0aee..b4e45d1 100644
|--- a/tools/ocamlmklib.ml
|+++ b/tools/ocamlmklib.ml
--------------------------
No file to patch.  Skipping patch.
1 out of 1 hunk ignored
Patch debian/patches/0003-Don-t-use-rpath.patch does not apply (enforce with -f)
make[1]: *** [debian/rules:22: override_dh_auto_configure] Error 1
make[1]: Leaving directory '/<<PKGBUILDDIR>>'
make: *** [debian/rules:85: build-arch] Error 2

Tail of log for leela-zero on armhf:

/usr/include/c++/10/bits/atomic_base.h:426: undefined reference to `__atomic_load_8'
/usr/bin/ld: /usr/include/c++/10/bits/atomic_base.h:426: undefined reference to `__atomic_load_8'
/usr/bin/ld: /usr/include/c++/10/bits/atomic_base.h:426: undefined reference to `__atomic_load_8'
/usr/bin/ld: /usr/include/c++/10/bits/atomic_base.h:426: undefined reference to `__atomic_load_8'
/usr/bin/ld: /usr/include/c++/10/bits/atomic_base.h:426: undefined reference to `__atomic_load_8'
/usr/bin/ld: CMakeFiles/objs.dir/src/UCTNodePointer.cpp.o:/usr/include/c++/10/bits/atomic_base.h:426: more undefined references to `__atomic_load_8' follow
collect2: error: ld returned 1 exit status
make[3]: *** [CMakeFiles/tests.dir/build.make:158: tests] Error 1
make[3]: Leaving directory '/<<PKGBUILDDIR>>/obj-arm-linux-gnueabihf'
make[2]: *** [CMakeFiles/Makefile2:189: CMakeFiles/tests.dir/all] Error 2
make[2]: Leaving directory '/<<PKGBUILDDIR>>/obj-arm-linux-gnueabihf'
make[1]: *** [Makefile:155: all] Error 2
make[1]: Leaving directory '/<<PKGBUILDDIR>>/obj-arm-linux-gnueabihf'
dh_auto_build: error: cd obj-arm-linux-gnueabihf && make -j4 "INSTALL=install --strip-program=true" returned exit code 2
make: *** [debian/rules:15: build-arch] Error 25

Tail of log for open-axiom on armhf:

/* confdefs.h */
#define PACKAGE_NAME "OpenAxiom"
#define PACKAGE_TARNAME "openaxiom"
#define PACKAGE_VERSION "1.5.0-2013-06-21"
#define PACKAGE_STRING "OpenAxiom 1.5.0-2013-06-21"
#define PACKAGE_BUGREPORT "open-axiom-bugs@lists.sf.net"
#define PACKAGE_URL ""
#define PACKAGE "openaxiom"
#define VERSION "1.5.0-2013-06-21"
#define OPENAXIOM_BASE_RTS Runtime::sbcl

configure: exit 1
dh_auto_configure: error: cd build-tree && ../configure --build=arm-linux-gnueabihf --prefix=/usr --includedir=\${prefix}/include --mandir=\${prefix}/share/man --infodir=\${prefix}/share/info --sysconfdir=/etc --localstatedir=/var --disable-option-checking --disable-silent-rules --libexecdir=\${prefix}/lib/open-axiom --disable-maintainer-mode --disable-dependency-tracking --with-lisp=sbcl --with-x --disable-gcl returned exit code 1
make: *** [debian/rules:50: configure-stamp] Error 25

Tail of log for openmm on armhf:

In file included from /<<BUILDDIR>>/openmm-7.4.0.491.gac5a8f71+dfsg/libraries/vecmath/src/vecmath.cpp:2:
/<<BUILDDIR>>/openmm-7.4.0.491.gac5a8f71+dfsg/libraries/vecmath/include/neon_mathfun.h:53:25: note: called from here
   53 |   v4sf one = vdupq_n_f32(1);
      |              ~~~~~~~~~~~^~~
make[4]: *** [CMakeFiles/OpenMM.dir/build.make:2523: CMakeFiles/OpenMM.dir/libraries/vecmath/src/vecmath.cpp.o] Error 1
make[4]: *** Waiting for unfinished jobs....
make[4]: Leaving directory '/<<BUILDDIR>>/openmm-7.4.0.491.gac5a8f71+dfsg/obj-arm-linux-gnueabihf'
make[3]: *** [CMakeFiles/Makefile2:1393: CMakeFiles/OpenMM.dir/all] Error 2
make[3]: Leaving directory '/<<BUILDDIR>>/openmm-7.4.0.491.gac5a8f71+dfsg/obj-arm-linux-gnueabihf'
make[2]: *** [Makefile:144: all] Error 2
make[2]: Leaving directory '/<<BUILDDIR>>/openmm-7.4.0.491.gac5a8f71+dfsg/obj-arm-linux-gnueabihf'
dh_auto_build: error: cd obj-arm-linux-gnueabihf && make -j4 "INSTALL=install --strip-program=true" returned exit code 2
make[1]: *** [debian/rules:31: override_dh_auto_build] Error 25
make[1]: Leaving directory '/<<BUILDDIR>>/openmm-7.4.0.491.gac5a8f71+dfsg'
make: *** [debian/rules:25: binary-arch] Error 2

Tail of log for projectm on armhf:

qprojectm_mainwindow.cpp:551:3: note: here
  551 |   case Qt::Key_L:
      |   ^~~~
make[5]: *** [Makefile:533: qprojectm_mainwindow.o] Error 1
make[5]: Leaving directory '/<<PKGBUILDDIR>>/src/projectM-qt'
make[4]: *** [Makefile:454: all] Error 2
make[4]: Leaving directory '/<<PKGBUILDDIR>>/src/projectM-qt'
make[3]: *** [Makefile:458: all-recursive] Error 1
make[3]: Leaving directory '/<<PKGBUILDDIR>>/src'
make[2]: *** [Makefile:526: all-recursive] Error 1
make[2]: Leaving directory '/<<PKGBUILDDIR>>'
make[1]: *** [Makefile:416: all] Error 2
make[1]: Leaving directory '/<<PKGBUILDDIR>>'
dh_auto_build: error: make -j4 returned exit code 2
make: *** [debian/rules:9: binary-arch] Error 25

Tail of log for r-bioc-rsubread on armhf:

/usr/include/stdint.h:96:23: error: conflicting types for 'uintptr_t'
   96 | typedef unsigned int  uintptr_t;
      |                       ^~~~~~~~~
In file included from R_wrapper.c:30:
/usr/share/R/include/Rinterface.h:110:24: note: previous declaration of 'uintptr_t' was here
  110 |  typedef unsigned long uintptr_t;
      |                        ^~~~~~~~~
make[1]: *** [/usr/lib/R/etc/Makeconf:167: R_wrapper.o] Error 1
make[1]: Leaving directory '/<<PKGBUILDDIR>>/src'
make[1]: Entering directory '/<<PKGBUILDDIR>>/src'
make[1]: Leaving directory '/<<PKGBUILDDIR>>/src'
ERROR: compilation failed for package 'Rsubread'
* removing '/<<PKGBUILDDIR>>/debian/r-bioc-rsubread/usr/lib/R/site-library/Rsubread'
dh_auto_install: error: R CMD INSTALL -l /<<PKGBUILDDIR>>/debian/r-bioc-rsubread/usr/lib/R/site-library --clean . "--built-timestamp='Wed, 12 Aug 2020 10:25:43 +0200'" returned exit code 1
make: *** [debian/rules:4: binary-arch] Error 25

Tail of log for rust-mach-o-sys on armhf:

Caused by:
  process didn't exit successfully: `CARGO=/usr/bin/cargo CARGO_PKG_VERSION_MINOR=1 CARGO_PKG_VERSION_PATCH=1 CARGO_PKG_HOMEPAGE= LD_LIBRARY_PATH='/<<PKGBUILDDIR>>/target/debug/deps:/usr/lib' CARGO_PKG_AUTHORS='Nick Fitzgerald <fitzgen@gmail.com>' CARGO_PKG_VERSION_MAJOR=0 CARGO_PKG_VERSION=0.1.1 CARGO_PKG_VERSION_PRE= CARGO_PKG_NAME=mach_o_sys CARGO_MANIFEST_DIR=/<<PKGBUILDDIR>> CARGO_PKG_REPOSITORY='https://github.com/fitzgen/mach_o_sys' CARGO_PKG_DESCRIPTION='Bindings to the OSX mach-o system library' rustc --crate-name mach_o_sys src/lib.rs --error-format=json --json=diagnostic-rendered-ansi --crate-type lib --emit=dep-info,metadata,link -C debuginfo=2 -C metadata=54e05a23b9e7b924 -C extra-filename=-54e05a23b9e7b924 --out-dir /<<PKGBUILDDIR>>/target/arm-unknown-linux-gnueabihf/debug/deps --target arm-unknown-linux-gnueabihf -C incremental=/<<PKGBUILDDIR>>/target/arm-unknown-linux-gnueabihf/debug/incremental -L dependency=/<<PKGBUILDDIR>>/target/arm-unknown-linux-gnueabihf/debug/deps -L dependency=/<<PKGBUILDDIR>>/target/debug/deps -C debuginfo=2 --cap-lints warn -C linker=arm-linux-gnueabihf-gcc -C link-arg=-Wl,-z,relro --remap-path-prefix /<<PKGBUILDDIR>>=/usr/share/cargo/registry/mach-o-sys-0.1.1` (exit code: 1)
warning: build failed, waiting for other jobs to finish...
error: aborting due to 130 previous errors

For more information about this error, try `rustc --explain E0600`.
error: could not compile `mach_o_sys`.

Caused by:
  process didn't exit successfully: `CARGO=/usr/bin/cargo CARGO_PKG_VERSION_MINOR=1 CARGO_PKG_VERSION_PATCH=1 CARGO_PKG_HOMEPAGE= LD_LIBRARY_PATH='/<<PKGBUILDDIR>>/target/debug/deps:/usr/lib' CARGO_PKG_AUTHORS='Nick Fitzgerald <fitzgen@gmail.com>' CARGO_PKG_VERSION_MAJOR=0 CARGO_PKG_VERSION=0.1.1 CARGO_PKG_VERSION_PRE= CARGO_PKG_NAME=mach_o_sys CARGO_MANIFEST_DIR=/<<PKGBUILDDIR>> CARGO_PKG_REPOSITORY='https://github.com/fitzgen/mach_o_sys' CARGO_PKG_DESCRIPTION='Bindings to the OSX mach-o system library' rustc --crate-name mach_o_sys src/lib.rs --error-format=json --json=diagnostic-rendered-ansi --emit=dep-info,link -C debuginfo=2 --test -C metadata=c1f25cab3e8f5708 -C extra-filename=-c1f25cab3e8f5708 --out-dir /<<PKGBUILDDIR>>/target/arm-unknown-linux-gnueabihf/debug/deps --target arm-unknown-linux-gnueabihf -C incremental=/<<PKGBUILDDIR>>/target/arm-unknown-linux-gnueabihf/debug/incremental -L dependency=/<<PKGBUILDDIR>>/target/arm-unknown-linux-gnueabihf/debug/deps -L dependency=/<<PKGBUILDDIR>>/target/debug/deps -C debuginfo=2 --cap-lints warn -C linker=arm-linux-gnueabihf-gcc -C link-arg=-Wl,-z,relro --remap-path-prefix /<<PKGBUILDDIR>>=/usr/share/cargo/registry/mach-o-sys-0.1.1` (exit code: 1)
dh_auto_test: error: /usr/share/cargo/bin/cargo test --all returned exit code 101
make[1]: *** [debian/rules:6: override_dh_auto_test] Error 25
make[1]: Leaving directory '/<<PKGBUILDDIR>>'
make: *** [debian/rules:3: build-arch] Error 2

Tail of log for rust-servo-freetype-sys on armhf:

             at src/libstd/panicking.rs:281
  22: std::panic::catch_unwind
             at src/libstd/panic.rs:394
  23: std::rt::lang_start_internal
             at src/libstd/rt.rs:51
  24: std::rt::lang_start
             at /usr/src/rustc-1.43.0/src/libstd/rt.rs:67
  25: main
  26: __libc_start_main
note: Some details are omitted, run with `RUST_BACKTRACE=full` for a verbose backtrace.

dh_auto_test: error: /usr/share/cargo/bin/cargo test --all returned exit code 101
make[1]: *** [debian/rules:6: override_dh_auto_test] Error 25
make[1]: Leaving directory '/<<PKGBUILDDIR>>'
make: *** [debian/rules:3: build-arch] Error 2

Tail of log for scrappie on armhf:

                 from /<<PKGBUILDDIR>>/src/decode.c:3:
/<<PKGBUILDDIR>>/src/scrappie_matrix.h:5:14: fatal error: immintrin.h: No such file or directory
    5 | #    include <immintrin.h>
      |              ^~~~~~~~~~~~~
compilation terminated.
make[4]: *** [CMakeFiles/scrappie_objects.dir/build.make:63: CMakeFiles/scrappie_objects.dir/src/decode.c.o] Error 1
make[4]: Leaving directory '/<<PKGBUILDDIR>>/build'
make[3]: *** [CMakeFiles/Makefile2:85: CMakeFiles/scrappie_objects.dir/all] Error 2
make[3]: Leaving directory '/<<PKGBUILDDIR>>/build'
make[2]: *** [Makefile:163: all] Error 2
make[2]: Leaving directory '/<<PKGBUILDDIR>>/build'
make[1]: *** [Makefile:21: build/scrappie] Error 2
make[1]: Leaving directory '/<<PKGBUILDDIR>>'
dh_auto_build: error: make -j4 "INSTALL=install --strip-program=true" returned exit code 2
make: *** [debian/rules:9: binary-arch] Error 25

Tail of log for tarantool on armhf:

      |    ^~~~~
/<<PKGBUILDDIR>>/third_party/coro/coro.c:480:14: error: 'NUM_SAVED' undeclared (first use in this function)
  480 |   ctx->sp -= NUM_SAVED;
      |              ^~~~~~~~~
/<<PKGBUILDDIR>>/third_party/coro/coro.c:480:14: note: each undeclared identifier is reported only once for each function it appears in
/<<PKGBUILDDIR>>/third_party/coro/coro.c:494:4: error: #error unsupported architecture
  494 |   #error unsupported architecture
      |    ^~~~~
make[3]: *** [CMakeFiles/coro.dir/build.make:66: CMakeFiles/coro.dir/third_party/coro/coro.c.o] Error 1
make[3]: Leaving directory '/<<PKGBUILDDIR>>/obj-arm-linux-gnueabihf'
make[2]: *** [CMakeFiles/Makefile2:815: CMakeFiles/coro.dir/all] Error 2
make[2]: Leaving directory '/<<PKGBUILDDIR>>/obj-arm-linux-gnueabihf'
make[1]: *** [Makefile:155: all] Error 2
make[1]: Leaving directory '/<<PKGBUILDDIR>>/obj-arm-linux-gnueabihf'
make: *** [/usr/share/cdbs/1/class/makefile.mk:77: debian/stamp-makefile-build] Error 2

Tail of log for vt on armhf:

testing decompose_blocksub of phased even-length blocks
             output VCF file : ok
             output logs     : ok
++++++++++++++++++++++
Tests for vt decompose
++++++++++++++++++++++
testing decompose for a triallelic variant
             output VCF file : ok
             output logs     : ok

Passed tests : 4 / 5
make[1]: *** [Makefile:164: test] Error 1
make[1]: Leaving directory '/<<BUILDDIR>>/vt-0.57721+ds'
dh_auto_test: error: make -j4 test returned exit code 2
make: *** [debian/rules:8: binary-arch] Error 25

Tail of log for pyfftw on armhf:

One run: 19.44 ms (versus 65.11 ms for singled threaded)
One run: 21.61 ms (versus 65.10 ms for singled threaded)
One run: 70.56 ms (versus 86.39 ms for numpy.fft)
One run: 72.20 ms (versus 90.63 ms for numpy.fft)
One run: 28.57 ms (versus 112.49 ms for numpy.fft)
One run: 28.37 ms (versus 112.33 ms for numpy.fft)
One run: 70.88 ms (versus 61.93 ms for numpy.fft)
One run: 70.66 ms (versus 61.82 ms for numpy.fft)
One run: 35.94 ms (versus 78.88 ms for numpy.fft)
One run: 36.37 ms (versus 78.81 ms for numpy.fft)
E: pybuild pybuild:352: test: plugin distutils failed with: exit code=1: cd /<<PKGBUILDDIR>>/.pybuild/cpython3_3.8_pyfftw/build; python3.8 -m unittest discover -v 
dh_auto_test: error: pybuild --test -i python{version} -p 3.8 returned exit code 13
make[1]: *** [debian/rules:35: override_dh_auto_test] Error 1
make[1]: Leaving directory '/<<PKGBUILDDIR>>'
make: *** [debian/rules:14: build-arch] Error 2

Tail of log for perftest on armhf:

                 from src/perftest_communication.h:45,
                 from src/perftest_communication.c:17:
src/get_clock.h:109:2: warning: #warning get_cycles not implemented for this architecture: attempt asm/timex.h [-Wcpp]
  109 | #warning get_cycles not implemented for this architecture: attempt asm/timex.h
      |  ^~~~~~~
src/get_clock.h:110:10: fatal error: asm/timex.h: No such file or directory
  110 | #include <asm/timex.h>
      |          ^~~~~~~~~~~~~
compilation terminated.
make[2]: *** [Makefile:857: src/perftest_communication.o] Error 1
make[2]: Leaving directory '/<<BUILDDIR>>/perftest-4.4+0.29'
make[1]: *** [Makefile:581: all] Error 2
make[1]: Leaving directory '/<<BUILDDIR>>/perftest-4.4+0.29'
dh_auto_build: error: make -j4 returned exit code 2
make: *** [debian/rules:7: binary-arch] Error 25

Tail of log for nix on armhf:

/usr/include/c++/10/bits/vector.tcc:121:21: note: parameter passing for argument of type '__gnu_cxx::__normal_iterator<nlohmann::basic_json<>*, std::vector<nlohmann::basic_json<>, std::allocator<nlohmann::basic_json<> > > >' changed in GCC 7.1
  121 |    _M_realloc_insert(end(), std::forward<_Args>(__args)...);
      |    ~~~~~~~~~~~~~~~~~^~~~~~~~~~~~~~~~~~~~~~~~~~~~~~~~~~~~~~~
g++ -std=c++17 -o /<<BUILDDIR>>/nix-2.3.7+dfsg1/src/libutil/libnixutil.so -shared -L/usr/lib/arm-linux-gnueabihf -Wl,-z,relro -Wl,-z,now -L/usr/lib/arm-linux-gnueabihf -Wl,-z,relro -Wl,-z,now -Wl,--no-copy-dt-needed-entries src/libutil/affinity.o src/libutil/archive.o src/libutil/args.o src/libutil/compression.o src/libutil/config.o src/libutil/hash.o src/libutil/json.o src/libutil/logging.o src/libutil/serialise.o src/libutil/thread-pool.o src/libutil/util.o src/libutil/xml-writer.o -llzma -lbz2 -pthread -lcrypto -lbrotlienc -lbrotlidec -L/usr/lib/arm-linux-gnueabihf -lboost_context -Wl,-z,defs -Wl,-soname=libnixutil.so   
/usr/bin/ld: /usr/bin/ld: DWARF error: could not find variable specification at offset 417e9
/usr/bin/ld: DWARF error: could not find variable specification at offset 41ca2
src/libutil/logging.o: in function `std::__atomic_base<unsigned long long>::fetch_add(unsigned long long, std::memory_order)':
/usr/include/c++/10/bits/atomic_base.h:548: undefined reference to `__atomic_fetch_add_8'
g++ -std=c++17 -o src/libstore/local-store.o -c src/libstore/local-store.cc -fstack-protector-strong -Wformat -Werror=format-security -g -Wall -include config.h -Wdate-time -D_FORTIFY_SOURCE=2 -fPIC -g -I . -I src -I src/libutil -I src/libstore -I src/libmain -I src/libexpr -I src/nix  -DREADLINE -I/usr/include/arm-linux-gnueabihf -I/usr/include -g -O2 -fdebug-prefix-map=/<<BUILDDIR>>/nix-2.3.7+dfsg1=. -fstack-protector-strong -Wformat -Werror=format-security -DNIX_PREFIX=\"/usr\" -DNIX_STORE_DIR=\"/nix/store\" -DNIX_DATA_DIR=\"/usr/share\" -DNIX_STATE_DIR=\"/nix/var/nix\" -DNIX_LOG_DIR=\"/nix/var/log/nix\" -DNIX_CONF_DIR=\"/etc/nix\" -DNIX_LIBEXEC_DIR=\"/usr/libexec\" -DNIX_BIN_DIR=\"/usr/bin\" -DNIX_MAN_DIR=\"/usr/share/man\" -DLSOF=\"lsof\" -MMD -MF src/libstore/.local-store.o.dep -MP
collect2: error: ld returned 1 exit status
make[1]: *** [mk/lib.mk:104: src/libutil/libnixutil.so] Error 1
make[1]: *** Waiting for unfinished jobs....
make[1]: Leaving directory '/<<BUILDDIR>>/nix-2.3.7+dfsg1'
dh_auto_build: error: make -j4 returned exit code 2
make: *** [debian/rules:31: build-arch] Error 25