Raspbian Package Auto-Building

Buildd status for acovea (wheezy-staging)

Debian PTSTrackerChangelogBugspackages.d.obuildd.d.o

Package(s): Suite:
Compact mode Co-maintainers

ArchitectureVersionStatusForBuilddStateMiscLogs
Buildd exposure stats armhf  5.1.1-2.1Build-Attempted1348d 21hbm-wb-01uncompileddevel:sourceold | all (5)

Tail of log for acovea on armhf:

acovea.h:549:25: error: 'm_fitness' was not declared in this scope
acovea.h:549:53: error: 'a_right.libevocosm::organism<acovea::chromosome>::fitness' cannot be used as a function
acovea.h: At global scope:
acovea.h:630:5: warning: 'typedef' was ignored in this declaration [enabled by default]
acovea.h:636:5: warning: 'typedef' was ignored in this declaration [enabled by default]
acovea.h:639:5: error: expected class-name before '{' token
acovea.h:734:44: error: expected template-name before '<' token
acovea.h:734:44: error: expected '{' before '<' token
acovea.h:734:44: error: expected unqualified-id before '<' token
acovea.cpp:1981:1: error: expected '}' at end of input
make[2]: *** [acovea.lo] Error 1
make[2]: Leaving directory `/<<PKGBUILDDIR>>/libacovea'
make[1]: *** [all-recursive] Error 1
make[1]: Leaving directory `/<<PKGBUILDDIR>>'
make: *** [build-stamp] Error 2