Raspbian Package Auto-Building

Buildd status for 3dldf (stretch-staging)

Debian PTSTrackerChangelogBugspackages.d.obuildd.d.o

Package(s): Suite:
Compact mode Co-maintainers

ArchitectureVersionStatusForBuilddStateMiscLogs
Buildd exposure stats armhf  2.0.3+dfsg-5Build-Attempted902d 12h 34mmb-lxc-01uncompiledmisc:sourceold | all (8)

Tail of log for 3dldf on armhf:

terminate called after throwing an instance of 'std::bad_alloc'
  what():  std::bad_alloc
./runit: line 76:  5620 Aborted                 (core dumped) ./3dldf sample2.ldf
Makefile:1678: recipe for target 'sample2.mp' failed
make[3]: *** [sample2.mp] Error 134
make[3]: Leaving directory '/<<BUILDDIR>>/3dldf-2.0.3+dfsg/src'
Makefile:786: recipe for target 'check-am' failed
make[2]: *** [check-am] Error 2
make[2]: Leaving directory '/<<BUILDDIR>>/3dldf-2.0.3+dfsg/src'
Makefile:546: recipe for target 'check-recursive' failed
make[1]: *** [check-recursive] Error 1
make[1]: Leaving directory '/<<BUILDDIR>>/3dldf-2.0.3+dfsg'
dh_auto_test: make -j1 check VERBOSE=1 returned exit code 2
debian/rules:9: recipe for target 'build-arch' failed
make: *** [build-arch] Error 2