Raspbian Package Auto-Building

Build log for xhprof (0.9.4-1) on armhf

xhprof0.9.4-1armhf → 2014-11-27 04:45:48

sbuild (Debian sbuild) 0.63.2 (18 Aug 2012) on bm-wb-03

║ xhprof 0.9.4-1 (armhf)                                     27 Nov 2014 04:39 ║

Package: xhprof
Version: 0.9.4-1
Source Version: 0.9.4-1
Distribution: jessie-staging
Machine Architecture: armhf
Host Architecture: armhf
Build Architecture: armhf

I: NOTICE: Log filtering will replace 'build/xhprof-n2Ow_V/xhprof-0.9.4' with '«PKGBUILDDIR»'
I: NOTICE: Log filtering will replace 'build/xhprof-n2Ow_V' with '«BUILDDIR»'
I: NOTICE: Log filtering will replace 'var/lib/schroot/mount/jessie-staging-armhf-sbuild-a867b0fd-5141-45ea-af02-f573f47d3463' with '«CHROOT»'

│ Update chroot                                                                │

Get:1 jessie-staging InRelease [11.3 kB]
Get:2 jessie-staging/main Sources [7716 kB]
Get:3 jessie-staging/main armhf Packages [8942 kB]
Ign jessie-staging/main Translation-en
Fetched 16.7 MB in 30s (542 kB/s)
Reading package lists...

│ Fetch source files                                                           │

Check APT

Checking available source versions...

Download source files with APT

Reading package lists...
Building dependency tree...
Reading state information...
Need to get 846 kB of source archives.
Get:1 jessie-staging/main xhprof 0.9.4-1 (dsc) [1109 B]
Get:2 jessie-staging/main xhprof 0.9.4-1 (tar) [841 kB]
Get:3 jessie-staging/main xhprof 0.9.4-1 (diff) [3523 B]
Fetched 846 kB in 0s (2790 kB/s)
Download complete and in download only mode

Check arch

Merged Build-Depends: build-essential, fakeroot
Filtered Build-Depends: build-essential, fakeroot
dpkg-deb: building package `sbuild-build-depends-core-dummy' in `/«BUILDDIR»/resolver-gpXpBp/apt_archive/sbuild-build-depends-core-dummy.deb'.
Reading package lists...

│ Install core build dependencies (apt-based resolver)                         │

Installing build dependencies
Reading package lists...
Building dependency tree...
Reading state information...
The following NEW packages will be installed:
debconf: delaying package configuration, since apt-utils is not installed
0 upgraded, 1 newly installed, 0 to remove and 71 not upgraded.
Need to get 0 B/812 B of archives.
After this operation, 0 B of additional disk space will be used.
Selecting previously unselected package sbuild-build-depends-core-dummy.
(Reading database ... 11075 files and directories currently installed.)
Preparing to unpack .../sbuild-build-depends-core-dummy.deb ...
Unpacking sbuild-build-depends-core-dummy (0.invalid.0) ...
Setting up sbuild-build-depends-core-dummy (0.invalid.0) ...
Merged Build-Depends: libc6-dev | libc-dev, gcc (>= 4:4.9.1), g++ (>= 4:4.9.1), make, dpkg-dev (>= 1.17.11), debhelper (>= 8), dpkg-dev (>= 1.16.1~), php5-dev (>= 5.2.0)
Filtered Build-Depends: libc6-dev, gcc (>= 4:4.9.1), g++ (>= 4:4.9.1), make, dpkg-dev (>= 1.17.11), debhelper (>= 8), dpkg-dev (>= 1.16.1~), php5-dev (>= 5.2.0)
dpkg-deb: building package `sbuild-build-depends-xhprof-dummy' in `/«BUILDDIR»/resolver-dXx7T6/apt_archive/sbuild-build-depends-xhprof-dummy.deb'.
Reading package lists...

│ Install xhprof build dependencies (apt-based resolver)                       │

Installing build dependencies
Reading package lists...
Building dependency tree...
Reading state information...
The following extra packages will be installed:
  autoconf automake autotools-dev bsdmainutils debhelper dpkg-dev file gettext
  gettext-base groff-base intltool-debian libasprintf0c2 libcroco3
  libdpkg-perl libffi6 libglib2.0-0 libmagic1 libpcre3 libpcre3-dev
  libpcrecpp0 libperl4-corelibs-perl libpipeline1 libsigsegv2 libssl-dev
  libssl1.0.0 libtool libunistring0 libxml2 lsof m4 man-db php5-common
  php5-dev po-debconf psmisc shtool ucf zlib1g-dev
Suggested packages:
  autoconf-archive gnu-standards autoconf-doc wamerican wordlist whois
  vacation dh-make debian-keyring gettext-doc groff libtool-doc automaken
  gfortran fortran95-compiler gcj-jdk less www-browser php5-user-cache
Recommended packages:
  libalgorithm-merge-perl curl wget lynx-cur autopoint libasprintf-dev
  libgettextpo-dev libfile-fcntllock-perl libglib2.0-data shared-mime-info
  xdg-user-dirs libssl-doc libltdl-dev xml-core pkg-php-tools dh-php5
The following NEW packages will be installed:
  autoconf automake autotools-dev bsdmainutils debhelper file gettext
  gettext-base groff-base intltool-debian libasprintf0c2 libcroco3 libffi6
  libglib2.0-0 libmagic1 libpcre3-dev libpcrecpp0 libperl4-corelibs-perl
  libpipeline1 libsigsegv2 libssl-dev libssl1.0.0 libtool libunistring0
  libxml2 lsof m4 man-db php5-common php5-dev po-debconf psmisc
  sbuild-build-depends-xhprof-dummy shtool ucf zlib1g-dev
The following packages will be upgraded:
  dpkg-dev libdpkg-perl libpcre3
3 upgraded, 36 newly installed, 0 to remove and 68 not upgraded.
Need to get 17.1 MB/17.1 MB of archives.
After this operation, 43.9 MB of additional disk space will be used.
Get:1 jessie-staging/main libpcre3 armhf 1:8.35-3.1 [299 kB]
Get:2 jessie-staging/main libpipeline1 armhf 1.4.0-1 [24.0 kB]
Get:3 jessie-staging/main libssl1.0.0 armhf 1.0.1j-1 [843 kB]
Get:4 jessie-staging/main groff-base armhf 1.22.2-8 [1045 kB]
Get:5 jessie-staging/main bsdmainutils armhf 9.0.6 [177 kB]
Get:6 jessie-staging/main man-db armhf [972 kB]
Get:7 jessie-staging/main libasprintf0c2 armhf 0.19.3-1 [30.9 kB]
Get:8 jessie-staging/main libmagic1 armhf 1:5.20-2 [239 kB]
Get:9 jessie-staging/main libxml2 armhf 2.9.1+dfsg1-4 [698 kB]
Get:10 jessie-staging/main libffi6 armhf 3.1-2 [18.1 kB]
Get:11 jessie-staging/main libglib2.0-0 armhf 2.42.0-2 [2333 kB]
Get:12 jessie-staging/main libcroco3 armhf 0.6.8-3 [121 kB]
Get:13 jessie-staging/main libpcrecpp0 armhf 1:8.35-3.1 [139 kB]
Get:14 jessie-staging/main libsigsegv2 armhf 2.10-4 [28.2 kB]
Get:15 jessie-staging/main libunistring0 armhf 0.9.3-5.2 [253 kB]
Get:16 jessie-staging/main file armhf 1:5.20-2 [58.0 kB]
Get:17 jessie-staging/main gettext-base armhf 0.19.3-1 [116 kB]
Get:18 jessie-staging/main libperl4-corelibs-perl all 0.003-1 [43.6 kB]
Get:19 jessie-staging/main lsof armhf 4.86+dfsg-1 [321 kB]
Get:20 jessie-staging/main m4 armhf 1.4.17-4 [238 kB]
Get:21 jessie-staging/main ucf all 3.0030 [69.7 kB]
Get:22 jessie-staging/main autoconf all 2.69-8 [340 kB]
Get:23 jessie-staging/main autotools-dev all 20140911.1 [70.5 kB]
Get:24 jessie-staging/main automake all 1:1.14.1-4 [725 kB]
Get:25 jessie-staging/main dpkg-dev all 1.17.21 [1502 kB]
Get:26 jessie-staging/main libdpkg-perl all 1.17.21 [1038 kB]
Get:27 jessie-staging/main gettext armhf 0.19.3-1 [1168 kB]
Get:28 jessie-staging/main intltool-debian all 0.35.0+20060710.1 [29.8 kB]
Get:29 jessie-staging/main po-debconf all 1.0.16+nmu3 [220 kB]
Get:30 jessie-staging/main debhelper all 9.20141022 [812 kB]
Get:31 jessie-staging/main libpcre3-dev armhf 1:8.35-3.1 [411 kB]
Get:32 jessie-staging/main zlib1g-dev armhf 1:1.2.8.dfsg-1+rpi1 [192 kB]
Get:33 jessie-staging/main libssl-dev armhf 1.0.1j-1 [1081 kB]
Get:34 jessie-staging/main libtool all 2.4.2-1.11 [190 kB]
Get:35 jessie-staging/main psmisc armhf 22.21-2 [117 kB]
Get:36 jessie-staging/main php5-common armhf 5.6.2+dfsg-1 [668 kB]
Get:37 jessie-staging/main shtool all 2.0.8-6 [159 kB]
Get:38 jessie-staging/main php5-dev armhf 5.6.2+dfsg-1 [354 kB]
debconf: delaying package configuration, since apt-utils is not installed
Fetched 17.1 MB in 4s (3838 kB/s)
(Reading database ... 11075 files and directories currently installed.)
Preparing to unpack .../libpcre3_1%3a8.35-3.1_armhf.deb ...
Unpacking libpcre3:armhf (1:8.35-3.1) over (1:8.35-3) ...
Setting up libpcre3:armhf (1:8.35-3.1) ...
Processing triggers for libc-bin (2.19-11) ...
Selecting previously unselected package libpipeline1:armhf.
(Reading database ... 11075 files and directories currently installed.)
Preparing to unpack .../libpipeline1_1.4.0-1_armhf.deb ...
Unpacking libpipeline1:armhf (1.4.0-1) ...
Selecting previously unselected package libssl1.0.0:armhf.
Preparing to unpack .../libssl1.0.0_1.0.1j-1_armhf.deb ...
Unpacking libssl1.0.0:armhf (1.0.1j-1) ...
Selecting previously unselected package groff-base.
Preparing to unpack .../groff-base_1.22.2-8_armhf.deb ...
Unpacking groff-base (1.22.2-8) ...
Selecting previously unselected package bsdmainutils.
Preparing to unpack .../bsdmainutils_9.0.6_armhf.deb ...
Unpacking bsdmainutils (9.0.6) ...
Selecting previously unselected package man-db.
Preparing to unpack .../man-db_2.7.0.2-3_armhf.deb ...
Unpacking man-db ( ...
Selecting previously unselected package libasprintf0c2:armhf.
Preparing to unpack .../libasprintf0c2_0.19.3-1_armhf.deb ...
Unpacking libasprintf0c2:armhf (0.19.3-1) ...
Selecting previously unselected package libmagic1:armhf.
Preparing to unpack .../libmagic1_1%3a5.20-2_armhf.deb ...
Unpacking libmagic1:armhf (1:5.20-2) ...
Selecting previously unselected package libxml2:armhf.
Preparing to unpack .../libxml2_2.9.1+dfsg1-4_armhf.deb ...
Unpacking libxml2:armhf (2.9.1+dfsg1-4) ...
Selecting previously unselected package libffi6:armhf.
Preparing to unpack .../libffi6_3.1-2_armhf.deb ...
Unpacking libffi6:armhf (3.1-2) ...
Selecting previously unselected package libglib2.0-0:armhf.
Preparing to unpack .../libglib2.0-0_2.42.0-2_armhf.deb ...
Unpacking libglib2.0-0:armhf (2.42.0-2) ...
Selecting previously unselected package libcroco3:armhf.
Preparing to unpack .../libcroco3_0.6.8-3_armhf.deb ...
Unpacking libcroco3:armhf (0.6.8-3) ...
Selecting previously unselected package libpcrecpp0:armhf.
Preparing to unpack .../libpcrecpp0_1%3a8.35-3.1_armhf.deb ...
Unpacking libpcrecpp0:armhf (1:8.35-3.1) ...
Selecting previously unselected package libsigsegv2:armhf.
Preparing to unpack .../libsigsegv2_2.10-4_armhf.deb ...
Unpacking libsigsegv2:armhf (2.10-4) ...
Selecting previously unselected package libunistring0:armhf.
Preparing to unpack .../libunistring0_0.9.3-5.2_armhf.deb ...
Unpacking libunistring0:armhf (0.9.3-5.2) ...
Selecting previously unselected package file.
Preparing to unpack .../file_1%3a5.20-2_armhf.deb ...
Unpacking file (1:5.20-2) ...
Selecting previously unselected package gettext-base.
Preparing to unpack .../gettext-base_0.19.3-1_armhf.deb ...
Unpacking gettext-base (0.19.3-1) ...
Selecting previously unselected package libperl4-corelibs-perl.
Preparing to unpack .../libperl4-corelibs-perl_0.003-1_all.deb ...
Unpacking libperl4-corelibs-perl (0.003-1) ...
Selecting previously unselected package lsof.
Preparing to unpack .../lsof_4.86+dfsg-1_armhf.deb ...
Unpacking lsof (4.86+dfsg-1) ...
Selecting previously unselected package m4.
Preparing to unpack .../archives/m4_1.4.17-4_armhf.deb ...
Unpacking m4 (1.4.17-4) ...
Selecting previously unselected package ucf.
Preparing to unpack .../archives/ucf_3.0030_all.deb ...
Moving old data out of the way
Unpacking ucf (3.0030) ...
Selecting previously unselected package autoconf.
Preparing to unpack .../autoconf_2.69-8_all.deb ...
Unpacking autoconf (2.69-8) ...
Selecting previously unselected package autotools-dev.
Preparing to unpack .../autotools-dev_20140911.1_all.deb ...
Unpacking autotools-dev (20140911.1) ...
Selecting previously unselected package automake.
Preparing to unpack .../automake_1%3a1.14.1-4_all.deb ...
Unpacking automake (1:1.14.1-4) ...
Preparing to unpack .../dpkg-dev_1.17.21_all.deb ...
Unpacking dpkg-dev (1.17.21) over (1.17.13) ...
Preparing to unpack .../libdpkg-perl_1.17.21_all.deb ...
Unpacking libdpkg-perl (1.17.21) over (1.17.13) ...
Selecting previously unselected package gettext.
Preparing to unpack .../gettext_0.19.3-1_armhf.deb ...
Unpacking gettext (0.19.3-1) ...
Selecting previously unselected package intltool-debian.
Preparing to unpack .../intltool-debian_0.35.0+20060710.1_all.deb ...
Unpacking intltool-debian (0.35.0+20060710.1) ...
Selecting previously unselected package po-debconf.
Preparing to unpack .../po-debconf_1.0.16+nmu3_all.deb ...
Unpacking po-debconf (1.0.16+nmu3) ...
Selecting previously unselected package debhelper.
Preparing to unpack .../debhelper_9.20141022_all.deb ...
Unpacking debhelper (9.20141022) ...
Selecting previously unselected package libpcre3-dev:armhf.
Preparing to unpack .../libpcre3-dev_1%3a8.35-3.1_armhf.deb ...
Unpacking libpcre3-dev:armhf (1:8.35-3.1) ...
Selecting previously unselected package zlib1g-dev:armhf.
Preparing to unpack .../zlib1g-dev_1%3a1.2.8.dfsg-1+rpi1_armhf.deb ...
Unpacking zlib1g-dev:armhf (1:1.2.8.dfsg-1+rpi1) ...
Selecting previously unselected package libssl-dev:armhf.
Preparing to unpack .../libssl-dev_1.0.1j-1_armhf.deb ...
Unpacking libssl-dev:armhf (1.0.1j-1) ...
Selecting previously unselected package libtool.
Preparing to unpack .../libtool_2.4.2-1.11_all.deb ...
Unpacking libtool (2.4.2-1.11) ...
Selecting previously unselected package psmisc.
Preparing to unpack .../psmisc_22.21-2_armhf.deb ...
Unpacking psmisc (22.21-2) ...
Selecting previously unselected package php5-common.
Preparing to unpack .../php5-common_5.6.2+dfsg-1_armhf.deb ...
Unpacking php5-common (5.6.2+dfsg-1) ...
Selecting previously unselected package shtool.
Preparing to unpack .../shtool_2.0.8-6_all.deb ...
Unpacking shtool (2.0.8-6) ...
Selecting previously unselected package php5-dev.
Preparing to unpack .../php5-dev_5.6.2+dfsg-1_armhf.deb ...
Unpacking php5-dev (5.6.2+dfsg-1) ...
Selecting previously unselected package sbuild-build-depends-xhprof-dummy.
Preparing to unpack .../sbuild-build-depends-xhprof-dummy.deb ...
Unpacking sbuild-build-depends-xhprof-dummy (0.invalid.0) ...
Setting up libpipeline1:armhf (1.4.0-1) ...
Setting up libssl1.0.0:armhf (1.0.1j-1) ...
Setting up groff-base (1.22.2-8) ...
Setting up bsdmainutils (9.0.6) ...
update-alternatives: using /usr/bin/bsd-write to provide /usr/bin/write (write) in auto mode
update-alternatives: using /usr/bin/bsd-from to provide /usr/bin/from (from) in auto mode
Setting up man-db ( ...
Not building database; man-db/auto-update is not 'true'.
Setting up libasprintf0c2:armhf (0.19.3-1) ...
Setting up libmagic1:armhf (1:5.20-2) ...
Setting up libxml2:armhf (2.9.1+dfsg1-4) ...
Setting up libffi6:armhf (3.1-2) ...
Setting up libglib2.0-0:armhf (2.42.0-2) ...
No schema files found: doing nothing.
Setting up libcroco3:armhf (0.6.8-3) ...
Setting up libpcrecpp0:armhf (1:8.35-3.1) ...
Setting up libsigsegv2:armhf (2.10-4) ...
Setting up libunistring0:armhf (0.9.3-5.2) ...
Setting up file (1:5.20-2) ...
Setting up gettext-base (0.19.3-1) ...
Setting up libperl4-corelibs-perl (0.003-1) ...
Setting up lsof (4.86+dfsg-1) ...
Setting up m4 (1.4.17-4) ...
Setting up ucf (3.0030) ...
Setting up autoconf (2.69-8) ...
Setting up autotools-dev (20140911.1) ...
Setting up automake (1:1.14.1-4) ...
update-alternatives: using /usr/bin/automake-1.14 to provide /usr/bin/automake (automake) in auto mode
Setting up libdpkg-perl (1.17.21) ...
Setting up dpkg-dev (1.17.21) ...
Setting up gettext (0.19.3-1) ...
Setting up intltool-debian (0.35.0+20060710.1) ...
Setting up po-debconf (1.0.16+nmu3) ...
Setting up debhelper (9.20141022) ...
Setting up libpcre3-dev:armhf (1:8.35-3.1) ...
Setting up zlib1g-dev:armhf (1:1.2.8.dfsg-1+rpi1) ...
Setting up libssl-dev:armhf (1.0.1j-1) ...
Setting up libtool (2.4.2-1.11) ...
Setting up psmisc (22.21-2) ...
Setting up php5-common (5.6.2+dfsg-1) ...

Creating config file /etc/php5/mods-available/pdo.ini with new version

Creating config file /etc/php5/mods-available/opcache.ini with new version
Setting up shtool (2.0.8-6) ...
Setting up php5-dev (5.6.2+dfsg-1) ...
update-alternatives: using /usr/bin/php-config5 to provide /usr/bin/php-config (php-config) in auto mode
update-alternatives: using /usr/bin/phpize5 to provide /usr/bin/phpize (phpize) in auto mode
Setting up sbuild-build-depends-xhprof-dummy (0.invalid.0) ...
Processing triggers for libc-bin (2.19-11) ...

│ Build environment                                                            │

Kernel: Linux 3.17-1-armmp armhf (armv7l)
Toolchain package versions: binutils_2.24.51.20140918-1 dpkg-dev_1.17.21 g++-4.9_4.9.1-15 gcc-4.8_4.8.3-11 gcc-4.9_4.9.1-15 libc6-dev_2.19-11 libstdc++-4.9-dev_4.9.1-15 libstdc++6_4.9.1-15 linux-libc-dev_3.14.4-1+rpi1+b4
Package versions: apt_1.0.9.1 autoconf_2.69-8 automake_1:1.14.1-4 autotools-dev_20140911.1 base-files_7.5+rpi1 base-passwd_3.5.36 bash_4.3-9.2 binutils_2.24.51.20140918-1 bsdmainutils_9.0.6 bsdutils_1:2.20.1-5.9 build-essential_11.7 bzip2_1.0.6-7 coreutils_8.23-2 cpio_2.11+dfsg-2 cpp_4:4.9.1-1 cpp-4.8_4.8.3-11 cpp-4.9_4.9.1-15 dash_0.5.7-4 debconf_1.5.53 debfoster_2.7-2 debhelper_9.20141022 debianutils_4.4 diffutils_1:3.3-1 dpkg_1.17.13 dpkg-dev_1.17.21 e2fslibs_1.42.12-1 e2fsprogs_1.42.12-1 fakeroot_1.20.1-1.1 file_1:5.20-2 findutils_4.4.2-9 g++_4:4.9.1-1 g++-4.9_4.9.1-15 gcc_4:4.9.1-1 gcc-4.5-base_4.5.3-12+rpi1 gcc-4.6-base_4.6.4-5+rpi1 gcc-4.7-base_4.7.3-11+rpi1 gcc-4.8_4.8.3-11 gcc-4.8-base_4.8.3-11 gcc-4.9_4.9.1-15 gcc-4.9-base_4.9.1-15 gettext_0.19.3-1 gettext-base_0.19.3-1 gnupg_1.4.18-4 gpgv_1.4.18-4 grep_2.20-3 groff-base_1.22.2-8 gzip_1.6-3 hostname_3.15 init_1.21 initramfs-tools_0.116 initscripts_2.88dsf-53.4 insserv_1.14.0-5 intltool-debian_0.35.0+20060710.1 klibc-utils_2.0.3-1+rpi1 kmod_18-3 libacl1_2.2.52-2 libapt-pkg4.12_1.0.9.1 libasan0_4.8.3-11 libasan1_4.9.1-15 libasprintf0c2_0.19.3-1 libatomic1_4.9.1-15 libattr1_1:2.4.47-2 libaudit-common_1:2.4-1 libaudit1_1:2.4-1 libblkid1_2.20.1-5.9 libbz2-1.0_1.0.6-7 libc-bin_2.19-11 libc-dev-bin_2.19-11 libc6_2.19-11 libc6-dev_2.19-11 libcap2_1:2.24-6 libcgi-pm-perl_4.03-1 libcloog-isl4_0.18.2-1 libcomerr2_1.42.12-1 libcroco3_0.6.8-3 libdb5.1_5.1.29-6 libdb5.3_5.3.28-6 libdbus-1-3_1.8.6-2 libdebconfclient0_0.192 libdpkg-perl_1.17.21 libdrm2_2.4.56-1 libfakeroot_1.20.1-1.1 libffi6_3.1-2 libgc1c2_1:7.2d-6.3 libgcc-4.8-dev_4.8.3-11 libgcc-4.9-dev_4.9.1-15 libgcc1_1:4.9.1-15 libgdbm3_1.8.3-13 libglib2.0-0_2.42.0-2 libgmp10_2:6.0.0+dfsg-4+rpi1 libgomp1_4.9.1-15 libisl10_0.12.2-2 libklibc_2.0.3-1+rpi1 libkmod2_18-3 liblzma5_5.1.1alpha+20120614-2 libmagic1_1:5.20-2 libmount1_2.20.1-5.9 libmpc3_1.0.2-1 libmpfr4_3.1.2-1 libncurses5_5.9+20140913-1 libncursesw5_5.9+20140913-1 libpackage-constants-perl_0.04-1 libpam-modules_1.1.8-3.1 libpam-modules-bin_1.1.8-3.1 libpam-runtime_1.1.8-3.1 libpam0g_1.1.8-3.1 libpcre3_1:8.35-3.1 libpcre3-dev_1:8.35-3.1 libpcrecpp0_1:8.35-3.1 libperl4-corelibs-perl_0.003-1 libpipeline1_1.4.0-1 libpng12-0_1.2.50-2 libprocps0_1:3.3.4-2 libprocps3_1:3.3.9-7 libreadline6_6.3-8 libselinux1_2.3-2 libsemanage-common_2.3-1 libsemanage1_2.3-1 libsepol1_2.3-2 libsigsegv2_2.10-4 libslang2_2.3.0-1 libss2_1.42.12-1 libssl-dev_1.0.1j-1 libssl1.0.0_1.0.1j-1 libstdc++-4.9-dev_4.9.1-15 libstdc++6_4.9.1-15 libtimedate-perl_2.3000-2 libtinfo5_5.9+20140913-1 libtool_2.4.2-1.11 libubsan0_4.9.1-15 libudev1_208-8 libunistring0_0.9.3-5.2 libusb-0.1-4_2:0.1.12-24 libustr-1.0-1_1.0.4-3 libuuid1_2.20.1-5.9 libxml2_2.9.1+dfsg1-4 linux-libc-dev_3.14.4-1+rpi1+b4 login_1:4.2-2 lsb-base_4.1+Debian13+rpi1 lsof_4.86+dfsg-1 m4_1.4.17-4 make_4.0-8 makedev_2.3.1-93 man-db_2.7.0.2-3 mawk_1.3.3-17 mount_2.20.1-5.9 multiarch-support_2.19-11 nano_2.2.6-3 ncurses-base_5.9+20140913-1 ncurses-bin_5.9+20140913-1 passwd_1:4.2-2 patch_2.7.1-6 perl_5.20.1-1 perl-base_5.20.1-1 perl-modules_5.20.1-1 php5-common_5.6.2+dfsg-1 php5-dev_5.6.2+dfsg-1 plymouth_0.9.0-7 po-debconf_1.0.16+nmu3 procps_1:3.3.9-7 psmisc_22.21-2 raspbian-archive-keyring_20120528.2 readline-common_6.3-8 sbuild-build-depends-core-dummy_0.invalid.0 sbuild-build-depends-xhprof-dummy_0.invalid.0 sed_4.2.2-4 sensible-utils_0.0.9 shtool_2.0.8-6 startpar_0.59-3 sysv-rc_2.88dsf-53.4 sysvinit_2.88dsf-53.4 sysvinit-core_2.88dsf-53.4 sysvinit-utils_2.88dsf-53.4 tar_1.27.1-2 tzdata_2014g-1 ucf_3.0030 udev_208-8 util-linux_2.20.1-5.9 xz-utils_5.1.1alpha+20120614-2 zlib1g_1:1.2.8.dfsg-1+rpi1 zlib1g-dev_1:1.2.8.dfsg-1+rpi1

│ Build                                                                        │

Unpack source

gpgv: keyblock resource `/sbuild-nonexistent/.gnupg/trustedkeys.gpg': file open error
gpgv: Signature made Wed Oct 16 17:22:05 2013 UTC using DSA key ID A51A4FDD
gpgv: Can't check signature: public key not found
dpkg-source: warning: failed to verify signature on ./xhprof_0.9.4-1.dsc
dpkg-source: info: extracting xhprof in xhprof-0.9.4
dpkg-source: info: unpacking xhprof_0.9.4.orig.tar.gz
dpkg-source: info: unpacking xhprof_0.9.4-1.debian.tar.gz

Check disc space

Sufficient free space for build

User Environment



dpkg-buildpackage: source package xhprof
dpkg-buildpackage: source version 0.9.4-1
dpkg-buildpackage: source distribution unstable
 dpkg-source --before-build xhprof-0.9.4
dpkg-buildpackage: host architecture armhf
 fakeroot debian/rules clean
cd /«PKGBUILDDIR»/extension/ && phpize --clean
 debian/rules build-arch
make: Nothing to be done for 'build-arch'.
 fakeroot debian/rules binary-arch
cd /«PKGBUILDDIR»/extension/ && phpize5 && \
	./configure --prefix=/usr --with-php-config=/usr/bin/php-config5
Configuring for:
PHP Api Version:         20131106
Zend Module Api No:      20131226
Zend Extension Api No:   220131226
checking for grep that handles long lines and -e... /bin/grep
checking for egrep... /bin/grep -E
checking for a sed that does not truncate output... /bin/sed
checking for cc... cc
checking whether the C compiler works... yes
checking for C compiler default output file name... a.out
checking for suffix of executables... 
checking whether we are cross compiling... no
checking for suffix of object files... o
checking whether we are using the GNU C compiler... yes
checking whether cc accepts -g... yes
checking for cc option to accept ISO C89... none needed
checking how to run the C preprocessor... cc -E
checking for icc... no
checking for suncc... no
checking whether cc understands -c and -o together... yes
checking for system library directory... lib
checking if compiler supports -R... yes
checking build system type... armv7l-unknown-linux-gnueabihf
checking host system type... armv7l-unknown-linux-gnueabihf
checking target system type... armv7l-unknown-linux-gnueabihf
checking for PHP prefix... /usr
checking for PHP includes... -I/usr/include/php5 -I/usr/include/php5/main -I/usr/include/php5/TSRM -I/usr/include/php5/Zend -I/usr/include/php5/ext -I/usr/include/php5/ext/date/lib -D_LARGEFILE_SOURCE -D_FILE_OFFSET_BITS=64
checking for PHP extension directory... /usr/lib/php5/20131226
checking for PHP installed headers prefix... /usr/include/php5
checking if debug is enabled... no
checking if zts is enabled... no
checking for re2c... no
configure: WARNING: You will need re2c 0.13.4 or later if you want to regenerate PHP parsers.
checking for gawk... no
checking for nawk... nawk
checking if nawk is broken... no
checking whether to enable xhprof support... yes, shared
checking how to print strings... printf
checking for a sed that does not truncate output... (cached) /bin/sed
checking for fgrep... /bin/grep -F
checking for ld used by cc... /usr/bin/ld
checking if the linker (/usr/bin/ld) is GNU ld... yes
checking for BSD- or MS-compatible name lister (nm)... /usr/bin/nm -B
checking the name lister (/usr/bin/nm -B) interface... BSD nm
checking whether ln -s works... yes
checking the maximum length of command line arguments... 1572864
checking whether the shell understands some XSI constructs... yes
checking whether the shell understands "+="... yes
checking how to convert armv7l-unknown-linux-gnueabihf file names to armv7l-unknown-linux-gnueabihf format... func_convert_file_noop
checking how to convert armv7l-unknown-linux-gnueabihf file names to toolchain format... func_convert_file_noop
checking for /usr/bin/ld option to reload object files... -r
checking for objdump... objdump
checking how to recognize dependent libraries... pass_all
checking for dlltool... no
checking how to associate runtime and link libraries... printf %s\n
checking for ar... ar
checking for archiver @FILE support... @
checking for strip... strip
checking for ranlib... ranlib
checking for gawk... (cached) nawk
checking command to parse /usr/bin/nm -B output from cc object... ok
checking for sysroot... no
checking for mt... mt
checking if mt is a manifest tool... no
checking for ANSI C header files... yes
checking for sys/types.h... yes
checking for sys/stat.h... yes
checking for stdlib.h... yes
checking for string.h... yes
checking for memory.h... yes
checking for strings.h... yes
checking for inttypes.h... yes
checking for stdint.h... yes
checking for unistd.h... yes
checking for dlfcn.h... yes
checking for objdir... .libs
checking if cc supports -fno-rtti -fno-exceptions... no
checking for cc option to produce PIC... -fPIC -DPIC
checking if cc PIC flag -fPIC -DPIC works... yes
checking if cc static flag -static works... yes
checking if cc supports -c -o file.o... yes
checking if cc supports -c -o file.o... (cached) yes
checking whether the cc linker (/usr/bin/ld) supports shared libraries... yes
checking whether -lc should be explicitly linked in... no
checking dynamic linker characteristics... GNU/Linux ld.so
checking how to hardcode library paths into programs... immediate
checking whether stripping libraries is possible... yes
checking if libtool supports shared libraries... yes
checking whether to build shared libraries... yes
checking whether to build static libraries... no
configure: creating ./config.status
config.status: creating config.h
config.status: executing libtool commands
touch configure-stamp
cd /«PKGBUILDDIR»/extension/ && /usr/bin/make DESTDIR=/«PKGBUILDDIR»/debian/php5-xhprof
make[1]: Entering directory '/«PKGBUILDDIR»/extension'
/bin/bash /«PKGBUILDDIR»/extension/libtool --mode=compile cc  -I. -I/«PKGBUILDDIR»/extension -DPHP_ATOM_INC -I/«PKGBUILDDIR»/extension/include -I/«PKGBUILDDIR»/extension/main -I/«PKGBUILDDIR»/extension -I/usr/include/php5 -I/usr/include/php5/main -I/usr/include/php5/TSRM -I/usr/include/php5/Zend -I/usr/include/php5/ext -I/usr/include/php5/ext/date/lib -D_LARGEFILE_SOURCE -D_FILE_OFFSET_BITS=64  -D_FORTIFY_SOURCE=2 -DHAVE_CONFIG_H  -g -O2 -fPIE -fstack-protector-strong -Wformat -Werror=format-security -gstabs   -c /«PKGBUILDDIR»/extension/xhprof.c -o xhprof.lo 
libtool: compile:  cc -I. -I/«PKGBUILDDIR»/extension -DPHP_ATOM_INC -I/«PKGBUILDDIR»/extension/include -I/«PKGBUILDDIR»/extension/main -I/«PKGBUILDDIR»/extension -I/usr/include/php5 -I/usr/include/php5/main -I/usr/include/php5/TSRM -I/usr/include/php5/Zend -I/usr/include/php5/ext -I/usr/include/php5/ext/date/lib -D_LARGEFILE_SOURCE -D_FILE_OFFSET_BITS=64 -D_FORTIFY_SOURCE=2 -DHAVE_CONFIG_H -g -O2 -fstack-protector-strong -Wformat -Werror=format-security -gstabs -c /«PKGBUILDDIR»/extension/xhprof.c  -fPIC -DPIC -o .libs/xhprof.o
In file included from /usr/include/php5/main/php.h:34:0,
                 from /«PKGBUILDDIR»/extension/xhprof.c:27:
/usr/include/php5/main/php_config.h:2463:0: warning: "_GNU_SOURCE" redefined
 #define _GNU_SOURCE 1
/«PKGBUILDDIR»/extension/xhprof.c:24:0: note: this is the location of the previous definition
 # define _GNU_SOURCE
/«PKGBUILDDIR»/extension/xhprof.c: In function 'hp_mode_hier_beginfn_cb':
/«PKGBUILDDIR»/extension/xhprof.c:1224:3: error: impossible constraint in 'asm'
   asm volatile("rdtsc" : "=a" (__a), "=d" (__d));
make[1]: *** [xhprof.lo] Error 1
Makefile:180: recipe for target 'xhprof.lo' failed
make[1]: Leaving directory '/«PKGBUILDDIR»/extension'
make: *** [build-stamp] Error 2
debian/rules:37: recipe for target 'build-stamp' failed
dpkg-buildpackage: error: fakeroot debian/rules binary-arch gave error exit status 2
Build finished at 20141127-0445


E: Build failure (dpkg-buildpackage died)

│ Cleanup                                                                      │

Purging /«BUILDDIR»
Not cleaning session: cloned chroot in use

│ Summary                                                                      │

Build Architecture: armhf
Build-Space: 3908
Build-Time: 50
Distribution: jessie-staging
Fail-Stage: build
Host Architecture: armhf
Install-Time: 258
Job: xhprof_0.9.4-1
Machine Architecture: armhf
Package: xhprof
Package-Time: 360
Source-Version: 0.9.4-1
Space: 3908
Status: attempted
Version: 0.9.4-1
Finished at 20141127-0445
Build needed 00:06:00, 3908k disc space