Raspbian Package Auto-Building

Build log for me-tv (1.3.7-1+b2) on armhf

me-tv1.3.7-1+b2armhf → 2020-01-25 13:35:41

sbuild (Debian sbuild) 0.73.0 (23 Dec 2016) on test2019

+==============================================================================+
| me-tv 1.3.7-1+b2 (armhf)                     Sat, 25 Jan 2020 13:10:36 +0000 |
+==============================================================================+

Package: me-tv
Version: 1.3.7-1+b2
Source Version: 1.3.7-1
Distribution: bullseye-staging
Machine Architecture: armhf
Host Architecture: armhf
Build Architecture: armhf
Build Type: any

I: NOTICE: Log filtering will replace 'var/run/schroot/mount/bullseye-staging-armhf-sbuild-0486d88b-2544-4783-b0d7-d437ce0d5c0c' with '<<CHROOT>>'

+------------------------------------------------------------------------------+
| Update chroot                                                                |
+------------------------------------------------------------------------------+

Get:1 http://172.17.0.1/private bullseye-staging InRelease [11.3 kB]
Get:2 http://172.17.0.1/private bullseye-staging/main Sources [11.5 MB]
Get:3 http://172.17.0.1/private bullseye-staging/main armhf Packages [12.8 MB]
Fetched 24.3 MB in 23s (1073 kB/s)
Reading package lists...

+------------------------------------------------------------------------------+
| Fetch source files                                                           |
+------------------------------------------------------------------------------+


Check APT
---------

Checking available source versions...

Download source files with APT
------------------------------

Reading package lists...
Need to get 463 kB of source archives.
Get:1 http://172.17.0.1/private bullseye-staging/main me-tv 1.3.7-1 (dsc) [1206 B]
Get:2 http://172.17.0.1/private bullseye-staging/main me-tv 1.3.7-1 (tar) [455 kB]
Get:3 http://172.17.0.1/private bullseye-staging/main me-tv 1.3.7-1 (diff) [6236 B]
Fetched 463 kB in 0s (1146 kB/s)
Download complete and in download only mode
I: NOTICE: Log filtering will replace 'build/me-tv-uXS76e/me-tv-1.3.7' with '<<PKGBUILDDIR>>'
I: NOTICE: Log filtering will replace 'build/me-tv-uXS76e' with '<<BUILDDIR>>'

+------------------------------------------------------------------------------+
| Install build-essential                                                      |
+------------------------------------------------------------------------------+


Setup apt archive
-----------------

Merged Build-Depends: build-essential, fakeroot
Filtered Build-Depends: build-essential, fakeroot
dpkg-deb: building package 'sbuild-build-depends-core-dummy' in '/<<BUILDDIR>>/resolver-ierqvK/apt_archive/sbuild-build-depends-core-dummy.deb'.
dpkg-scanpackages: warning: Packages in archive but missing from override file:
dpkg-scanpackages: warning:   sbuild-build-depends-core-dummy
dpkg-scanpackages: info: Wrote 1 entries to output Packages file.
gpg: keybox '/<<BUILDDIR>>/resolver-ierqvK/gpg/pubring.kbx' created
gpg: /<<BUILDDIR>>/resolver-ierqvK/gpg/trustdb.gpg: trustdb created
gpg: key E70254B6505CF8F7: public key "Sbuild Signer (Sbuild Build Dependency Archive Key) <buildd-tools-devel@lists.alioth.debian.org>" imported
gpg: Total number processed: 1
gpg:               imported: 1
gpg: key E70254B6505CF8F7: "Sbuild Signer (Sbuild Build Dependency Archive Key) <buildd-tools-devel@lists.alioth.debian.org>" not changed
gpg: key E70254B6505CF8F7: secret key imported
gpg: Total number processed: 1
gpg:              unchanged: 1
gpg:       secret keys read: 1
gpg:   secret keys imported: 1
gpg: using "Sbuild Signer" as default secret key for signing
Ign:1 copy:/<<BUILDDIR>>/resolver-ierqvK/apt_archive ./ InRelease
Get:2 copy:/<<BUILDDIR>>/resolver-ierqvK/apt_archive ./ Release [957 B]
Get:3 copy:/<<BUILDDIR>>/resolver-ierqvK/apt_archive ./ Release.gpg [370 B]
Ign:3 copy:/<<BUILDDIR>>/resolver-ierqvK/apt_archive ./ Release.gpg
Get:4 copy:/<<BUILDDIR>>/resolver-ierqvK/apt_archive ./ Sources [349 B]
Get:5 copy:/<<BUILDDIR>>/resolver-ierqvK/apt_archive ./ Packages [432 B]
Fetched 2108 B in 1s (3579 B/s)
Reading package lists...
W: copy:///<<BUILDDIR>>/resolver-ierqvK/apt_archive/./Release.gpg: The key(s) in the keyring /etc/apt/trusted.gpg.d/sbuild-build-depends-archive.gpg are ignored as the file is not readable by user '_apt' executing apt-key.
W: GPG error: copy:/<<BUILDDIR>>/resolver-ierqvK/apt_archive ./ Release: The following signatures couldn't be verified because the public key is not available: NO_PUBKEY E70254B6505CF8F7
Reading package lists...

Install core build dependencies (apt-based resolver)
----------------------------------------------------

Installing build dependencies
Reading package lists...
Building dependency tree...
Reading state information...
The following package was automatically installed and is no longer required:
  libpam-cap
Use 'apt autoremove' to remove it.
The following NEW packages will be installed:
  sbuild-build-depends-core-dummy
0 upgraded, 1 newly installed, 0 to remove and 2 not upgraded.
Need to get 852 B of archives.
After this operation, 0 B of additional disk space will be used.
Get:1 copy:/<<BUILDDIR>>/resolver-ierqvK/apt_archive ./ sbuild-build-depends-core-dummy 0.invalid.0 [852 B]
debconf: delaying package configuration, since apt-utils is not installed
Fetched 852 B in 0s (0 B/s)
Selecting previously unselected package sbuild-build-depends-core-dummy.
(Reading database ... 14067 files and directories currently installed.)
Preparing to unpack .../sbuild-build-depends-core-dummy_0.invalid.0_armhf.deb ...
Unpacking sbuild-build-depends-core-dummy (0.invalid.0) ...
Setting up sbuild-build-depends-core-dummy (0.invalid.0) ...

+------------------------------------------------------------------------------+
| Check architectures                                                          |
+------------------------------------------------------------------------------+

Arch check ok (armhf included in any)

+------------------------------------------------------------------------------+
| Install package build dependencies                                           |
+------------------------------------------------------------------------------+


Setup apt archive
-----------------

Merged Build-Depends: debhelper (>= 7.0.50~), autotools-dev, pkg-config, intltool, libgtkmm-2.4-dev (>= 2.12), libxine2-dev, libx11-dev, libsqlite3-dev, libgconfmm-2.6-dev, libunique-dev, libdbus-glib-1-dev, dh-autoreconf
Filtered Build-Depends: debhelper (>= 7.0.50~), autotools-dev, pkg-config, intltool, libgtkmm-2.4-dev (>= 2.12), libxine2-dev, libx11-dev, libsqlite3-dev, libgconfmm-2.6-dev, libunique-dev, libdbus-glib-1-dev, dh-autoreconf
dpkg-deb: building package 'sbuild-build-depends-me-tv-dummy' in '/<<BUILDDIR>>/resolver-ierqvK/apt_archive/sbuild-build-depends-me-tv-dummy.deb'.
dpkg-scanpackages: warning: Packages in archive but missing from override file:
dpkg-scanpackages: warning:   sbuild-build-depends-core-dummy sbuild-build-depends-me-tv-dummy
dpkg-scanpackages: info: Wrote 2 entries to output Packages file.
gpg: using "Sbuild Signer" as default secret key for signing
Ign:1 copy:/<<BUILDDIR>>/resolver-ierqvK/apt_archive ./ InRelease
Get:2 copy:/<<BUILDDIR>>/resolver-ierqvK/apt_archive ./ Release [963 B]
Get:3 copy:/<<BUILDDIR>>/resolver-ierqvK/apt_archive ./ Release.gpg [370 B]
Ign:3 copy:/<<BUILDDIR>>/resolver-ierqvK/apt_archive ./ Release.gpg
Get:4 copy:/<<BUILDDIR>>/resolver-ierqvK/apt_archive ./ Sources [580 B]
Get:5 copy:/<<BUILDDIR>>/resolver-ierqvK/apt_archive ./ Packages [662 B]
Fetched 2575 B in 1s (4672 B/s)
Reading package lists...
W: copy:///<<BUILDDIR>>/resolver-ierqvK/apt_archive/./Release.gpg: The key(s) in the keyring /etc/apt/trusted.gpg.d/sbuild-build-depends-archive.gpg are ignored as the file is not readable by user '_apt' executing apt-key.
W: GPG error: copy:/<<BUILDDIR>>/resolver-ierqvK/apt_archive ./ Release: The following signatures couldn't be verified because the public key is not available: NO_PUBKEY E70254B6505CF8F7
Reading package lists...

Install me-tv build dependencies (apt-based resolver)
-----------------------------------------------------

Installing build dependencies
Reading package lists...
Building dependency tree...
Reading state information...
The following package was automatically installed and is no longer required:
  libpam-cap
Use 'apt autoremove' to remove it.
The following additional packages will be installed:
  adwaita-icon-theme autoconf automake autopoint autotools-dev bsdmainutils
  ca-certificates dbus dbus-user-session debhelper dh-autoreconf
  dh-strip-nondeterminism dmsetup dwz file fontconfig fontconfig-config
  fonts-dejavu-core gconf-service gconf2 gconf2-common gettext gettext-base
  gir1.2-atk-1.0 gir1.2-freedesktop gir1.2-gconf-2.0 gir1.2-gdkpixbuf-2.0
  gir1.2-glib-2.0 gir1.2-gtk-2.0 gir1.2-harfbuzz-0.0 gir1.2-pango-1.0
  groff-base gtk-update-icon-cache hicolor-icon-theme icu-devtools intltool
  intltool-debian libapparmor1 libarchive-zip-perl libargon2-1 libatk1.0-0
  libatk1.0-data libatk1.0-dev libatkmm-1.6-1v5 libatkmm-1.6-dev
  libavahi-client3 libavahi-common-data libavahi-common3 libblkid-dev libbsd0
  libcairo-gobject2 libcairo-script-interpreter2 libcairo2 libcairo2-dev
  libcairomm-1.0-1v5 libcairomm-1.0-dev libcroco3 libcryptsetup12 libcups2
  libdatrie1 libdbus-1-3 libdbus-1-dev libdbus-glib-1-2 libdbus-glib-1-dev
  libdbus-glib-1-dev-bin libdebhelper-perl libdevmapper1.02.1 libelf1
  libencode-locale-perl libexpat1 libexpat1-dev libffi-dev
  libfile-listing-perl libfile-stripnondeterminism-perl libfontconfig1
  libfontconfig1-dev libfreetype-dev libfreetype6 libfreetype6-dev
  libfribidi-dev libfribidi0 libgconf-2-4 libgconf2-dev libgconfmm-2.6-1v5
  libgconfmm-2.6-dev libgdk-pixbuf2.0-0 libgdk-pixbuf2.0-bin
  libgdk-pixbuf2.0-common libgdk-pixbuf2.0-dev libgirepository-1.0-1
  libglib2.0-0 libglib2.0-bin libglib2.0-data libglib2.0-dev
  libglib2.0-dev-bin libglibmm-2.4-1v5 libglibmm-2.4-dev libgraphite2-3
  libgraphite2-dev libgssapi-krb5-2 libgtk2.0-0 libgtk2.0-common libgtk2.0-dev
  libgtkmm-2.4-1v5 libgtkmm-2.4-dev libharfbuzz-dev libharfbuzz-gobject0
  libharfbuzz-icu0 libharfbuzz0b libhtml-parser-perl libhtml-tagset-perl
  libhtml-tree-perl libhttp-cookies-perl libhttp-date-perl
  libhttp-message-perl libhttp-negotiate-perl libice-dev libice6 libicu-dev
  libicu63 libio-html-perl libio-socket-ssl-perl libip4tc2 libjbig0
  libjpeg62-turbo libjson-c4 libk5crypto3 libkeyutils1 libkmod2 libkrb5-3
  libkrb5support0 liblwp-mediatypes-perl liblwp-protocol-https-perl liblzo2-2
  libmagic-mgc libmagic1 libmount-dev libmpdec2 libnet-http-perl
  libnet-ssleay-perl libpam-systemd libpango-1.0-0 libpango1.0-dev
  libpangocairo-1.0-0 libpangoft2-1.0-0 libpangomm-1.4-1v5 libpangomm-1.4-dev
  libpangoxft-1.0-0 libpcre16-3 libpcre2-16-0 libpcre2-32-0 libpcre2-dev
  libpcre2-posix2 libpcre3-dev libpcre32-3 libpcrecpp0v5 libpipeline1
  libpixman-1-0 libpixman-1-dev libpng-dev libpng16-16 libpthread-stubs0-dev
  libpython3-stdlib libpython3.7-minimal libpython3.7-stdlib librsvg2-2
  librsvg2-common libselinux1-dev libsepol1-dev libsigc++-2.0-0v5
  libsigc++-2.0-dev libsigsegv2 libsm-dev libsm6 libsqlite3-dev libssl1.1
  libsub-override-perl libthai-data libthai0 libtiff5 libtimedate-perl
  libtinfo5 libtool libtry-tiny-perl libuchardet0 libunique-1.0-0
  libunique-dev liburi-perl libwebp6 libwww-perl libwww-robotrules-perl
  libx11-6 libx11-data libx11-dev libxau-dev libxau6 libxcb-render0
  libxcb-render0-dev libxcb-shm0 libxcb-shm0-dev libxcb1 libxcb1-dev
  libxcomposite-dev libxcomposite1 libxcursor-dev libxcursor1 libxdamage-dev
  libxdamage1 libxdmcp-dev libxdmcp6 libxext-dev libxext6 libxfixes-dev
  libxfixes3 libxft-dev libxft2 libxi-dev libxi6 libxine2-bin libxine2-dev
  libxinerama-dev libxinerama1 libxml-parser-perl libxml2 libxml2-utils
  libxrandr-dev libxrandr2 libxrender-dev libxrender1 m4 man-db mime-support
  netbase openssl pango1.0-tools perl-openssl-defaults pkg-config po-debconf
  psmisc python3 python3-distutils python3-lib2to3 python3-minimal python3.7
  python3.7-minimal sensible-utils shared-mime-info systemd systemd-sysv ucf
  uuid-dev x11-common x11proto-composite-dev x11proto-core-dev
  x11proto-damage-dev x11proto-dev x11proto-fixes-dev x11proto-input-dev
  x11proto-randr-dev x11proto-xext-dev x11proto-xinerama-dev
  xorg-sgml-doctools xtrans-dev zlib1g-dev
Suggested packages:
  autoconf-archive gnu-standards autoconf-doc wamerican | wordlist whois
  vacation dh-make gconf-defaults-service gettext-doc libasprintf-dev
  libgettextpo-dev groff libatkmm-1.6-doc libcairo2-doc libcairomm-1.0-doc
  cups-common freetype2-doc libgconfmm-2.6-doc libgirepository1.0-dev
  libglib2.0-doc libglibmm-2.4-doc libgtkmm-3.0-dev libgraphite2-utils
  krb5-doc krb5-user gvfs libgtk2.0-doc libgtkmm-2.4-doc libdata-dump-perl
  libice-doc icu-doc libcrypt-ssleay-perl imagemagick libpango1.0-doc
  librsvg2-bin libsigc++-2.0-doc libsm-doc sqlite3-doc libtool-doc gfortran
  | fortran95-compiler gcj-jdk libunique-doc libauthen-ntlm-perl libx11-doc
  libxcb-doc libxext-doc m4-doc apparmor less www-browser libmail-box-perl
  python3-doc python3-tk python3-venv python3.7-venv python3.7-doc
  binfmt-support systemd-container policykit-1
Recommended packages:
  curl | wget | lynx libarchive-cpio-perl libgconf2-doc xdg-user-dirs
  libgail-common libgtk2.0-bin libhtml-format-perl krb5-locales libpng-tools
  libltdl-dev libdata-dump-perl libhtml-form-perl libhttp-daemon-perl
  libmailtools-perl libmail-sendmail-perl libnss-systemd
The following NEW packages will be installed:
  adwaita-icon-theme autoconf automake autopoint autotools-dev bsdmainutils
  ca-certificates dbus dbus-user-session debhelper dh-autoreconf
  dh-strip-nondeterminism dmsetup dwz file fontconfig fontconfig-config
  fonts-dejavu-core gconf-service gconf2 gconf2-common gettext gettext-base
  gir1.2-atk-1.0 gir1.2-freedesktop gir1.2-gconf-2.0 gir1.2-gdkpixbuf-2.0
  gir1.2-glib-2.0 gir1.2-gtk-2.0 gir1.2-harfbuzz-0.0 gir1.2-pango-1.0
  groff-base gtk-update-icon-cache hicolor-icon-theme icu-devtools intltool
  intltool-debian libapparmor1 libarchive-zip-perl libargon2-1 libatk1.0-0
  libatk1.0-data libatk1.0-dev libatkmm-1.6-1v5 libatkmm-1.6-dev
  libavahi-client3 libavahi-common-data libavahi-common3 libblkid-dev libbsd0
  libcairo-gobject2 libcairo-script-interpreter2 libcairo2 libcairo2-dev
  libcairomm-1.0-1v5 libcairomm-1.0-dev libcroco3 libcryptsetup12 libcups2
  libdatrie1 libdbus-1-3 libdbus-1-dev libdbus-glib-1-2 libdbus-glib-1-dev
  libdbus-glib-1-dev-bin libdebhelper-perl libdevmapper1.02.1 libelf1
  libencode-locale-perl libexpat1 libexpat1-dev libffi-dev
  libfile-listing-perl libfile-stripnondeterminism-perl libfontconfig1
  libfontconfig1-dev libfreetype-dev libfreetype6 libfreetype6-dev
  libfribidi-dev libfribidi0 libgconf-2-4 libgconf2-dev libgconfmm-2.6-1v5
  libgconfmm-2.6-dev libgdk-pixbuf2.0-0 libgdk-pixbuf2.0-bin
  libgdk-pixbuf2.0-common libgdk-pixbuf2.0-dev libgirepository-1.0-1
  libglib2.0-0 libglib2.0-bin libglib2.0-data libglib2.0-dev
  libglib2.0-dev-bin libglibmm-2.4-1v5 libglibmm-2.4-dev libgraphite2-3
  libgraphite2-dev libgssapi-krb5-2 libgtk2.0-0 libgtk2.0-common libgtk2.0-dev
  libgtkmm-2.4-1v5 libgtkmm-2.4-dev libharfbuzz-dev libharfbuzz-gobject0
  libharfbuzz-icu0 libharfbuzz0b libhtml-parser-perl libhtml-tagset-perl
  libhtml-tree-perl libhttp-cookies-perl libhttp-date-perl
  libhttp-message-perl libhttp-negotiate-perl libice-dev libice6 libicu-dev
  libicu63 libio-html-perl libio-socket-ssl-perl libip4tc2 libjbig0
  libjpeg62-turbo libjson-c4 libk5crypto3 libkeyutils1 libkmod2 libkrb5-3
  libkrb5support0 liblwp-mediatypes-perl liblwp-protocol-https-perl liblzo2-2
  libmagic-mgc libmagic1 libmount-dev libmpdec2 libnet-http-perl
  libnet-ssleay-perl libpam-systemd libpango-1.0-0 libpango1.0-dev
  libpangocairo-1.0-0 libpangoft2-1.0-0 libpangomm-1.4-1v5 libpangomm-1.4-dev
  libpangoxft-1.0-0 libpcre16-3 libpcre2-16-0 libpcre2-32-0 libpcre2-dev
  libpcre2-posix2 libpcre3-dev libpcre32-3 libpcrecpp0v5 libpipeline1
  libpixman-1-0 libpixman-1-dev libpng-dev libpng16-16 libpthread-stubs0-dev
  libpython3-stdlib libpython3.7-minimal libpython3.7-stdlib librsvg2-2
  librsvg2-common libselinux1-dev libsepol1-dev libsigc++-2.0-0v5
  libsigc++-2.0-dev libsigsegv2 libsm-dev libsm6 libsqlite3-dev libssl1.1
  libsub-override-perl libthai-data libthai0 libtiff5 libtimedate-perl
  libtinfo5 libtool libtry-tiny-perl libuchardet0 libunique-1.0-0
  libunique-dev liburi-perl libwebp6 libwww-perl libwww-robotrules-perl
  libx11-6 libx11-data libx11-dev libxau-dev libxau6 libxcb-render0
  libxcb-render0-dev libxcb-shm0 libxcb-shm0-dev libxcb1 libxcb1-dev
  libxcomposite-dev libxcomposite1 libxcursor-dev libxcursor1 libxdamage-dev
  libxdamage1 libxdmcp-dev libxdmcp6 libxext-dev libxext6 libxfixes-dev
  libxfixes3 libxft-dev libxft2 libxi-dev libxi6 libxine2-bin libxine2-dev
  libxinerama-dev libxinerama1 libxml-parser-perl libxml2 libxml2-utils
  libxrandr-dev libxrandr2 libxrender-dev libxrender1 m4 man-db mime-support
  netbase openssl pango1.0-tools perl-openssl-defaults pkg-config po-debconf
  psmisc python3 python3-distutils python3-lib2to3 python3-minimal python3.7
  python3.7-minimal sbuild-build-depends-me-tv-dummy sensible-utils
  shared-mime-info systemd systemd-sysv ucf uuid-dev x11-common
  x11proto-composite-dev x11proto-core-dev x11proto-damage-dev x11proto-dev
  x11proto-fixes-dev x11proto-input-dev x11proto-randr-dev x11proto-xext-dev
  x11proto-xinerama-dev xorg-sgml-doctools xtrans-dev zlib1g-dev
0 upgraded, 265 newly installed, 0 to remove and 2 not upgraded.
Need to get 96.8 MB of archives.
After this operation, 345 MB of additional disk space will be used.
Get:1 copy:/<<BUILDDIR>>/resolver-ierqvK/apt_archive ./ sbuild-build-depends-me-tv-dummy 0.invalid.0 [952 B]
Get:2 http://172.17.0.1/private bullseye-staging/main armhf libbsd0 armhf 0.10.0-1 [112 kB]
Get:3 http://172.17.0.1/private bullseye-staging/main armhf libtinfo5 armhf 6.1+20191019-1 [316 kB]
Get:4 http://172.17.0.1/private bullseye-staging/main armhf bsdmainutils armhf 11.1.2 [182 kB]
Get:5 http://172.17.0.1/private bullseye-staging/main armhf libuchardet0 armhf 0.0.6-3 [62.2 kB]
Get:6 http://172.17.0.1/private bullseye-staging/main armhf groff-base armhf 1.22.4-4 [783 kB]
Get:7 http://172.17.0.1/private bullseye-staging/main armhf libpipeline1 armhf 1.5.2-2 [29.6 kB]
Get:8 http://172.17.0.1/private bullseye-staging/main armhf man-db armhf 2.9.0-2 [1261 kB]
Get:9 http://172.17.0.1/private bullseye-staging/main armhf libapparmor1 armhf 2.13.3-7 [92.3 kB]
Get:10 http://172.17.0.1/private bullseye-staging/main armhf libargon2-1 armhf 0~20171227-0.2 [20.4 kB]
Get:11 http://172.17.0.1/private bullseye-staging/main armhf dmsetup armhf 2:1.02.167-1 [90.4 kB]
Get:12 http://172.17.0.1/private bullseye-staging/main armhf libdevmapper1.02.1 armhf 2:1.02.167-1 [133 kB]
Get:13 http://172.17.0.1/private bullseye-staging/main armhf libjson-c4 armhf 0.13.1+dfsg-6 [33.2 kB]
Get:14 http://172.17.0.1/private bullseye-staging/main armhf libssl1.1 armhf 1.1.1d-2 [1268 kB]
Get:15 http://172.17.0.1/private bullseye-staging/main armhf libcryptsetup12 armhf 2:2.2.2-2 [205 kB]
Get:16 http://172.17.0.1/private bullseye-staging/main armhf libip4tc2 armhf 1.8.3-2 [68.4 kB]
Get:17 http://172.17.0.1/private bullseye-staging/main armhf libkmod2 armhf 26+20191223-1 [47.9 kB]
Get:18 http://172.17.0.1/private bullseye-staging/main armhf systemd armhf 244-3+rpi1+b1 [3565 kB]
Get:19 http://172.17.0.1/private bullseye-staging/main armhf systemd-sysv armhf 244-3+rpi1+b1 [103 kB]
Get:20 http://172.17.0.1/private bullseye-staging/main armhf libpython3.7-minimal armhf 3.7.6-1 [585 kB]
Get:21 http://172.17.0.1/private bullseye-staging/main armhf libexpat1 armhf 2.2.9-1 [71.5 kB]
Get:22 http://172.17.0.1/private bullseye-staging/main armhf python3.7-minimal armhf 3.7.6-1 [1527 kB]
Get:23 http://172.17.0.1/private bullseye-staging/main armhf python3-minimal armhf 3.7.5-3 [36.8 kB]
Get:24 http://172.17.0.1/private bullseye-staging/main armhf mime-support all 3.64 [37.8 kB]
Get:25 http://172.17.0.1/private bullseye-staging/main armhf libmpdec2 armhf 2.4.2-2 [67.2 kB]
Get:26 http://172.17.0.1/private bullseye-staging/main armhf libpython3.7-stdlib armhf 3.7.6-1 [1669 kB]
Get:27 http://172.17.0.1/private bullseye-staging/main armhf python3.7 armhf 3.7.6-1 [350 kB]
Get:28 http://172.17.0.1/private bullseye-staging/main armhf libpython3-stdlib armhf 3.7.5-3 [20.2 kB]
Get:29 http://172.17.0.1/private bullseye-staging/main armhf python3 armhf 3.7.5-3 [62.1 kB]
Get:30 http://172.17.0.1/private bullseye-staging/main armhf netbase all 6.0 [19.9 kB]
Get:31 http://172.17.0.1/private bullseye-staging/main armhf sensible-utils all 0.0.12+nmu1 [16.0 kB]
Get:32 http://172.17.0.1/private bullseye-staging/main armhf libdbus-1-3 armhf 1.12.16-2+b1 [189 kB]
Get:33 http://172.17.0.1/private bullseye-staging/main armhf dbus armhf 1.12.16-2+b1 [212 kB]
Get:34 http://172.17.0.1/private bullseye-staging/main armhf libmagic-mgc armhf 1:5.38-3 [262 kB]
Get:35 http://172.17.0.1/private bullseye-staging/main armhf libmagic1 armhf 1:5.38-3 [112 kB]
Get:36 http://172.17.0.1/private bullseye-staging/main armhf file armhf 1:5.38-3 [66.8 kB]
Get:37 http://172.17.0.1/private bullseye-staging/main armhf gettext-base armhf 0.19.8.1-10 [117 kB]
Get:38 http://172.17.0.1/private bullseye-staging/main armhf libpam-systemd armhf 244-3+rpi1+b1 [200 kB]
Get:39 http://172.17.0.1/private bullseye-staging/main armhf ucf all 3.0038+nmu1 [69.0 kB]
Get:40 http://172.17.0.1/private bullseye-staging/main armhf hicolor-icon-theme all 0.17-2 [11.4 kB]
Get:41 http://172.17.0.1/private bullseye-staging/main armhf libglib2.0-0 armhf 2.62.4-1 [1138 kB]
Get:42 http://172.17.0.1/private bullseye-staging/main armhf libjpeg62-turbo armhf 1:1.5.2-2+b1 [110 kB]
Get:43 http://172.17.0.1/private bullseye-staging/main armhf libpng16-16 armhf 1.6.37-1 [274 kB]
Get:44 http://172.17.0.1/private bullseye-staging/main armhf libjbig0 armhf 2.1-3.1+b2 [27.6 kB]
Get:45 http://172.17.0.1/private bullseye-staging/main armhf libwebp6 armhf 0.6.1-2 [228 kB]
Get:46 http://172.17.0.1/private bullseye-staging/main armhf libtiff5 armhf 4.1.0+git191117-2 [250 kB]
Get:47 http://172.17.0.1/private bullseye-staging/main armhf libxau6 armhf 1:1.0.8-1+b2 [19.1 kB]
Get:48 http://172.17.0.1/private bullseye-staging/main armhf libxdmcp6 armhf 1:1.1.2-3 [25.0 kB]
Get:49 http://172.17.0.1/private bullseye-staging/main armhf libxcb1 armhf 1.13.1-2 [132 kB]
Get:50 http://172.17.0.1/private bullseye-staging/main armhf libx11-data all 2:1.6.8-1 [298 kB]
Get:51 http://172.17.0.1/private bullseye-staging/main armhf libx11-6 armhf 2:1.6.8-1 [691 kB]
Get:52 http://172.17.0.1/private bullseye-staging/main armhf libicu63 armhf 63.2-2 [7974 kB]
Get:53 http://172.17.0.1/private bullseye-staging/main armhf libxml2 armhf 2.9.4+dfsg1-8 [593 kB]
Get:54 http://172.17.0.1/private bullseye-staging/main armhf shared-mime-info armhf 1.10-1 [762 kB]
Get:55 http://172.17.0.1/private bullseye-staging/main armhf libgdk-pixbuf2.0-common all 2.40.0+dfsg-2+rpi1 [317 kB]
Get:56 http://172.17.0.1/private bullseye-staging/main armhf libgdk-pixbuf2.0-0 armhf 2.40.0+dfsg-2+rpi1 [158 kB]
Get:57 http://172.17.0.1/private bullseye-staging/main armhf gtk-update-icon-cache armhf 3.24.13-1 [83.0 kB]
Get:58 http://172.17.0.1/private bullseye-staging/main armhf libfreetype6 armhf 2.10.1-2 [330 kB]
Get:59 http://172.17.0.1/private bullseye-staging/main armhf fonts-dejavu-core all 2.37-1 [1068 kB]
Get:60 http://172.17.0.1/private bullseye-staging/main armhf fontconfig-config all 2.13.1-2 [280 kB]
Get:61 http://172.17.0.1/private bullseye-staging/main armhf libfontconfig1 armhf 2.13.1-2 [327 kB]
Get:62 http://172.17.0.1/private bullseye-staging/main armhf libpixman-1-0 armhf 0.36.0-1 [458 kB]
Get:63 http://172.17.0.1/private bullseye-staging/main armhf libxcb-render0 armhf 1.13.1-2 [108 kB]
Get:64 http://172.17.0.1/private bullseye-staging/main armhf libxcb-shm0 armhf 1.13.1-2 [99.3 kB]
Get:65 http://172.17.0.1/private bullseye-staging/main armhf libxext6 armhf 2:1.3.3-1+b2 [47.8 kB]
Get:66 http://172.17.0.1/private bullseye-staging/main armhf libxrender1 armhf 1:0.9.10-1 [29.9 kB]
Get:67 http://172.17.0.1/private bullseye-staging/main armhf libcairo2 armhf 1.16.0-4 [599 kB]
Get:68 http://172.17.0.1/private bullseye-staging/main armhf libcroco3 armhf 0.6.13-1 [133 kB]
Get:69 http://172.17.0.1/private bullseye-staging/main armhf fontconfig armhf 2.13.1-2 [404 kB]
Get:70 http://172.17.0.1/private bullseye-staging/main armhf libfribidi0 armhf 1.0.7-1.1 [62.8 kB]
Get:71 http://172.17.0.1/private bullseye-staging/main armhf libthai-data all 0.1.28-3 [170 kB]
Get:72 http://172.17.0.1/private bullseye-staging/main armhf libdatrie1 armhf 0.2.12-3+b1 [36.4 kB]
Get:73 http://172.17.0.1/private bullseye-staging/main armhf libthai0 armhf 0.1.28-3 [51.0 kB]
Get:74 http://172.17.0.1/private bullseye-staging/main armhf libpango-1.0-0 armhf 1.42.4-7+b1 [168 kB]
Get:75 http://172.17.0.1/private bullseye-staging/main armhf libgraphite2-3 armhf 1.3.13-11 [70.1 kB]
Get:76 http://172.17.0.1/private bullseye-staging/main armhf libharfbuzz0b armhf 2.6.4-1+rpi1 [1308 kB]
Get:77 http://172.17.0.1/private bullseye-staging/main armhf libpangoft2-1.0-0 armhf 1.42.4-7+b1 [62.2 kB]
Get:78 http://172.17.0.1/private bullseye-staging/main armhf libpangocairo-1.0-0 armhf 1.42.4-7+b1 [51.9 kB]
Get:79 http://172.17.0.1/private bullseye-staging/main armhf librsvg2-2 armhf 2.46.4-1 [1071 kB]
Get:80 http://172.17.0.1/private bullseye-staging/main armhf librsvg2-common armhf 2.46.4-1 [23.6 kB]
Get:81 http://172.17.0.1/private bullseye-staging/main armhf adwaita-icon-theme all 3.34.0-2 [11.0 MB]
Get:82 http://172.17.0.1/private bullseye-staging/main armhf libsigsegv2 armhf 2.12-2 [32.3 kB]
Get:83 http://172.17.0.1/private bullseye-staging/main armhf m4 armhf 1.4.18-4 [185 kB]
Get:84 http://172.17.0.1/private bullseye-staging/main armhf autoconf all 2.69-11 [341 kB]
Get:85 http://172.17.0.1/private bullseye-staging/main armhf autotools-dev all 20180224.1 [77.0 kB]
Get:86 http://172.17.0.1/private bullseye-staging/main armhf automake all 1:1.16.1-4 [771 kB]
Get:87 http://172.17.0.1/private bullseye-staging/main armhf autopoint all 0.19.8.1-10 [435 kB]
Get:88 http://172.17.0.1/private bullseye-staging/main armhf openssl armhf 1.1.1d-2 [806 kB]
Get:89 http://172.17.0.1/private bullseye-staging/main armhf ca-certificates all 20190110 [157 kB]
Get:90 http://172.17.0.1/private bullseye-staging/main armhf dbus-user-session armhf 1.12.16-2+b1 [93.9 kB]
Get:91 http://172.17.0.1/private bullseye-staging/main armhf libtool all 2.4.6-11 [547 kB]
Get:92 http://172.17.0.1/private bullseye-staging/main armhf dh-autoreconf all 19 [16.9 kB]
Get:93 http://172.17.0.1/private bullseye-staging/main armhf libdebhelper-perl all 12.7.3 [174 kB]
Get:94 http://172.17.0.1/private bullseye-staging/main armhf libarchive-zip-perl all 1.67-1 [104 kB]
Get:95 http://172.17.0.1/private bullseye-staging/main armhf libsub-override-perl all 0.09-2 [10.2 kB]
Get:96 http://172.17.0.1/private bullseye-staging/main armhf libfile-stripnondeterminism-perl all 1.6.3-2 [23.7 kB]
Get:97 http://172.17.0.1/private bullseye-staging/main armhf dh-strip-nondeterminism all 1.6.3-2 [14.7 kB]
Get:98 http://172.17.0.1/private bullseye-staging/main armhf libelf1 armhf 0.176-1.1 [158 kB]
Get:99 http://172.17.0.1/private bullseye-staging/main armhf dwz armhf 0.13-5 [142 kB]
Get:100 http://172.17.0.1/private bullseye-staging/main armhf gettext armhf 0.19.8.1-10 [1219 kB]
Get:101 http://172.17.0.1/private bullseye-staging/main armhf intltool-debian all 0.35.0+20060710.5 [26.8 kB]
Get:102 http://172.17.0.1/private bullseye-staging/main armhf po-debconf all 1.0.21 [248 kB]
Get:103 http://172.17.0.1/private bullseye-staging/main armhf debhelper all 12.7.3 [1019 kB]
Get:104 http://172.17.0.1/private bullseye-staging/main armhf libdbus-glib-1-2 armhf 0.110-5 [61.4 kB]
Get:105 http://172.17.0.1/private bullseye-staging/main armhf gconf2-common all 3.2.6-6 [1039 kB]
Get:106 http://172.17.0.1/private bullseye-staging/main armhf libgconf-2-4 armhf 3.2.6-6 [415 kB]
Get:107 http://172.17.0.1/private bullseye-staging/main armhf gconf-service armhf 3.2.6-6 [406 kB]
Get:108 http://172.17.0.1/private bullseye-staging/main armhf psmisc armhf 23.3-1 [125 kB]
Get:109 http://172.17.0.1/private bullseye-staging/main armhf gconf2 armhf 3.2.6-6 [420 kB]
Get:110 http://172.17.0.1/private bullseye-staging/main armhf libgirepository-1.0-1 armhf 1.62.0-2 [80.2 kB]
Get:111 http://172.17.0.1/private bullseye-staging/main armhf gir1.2-glib-2.0 armhf 1.62.0-2 [145 kB]
Get:112 http://172.17.0.1/private bullseye-staging/main armhf libatk1.0-data all 2.34.1-1 [146 kB]
Get:113 http://172.17.0.1/private bullseye-staging/main armhf libatk1.0-0 armhf 2.34.1-1 [43.6 kB]
Get:114 http://172.17.0.1/private bullseye-staging/main armhf gir1.2-atk-1.0 armhf 2.34.1-1 [25.8 kB]
Get:115 http://172.17.0.1/private bullseye-staging/main armhf gir1.2-freedesktop armhf 1.62.0-2 [31.1 kB]
Get:116 http://172.17.0.1/private bullseye-staging/main armhf gir1.2-gconf-2.0 armhf 3.2.6-6 [363 kB]
Get:117 http://172.17.0.1/private bullseye-staging/main armhf gir1.2-gdkpixbuf-2.0 armhf 2.40.0+dfsg-2+rpi1 [18.8 kB]
Get:118 http://172.17.0.1/private bullseye-staging/main armhf libgtk2.0-common all 2.24.32-4 [2701 kB]
Get:119 http://172.17.0.1/private bullseye-staging/main armhf libxft2 armhf 2.3.2-2 [49.3 kB]
Get:120 http://172.17.0.1/private bullseye-staging/main armhf libpangoxft-1.0-0 armhf 1.42.4-7+b1 [47.4 kB]
Get:121 http://172.17.0.1/private bullseye-staging/main armhf gir1.2-pango-1.0 armhf 1.42.4-7+b1 [55.7 kB]
Get:122 http://172.17.0.1/private bullseye-staging/main armhf libavahi-common-data armhf 0.7-5 [122 kB]
Get:123 http://172.17.0.1/private bullseye-staging/main armhf libavahi-common3 armhf 0.7-5 [51.2 kB]
Get:124 http://172.17.0.1/private bullseye-staging/main armhf libavahi-client3 armhf 0.7-5 [54.2 kB]
Get:125 http://172.17.0.1/private bullseye-staging/main armhf libkeyutils1 armhf 1.6-6 [14.0 kB]
Get:126 http://172.17.0.1/private bullseye-staging/main armhf libkrb5support0 armhf 1.17-6+b1 [61.5 kB]
Get:127 http://172.17.0.1/private bullseye-staging/main armhf libk5crypto3 armhf 1.17-6+b1 [112 kB]
Get:128 http://172.17.0.1/private bullseye-staging/main armhf libkrb5-3 armhf 1.17-6+b1 [316 kB]
Get:129 http://172.17.0.1/private bullseye-staging/main armhf libgssapi-krb5-2 armhf 1.17-6+b1 [134 kB]
Get:130 http://172.17.0.1/private bullseye-staging/main armhf libcups2 armhf 2.3.1-1 [309 kB]
Get:131 http://172.17.0.1/private bullseye-staging/main armhf libxcomposite1 armhf 1:0.4.4-2 [16.1 kB]
Get:132 http://172.17.0.1/private bullseye-staging/main armhf libxfixes3 armhf 1:5.0.3-1 [20.6 kB]
Get:133 http://172.17.0.1/private bullseye-staging/main armhf libxcursor1 armhf 1:1.2.0-2 [34.2 kB]
Get:134 http://172.17.0.1/private bullseye-staging/main armhf libxdamage1 armhf 1:1.1.5-1 [15.1 kB]
Get:135 http://172.17.0.1/private bullseye-staging/main armhf libxi6 armhf 2:1.7.9-1 [77.8 kB]
Get:136 http://172.17.0.1/private bullseye-staging/main armhf libxinerama1 armhf 2:1.1.4-2 [17.3 kB]
Get:137 http://172.17.0.1/private bullseye-staging/main armhf libxrandr2 armhf 2:1.5.1-1 [34.5 kB]
Get:138 http://172.17.0.1/private bullseye-staging/main armhf libgtk2.0-0 armhf 2.24.32-4 [1501 kB]
Get:139 http://172.17.0.1/private bullseye-staging/main armhf gir1.2-gtk-2.0 armhf 2.24.32-4 [214 kB]
Get:140 http://172.17.0.1/private bullseye-staging/main armhf gir1.2-harfbuzz-0.0 armhf 2.6.4-1+rpi1 [997 kB]
Get:141 http://172.17.0.1/private bullseye-staging/main armhf icu-devtools armhf 63.2-2 [163 kB]
Get:142 http://172.17.0.1/private bullseye-staging/main armhf liburi-perl all 1.76-1 [89.9 kB]
Get:143 http://172.17.0.1/private bullseye-staging/main armhf libencode-locale-perl all 1.05-1 [13.7 kB]
Get:144 http://172.17.0.1/private bullseye-staging/main armhf libtimedate-perl all 2.3100-1 [39.0 kB]
Get:145 http://172.17.0.1/private bullseye-staging/main armhf libhttp-date-perl all 6.05-1 [10.4 kB]
Get:146 http://172.17.0.1/private bullseye-staging/main armhf libfile-listing-perl all 6.04-1 [10.3 kB]
Get:147 http://172.17.0.1/private bullseye-staging/main armhf libhtml-tagset-perl all 3.20-4 [13.0 kB]
Get:148 http://172.17.0.1/private bullseye-staging/main armhf libhtml-parser-perl armhf 3.72-3+b5 [101 kB]
Get:149 http://172.17.0.1/private bullseye-staging/main armhf libhtml-tree-perl all 5.07-2 [213 kB]
Get:150 http://172.17.0.1/private bullseye-staging/main armhf libio-html-perl all 1.001-1 [17.6 kB]
Get:151 http://172.17.0.1/private bullseye-staging/main armhf liblwp-mediatypes-perl all 6.04-1 [19.9 kB]
Get:152 http://172.17.0.1/private bullseye-staging/main armhf libhttp-message-perl all 6.18-1 [77.8 kB]
Get:153 http://172.17.0.1/private bullseye-staging/main armhf libhttp-cookies-perl all 6.08-1 [19.3 kB]
Get:154 http://172.17.0.1/private bullseye-staging/main armhf libhttp-negotiate-perl all 6.01-1 [12.8 kB]
Get:155 http://172.17.0.1/private bullseye-staging/main armhf perl-openssl-defaults armhf 3 [6782 B]
Get:156 http://172.17.0.1/private bullseye-staging/main armhf libnet-ssleay-perl armhf 1.88-2 [300 kB]
Get:157 http://172.17.0.1/private bullseye-staging/main armhf libio-socket-ssl-perl all 2.066-1 [210 kB]
Get:158 http://172.17.0.1/private bullseye-staging/main armhf libnet-http-perl all 6.19-1 [24.8 kB]
Get:159 http://172.17.0.1/private bullseye-staging/main armhf liblwp-protocol-https-perl all 6.07-2 [9242 B]
Get:160 http://172.17.0.1/private bullseye-staging/main armhf libtry-tiny-perl all 0.30-1 [23.3 kB]
Get:161 http://172.17.0.1/private bullseye-staging/main armhf libwww-robotrules-perl all 6.02-1 [12.9 kB]
Get:162 http://172.17.0.1/private bullseye-staging/main armhf libwww-perl all 6.43-1 [191 kB]
Get:163 http://172.17.0.1/private bullseye-staging/main armhf libxml-parser-perl armhf 2.46-1+b1 [203 kB]
Get:164 http://172.17.0.1/private bullseye-staging/main armhf intltool all 0.51.0-5 [50.2 kB]
Get:165 http://172.17.0.1/private bullseye-staging/main armhf pkg-config armhf 0.29-6 [59.8 kB]
Get:166 http://172.17.0.1/private bullseye-staging/main armhf libffi-dev armhf 3.2.1-9 [159 kB]
Get:167 http://172.17.0.1/private bullseye-staging/main armhf libglib2.0-data all 2.62.4-1 [1121 kB]
Get:168 http://172.17.0.1/private bullseye-staging/main armhf libglib2.0-bin armhf 2.62.4-1 [124 kB]
Get:169 http://172.17.0.1/private bullseye-staging/main armhf python3-lib2to3 all 3.8.0-1 [78.3 kB]
Get:170 http://172.17.0.1/private bullseye-staging/main armhf python3-distutils all 3.8.0-1 [145 kB]
Get:171 http://172.17.0.1/private bullseye-staging/main armhf libglib2.0-dev-bin armhf 2.62.4-1 [162 kB]
Get:172 http://172.17.0.1/private bullseye-staging/main armhf uuid-dev armhf 2.34-0.1 [92.5 kB]
Get:173 http://172.17.0.1/private bullseye-staging/main armhf libblkid-dev armhf 2.34-0.1 [212 kB]
Get:174 http://172.17.0.1/private bullseye-staging/main armhf libmount-dev armhf 2.34-0.1 [212 kB]
Get:175 http://172.17.0.1/private bullseye-staging/main armhf libpcre16-3 armhf 2:8.39-12 [234 kB]
Get:176 http://172.17.0.1/private bullseye-staging/main armhf libpcre32-3 armhf 2:8.39-12 [227 kB]
Get:177 http://172.17.0.1/private bullseye-staging/main armhf libpcrecpp0v5 armhf 2:8.39-12 [150 kB]
Get:178 http://172.17.0.1/private bullseye-staging/main armhf libpcre3-dev armhf 2:8.39-12 [564 kB]
Get:179 http://172.17.0.1/private bullseye-staging/main armhf libsepol1-dev armhf 3.0-1 [306 kB]
Get:180 http://172.17.0.1/private bullseye-staging/main armhf libpcre2-16-0 armhf 10.34-7 [190 kB]
Get:181 http://172.17.0.1/private bullseye-staging/main armhf libpcre2-32-0 armhf 10.34-7 [181 kB]
Get:182 http://172.17.0.1/private bullseye-staging/main armhf libpcre2-posix2 armhf 10.34-7 [44.7 kB]
Get:183 http://172.17.0.1/private bullseye-staging/main armhf libpcre2-dev armhf 10.34-7 [614 kB]
Get:184 http://172.17.0.1/private bullseye-staging/main armhf libselinux1-dev armhf 3.0-1 [158 kB]
Get:185 http://172.17.0.1/private bullseye-staging/main armhf zlib1g-dev armhf 1:1.2.11.dfsg-1 [206 kB]
Get:186 http://172.17.0.1/private bullseye-staging/main armhf libglib2.0-dev armhf 2.62.4-1 [1431 kB]
Get:187 http://172.17.0.1/private bullseye-staging/main armhf libatk1.0-dev armhf 2.34.1-1 [102 kB]
Get:188 http://172.17.0.1/private bullseye-staging/main armhf libsigc++-2.0-0v5 armhf 2.10.2-1 [62.3 kB]
Get:189 http://172.17.0.1/private bullseye-staging/main armhf libglibmm-2.4-1v5 armhf 2.62.0-1 [674 kB]
Get:190 http://172.17.0.1/private bullseye-staging/main armhf libatkmm-1.6-1v5 armhf 2.28.0-2 [58.6 kB]
Get:191 http://172.17.0.1/private bullseye-staging/main armhf libsigc++-2.0-dev armhf 2.10.2-1 [117 kB]
Get:192 http://172.17.0.1/private bullseye-staging/main armhf libglibmm-2.4-dev armhf 2.62.0-1 [647 kB]
Get:193 http://172.17.0.1/private bullseye-staging/main armhf libatkmm-1.6-dev armhf 2.28.0-2 [40.6 kB]
Get:194 http://172.17.0.1/private bullseye-staging/main armhf libcairo-gobject2 armhf 1.16.0-4 [123 kB]
Get:195 http://172.17.0.1/private bullseye-staging/main armhf liblzo2-2 armhf 2.10-0.1 [48.4 kB]
Get:196 http://172.17.0.1/private bullseye-staging/main armhf libcairo-script-interpreter2 armhf 1.16.0-4 [150 kB]
Get:197 http://172.17.0.1/private bullseye-staging/main armhf libexpat1-dev armhf 2.2.9-1 [119 kB]
Get:198 http://172.17.0.1/private bullseye-staging/main armhf libpng-dev armhf 1.6.37-1 [275 kB]
Get:199 http://172.17.0.1/private bullseye-staging/main armhf libfreetype-dev armhf 2.10.1-2 [482 kB]
Get:200 http://172.17.0.1/private bullseye-staging/main armhf libfreetype6-dev armhf 2.10.1-2 [63.8 kB]
Get:201 http://172.17.0.1/private bullseye-staging/main armhf libfontconfig1-dev armhf 2.13.1-2 [943 kB]
Get:202 http://172.17.0.1/private bullseye-staging/main armhf xorg-sgml-doctools all 1:1.11-1 [21.9 kB]
Get:203 http://172.17.0.1/private bullseye-staging/main armhf x11proto-dev all 2018.4-4 [251 kB]
Get:204 http://172.17.0.1/private bullseye-staging/main armhf x11proto-core-dev all 2018.4-4 [3128 B]
Get:205 http://172.17.0.1/private bullseye-staging/main armhf libxau-dev armhf 1:1.0.8-1+b2 [22.4 kB]
Get:206 http://172.17.0.1/private bullseye-staging/main armhf libxdmcp-dev armhf 1:1.1.2-3 [40.9 kB]
Get:207 http://172.17.0.1/private bullseye-staging/main armhf x11proto-input-dev all 2018.4-4 [3132 B]
Get:208 http://172.17.0.1/private bullseye-staging/main armhf xtrans-dev all 1.3.5-1 [100 kB]
Get:209 http://172.17.0.1/private bullseye-staging/main armhf libpthread-stubs0-dev armhf 0.4-1 [5344 B]
Get:210 http://172.17.0.1/private bullseye-staging/main armhf libxcb1-dev armhf 1.13.1-2 [169 kB]
Get:211 http://172.17.0.1/private bullseye-staging/main armhf libx11-dev armhf 2:1.6.8-1 [760 kB]
Get:212 http://172.17.0.1/private bullseye-staging/main armhf libxrender-dev armhf 1:0.9.10-1 [37.7 kB]
Get:213 http://172.17.0.1/private bullseye-staging/main armhf x11proto-xext-dev all 2018.4-4 [3128 B]
Get:214 http://172.17.0.1/private bullseye-staging/main armhf libxext-dev armhf 2:1.3.3-1+b2 [102 kB]
Get:215 http://172.17.0.1/private bullseye-staging/main armhf x11-common all 1:7.7+20 [252 kB]
Get:216 http://172.17.0.1/private bullseye-staging/main armhf libice6 armhf 2:1.0.9-2 [51.6 kB]
Get:217 http://172.17.0.1/private bullseye-staging/main armhf libsm6 armhf 2:1.2.3-1 [32.9 kB]
Get:218 http://172.17.0.1/private bullseye-staging/main armhf libice-dev armhf 2:1.0.9-2 [58.8 kB]
Get:219 http://172.17.0.1/private bullseye-staging/main armhf libsm-dev armhf 2:1.2.3-1 [35.4 kB]
Get:220 http://172.17.0.1/private bullseye-staging/main armhf libpixman-1-dev armhf 0.36.0-1 [477 kB]
Get:221 http://172.17.0.1/private bullseye-staging/main armhf libxcb-render0-dev armhf 1.13.1-2 [111 kB]
Get:222 http://172.17.0.1/private bullseye-staging/main armhf libxcb-shm0-dev armhf 1.13.1-2 [100 kB]
Get:223 http://172.17.0.1/private bullseye-staging/main armhf libcairo2-dev armhf 1.16.0-4 [619 kB]
Get:224 http://172.17.0.1/private bullseye-staging/main armhf libcairomm-1.0-1v5 armhf 1.12.2-4 [57.8 kB]
Get:225 http://172.17.0.1/private bullseye-staging/main armhf libcairomm-1.0-dev armhf 1.12.2-4 [587 kB]
Get:226 http://172.17.0.1/private bullseye-staging/main armhf libdbus-1-dev armhf 1.12.16-2+b1 [221 kB]
Get:227 http://172.17.0.1/private bullseye-staging/main armhf libdbus-glib-1-dev-bin armhf 0.110-5 [48.2 kB]
Get:228 http://172.17.0.1/private bullseye-staging/main armhf libdbus-glib-1-dev armhf 0.110-5 [71.8 kB]
Get:229 http://172.17.0.1/private bullseye-staging/main armhf libfribidi-dev armhf 1.0.7-1.1 [103 kB]
Get:230 http://172.17.0.1/private bullseye-staging/main armhf libgconf2-dev armhf 3.2.6-6 [438 kB]
Get:231 http://172.17.0.1/private bullseye-staging/main armhf libgconfmm-2.6-1v5 armhf 2.28.3-1 [28.0 kB]
Get:232 http://172.17.0.1/private bullseye-staging/main armhf libgconfmm-2.6-dev armhf 2.28.3-1 [37.2 kB]
Get:233 http://172.17.0.1/private bullseye-staging/main armhf libgdk-pixbuf2.0-bin armhf 2.40.0+dfsg-2+rpi1 [23.6 kB]
Get:234 http://172.17.0.1/private bullseye-staging/main armhf libgdk-pixbuf2.0-dev armhf 2.40.0+dfsg-2+rpi1 [54.2 kB]
Get:235 http://172.17.0.1/private bullseye-staging/main armhf libgraphite2-dev armhf 1.3.13-11 [23.9 kB]
Get:236 http://172.17.0.1/private bullseye-staging/main armhf libharfbuzz-icu0 armhf 2.6.4-1+rpi1 [976 kB]
Get:237 http://172.17.0.1/private bullseye-staging/main armhf libharfbuzz-gobject0 armhf 2.6.4-1+rpi1 [988 kB]
Get:238 http://172.17.0.1/private bullseye-staging/main armhf libicu-dev armhf 63.2-2 [8846 kB]
Get:239 http://172.17.0.1/private bullseye-staging/main armhf libharfbuzz-dev armhf 2.6.4-1+rpi1 [1424 kB]
Get:240 http://172.17.0.1/private bullseye-staging/main armhf libxft-dev armhf 2.3.2-2 [60.3 kB]
Get:241 http://172.17.0.1/private bullseye-staging/main armhf pango1.0-tools armhf 1.42.4-7+b1 [53.4 kB]
Get:242 http://172.17.0.1/private bullseye-staging/main armhf libpango1.0-dev armhf 1.42.4-7+b1 [139 kB]
Get:243 http://172.17.0.1/private bullseye-staging/main armhf x11proto-xinerama-dev all 2018.4-4 [3132 B]
Get:244 http://172.17.0.1/private bullseye-staging/main armhf libxinerama-dev armhf 2:1.1.4-2 [19.7 kB]
Get:245 http://172.17.0.1/private bullseye-staging/main armhf x11proto-fixes-dev all 1:2018.4-4 [3140 B]
Get:246 http://172.17.0.1/private bullseye-staging/main armhf libxfixes-dev armhf 1:5.0.3-1 [22.7 kB]
Get:247 http://172.17.0.1/private bullseye-staging/main armhf libxi-dev armhf 2:1.7.9-1 [236 kB]
Get:248 http://172.17.0.1/private bullseye-staging/main armhf x11proto-randr-dev all 2018.4-4 [3132 B]
Get:249 http://172.17.0.1/private bullseye-staging/main armhf libxrandr-dev armhf 2:1.5.1-1 [42.5 kB]
Get:250 http://172.17.0.1/private bullseye-staging/main armhf libxcursor-dev armhf 1:1.2.0-2 [41.7 kB]
Get:251 http://172.17.0.1/private bullseye-staging/main armhf x11proto-composite-dev all 1:2018.4-4 [3140 B]
Get:252 http://172.17.0.1/private bullseye-staging/main armhf libxcomposite-dev armhf 1:0.4.4-2 [19.8 kB]
Get:253 http://172.17.0.1/private bullseye-staging/main armhf x11proto-damage-dev all 1:2018.4-4 [3140 B]
Get:254 http://172.17.0.1/private bullseye-staging/main armhf libxdamage-dev armhf 1:1.1.5-1 [15.0 kB]
Get:255 http://172.17.0.1/private bullseye-staging/main armhf libxml2-utils armhf 2.9.4+dfsg1-8 [96.1 kB]
Get:256 http://172.17.0.1/private bullseye-staging/main armhf libgtk2.0-dev armhf 2.24.32-4 [707 kB]
Get:257 http://172.17.0.1/private bullseye-staging/main armhf libpangomm-1.4-1v5 armhf 2.42.0-2 [51.4 kB]
Get:258 http://172.17.0.1/private bullseye-staging/main armhf libgtkmm-2.4-1v5 armhf 1:2.24.5-4 [692 kB]
Get:259 http://172.17.0.1/private bullseye-staging/main armhf libpangomm-1.4-dev armhf 2.42.0-2 [65.3 kB]
Get:260 http://172.17.0.1/private bullseye-staging/main armhf libgtkmm-2.4-dev armhf 1:2.24.5-4 [611 kB]
Get:261 http://172.17.0.1/private bullseye-staging/main armhf libsqlite3-dev armhf 3.30.1+fossil191229-1 [705 kB]
Get:262 http://172.17.0.1/private bullseye-staging/main armhf libunique-1.0-0 armhf 1.1.6-6 [40.2 kB]
Get:263 http://172.17.0.1/private bullseye-staging/main armhf libunique-dev armhf 1.1.6-6 [44.9 kB]
Get:264 http://172.17.0.1/private bullseye-staging/main armhf libxine2-bin armhf 1.2.9-1+b4 [1469 kB]
Get:265 http://172.17.0.1/private bullseye-staging/main armhf libxine2-dev armhf 1.2.9-1+b4 [73.2 kB]
debconf: delaying package configuration, since apt-utils is not installed
Fetched 96.8 MB in 27s (3572 kB/s)
Selecting previously unselected package libbsd0:armhf.
(Reading database ... 14067 files and directories currently installed.)
Preparing to unpack .../00-libbsd0_0.10.0-1_armhf.deb ...
Unpacking libbsd0:armhf (0.10.0-1) ...
Selecting previously unselected package libtinfo5:armhf.
Preparing to unpack .../01-libtinfo5_6.1+20191019-1_armhf.deb ...
Unpacking libtinfo5:armhf (6.1+20191019-1) ...
Selecting previously unselected package bsdmainutils.
Preparing to unpack .../02-bsdmainutils_11.1.2_armhf.deb ...
Unpacking bsdmainutils (11.1.2) ...
Selecting previously unselected package libuchardet0:armhf.
Preparing to unpack .../03-libuchardet0_0.0.6-3_armhf.deb ...
Unpacking libuchardet0:armhf (0.0.6-3) ...
Selecting previously unselected package groff-base.
Preparing to unpack .../04-groff-base_1.22.4-4_armhf.deb ...
Unpacking groff-base (1.22.4-4) ...
Selecting previously unselected package libpipeline1:armhf.
Preparing to unpack .../05-libpipeline1_1.5.2-2_armhf.deb ...
Unpacking libpipeline1:armhf (1.5.2-2) ...
Selecting previously unselected package man-db.
Preparing to unpack .../06-man-db_2.9.0-2_armhf.deb ...
Unpacking man-db (2.9.0-2) ...
Selecting previously unselected package libapparmor1:armhf.
Preparing to unpack .../07-libapparmor1_2.13.3-7_armhf.deb ...
Unpacking libapparmor1:armhf (2.13.3-7) ...
Selecting previously unselected package libargon2-1:armhf.
Preparing to unpack .../08-libargon2-1_0~20171227-0.2_armhf.deb ...
Unpacking libargon2-1:armhf (0~20171227-0.2) ...
Selecting previously unselected package dmsetup.
Preparing to unpack .../09-dmsetup_2%3a1.02.167-1_armhf.deb ...
Unpacking dmsetup (2:1.02.167-1) ...
Selecting previously unselected package libdevmapper1.02.1:armhf.
Preparing to unpack .../10-libdevmapper1.02.1_2%3a1.02.167-1_armhf.deb ...
Unpacking libdevmapper1.02.1:armhf (2:1.02.167-1) ...
Selecting previously unselected package libjson-c4:armhf.
Preparing to unpack .../11-libjson-c4_0.13.1+dfsg-6_armhf.deb ...
Unpacking libjson-c4:armhf (0.13.1+dfsg-6) ...
Selecting previously unselected package libssl1.1:armhf.
Preparing to unpack .../12-libssl1.1_1.1.1d-2_armhf.deb ...
Unpacking libssl1.1:armhf (1.1.1d-2) ...
Selecting previously unselected package libcryptsetup12:armhf.
Preparing to unpack .../13-libcryptsetup12_2%3a2.2.2-2_armhf.deb ...
Unpacking libcryptsetup12:armhf (2:2.2.2-2) ...
Selecting previously unselected package libip4tc2:armhf.
Preparing to unpack .../14-libip4tc2_1.8.3-2_armhf.deb ...
Unpacking libip4tc2:armhf (1.8.3-2) ...
Selecting previously unselected package libkmod2:armhf.
Preparing to unpack .../15-libkmod2_26+20191223-1_armhf.deb ...
Unpacking libkmod2:armhf (26+20191223-1) ...
Selecting previously unselected package systemd.
Preparing to unpack .../16-systemd_244-3+rpi1+b1_armhf.deb ...
Unpacking systemd (244-3+rpi1+b1) ...
Setting up libapparmor1:armhf (2.13.3-7) ...
Setting up libargon2-1:armhf (0~20171227-0.2) ...
Setting up libjson-c4:armhf (0.13.1+dfsg-6) ...
Setting up libssl1.1:armhf (1.1.1d-2) ...
Setting up libip4tc2:armhf (1.8.3-2) ...
Setting up libkmod2:armhf (26+20191223-1) ...
Setting up libdevmapper1.02.1:armhf (2:1.02.167-1) ...
Setting up libcryptsetup12:armhf (2:2.2.2-2) ...
Setting up systemd (244-3+rpi1+b1) ...
Created symlink /etc/systemd/system/getty.target.wants/getty@tty1.service -> /lib/systemd/system/getty@.service.
Created symlink /etc/systemd/system/multi-user.target.wants/remote-fs.target -> /lib/systemd/system/remote-fs.target.
Created symlink /etc/systemd/system/dbus-org.freedesktop.timesync1.service -> /lib/systemd/system/systemd-timesyncd.service.
Created symlink /etc/systemd/system/sysinit.target.wants/systemd-timesyncd.service -> /lib/systemd/system/systemd-timesyncd.service.
No virtualization found in DMI
No virtualization found in CPUID
Virtualization XEN not found, /proc/xen does not exist
No virtualization found in /proc/device-tree/*
UML virtualization not found in /proc/cpuinfo.
This platform does not support /proc/sysinfo
Found VM virtualization none
Initializing machine ID from random generator.
Reading file '/usr/lib/systemd/catalog/systemd.be.catalog'
File /usr/lib/systemd/catalog/systemd.be.catalog has language be.
Reading file '/usr/lib/systemd/catalog/systemd.be@latin.catalog'
File /usr/lib/systemd/catalog/systemd.be@latin.catalog has language be@latin.
Reading file '/usr/lib/systemd/catalog/systemd.bg.catalog'
File /usr/lib/systemd/catalog/systemd.bg.catalog has language bg.
Reading file '/usr/lib/systemd/catalog/systemd.catalog'
Reading file '/usr/lib/systemd/catalog/systemd.de.catalog'
File /usr/lib/systemd/catalog/systemd.de.catalog has language de.
Reading file '/usr/lib/systemd/catalog/systemd.fr.catalog'
File /usr/lib/systemd/catalog/systemd.fr.catalog has language fr.
Reading file '/usr/lib/systemd/catalog/systemd.it.catalog'
File /usr/lib/systemd/catalog/systemd.it.catalog has language it.
Reading file '/usr/lib/systemd/catalog/systemd.pl.catalog'
File /usr/lib/systemd/catalog/systemd.pl.catalog has language pl.
Reading file '/usr/lib/systemd/catalog/systemd.pt_BR.catalog'
File /usr/lib/systemd/catalog/systemd.pt_BR.catalog has language pt_BR.
Reading file '/usr/lib/systemd/catalog/systemd.ru.catalog'
File /usr/lib/systemd/catalog/systemd.ru.catalog has language ru.
Reading file '/usr/lib/systemd/catalog/systemd.zh_CN.catalog'
File /usr/lib/systemd/catalog/systemd.zh_CN.catalog has language zh_CN.
Reading file '/usr/lib/systemd/catalog/systemd.zh_TW.catalog'
File /usr/lib/systemd/catalog/systemd.zh_TW.catalog has language zh_TW.
Found 369 items in catalog.
Found f77379a8490b408bbe5f6940505a777b, language be
Found d93fb3c9c24d451a97cea615ce59c00b, language be
Found ec387f577b844b8fa948f33cad9a75e6, language be
Found a596d6fe7bfa4994828e72309e95d61e, language be
Found e9bf28e6e834481bb6f48f548ad13606, language be
Found fc2e22bc6ee647b6b90729ab34a250b1, language be
Found 8d45620c1a4348dbb17410da57c60c66, language be
Found 3354939424b4456d9802ca8333ed424a, language be
Found fcbefc5da23d428093f97c82a9290f7b, language be
Found e7852bfe46784ed0accde04bc864c2d5, language be
Found c7a787079b354eaaa9e77b371893cd27, language be
Found 45f82f4aef7a4bbf942ce861d1f20990, language be
Found b07a249cd024414a82dd00cd181378ff, language be
Found 6bbd95ee977941e497c48be27c254128, language be
Found 8811e6df2a8e40f58a94cea26f8ebf14, language be
Found 98268866d1d54a499c4e98921d93bc40, language be
Found 7d4958e842da4a758f6c1cdc7b36dcc5, language be
Found 39f53479d3a045ac8e11786248231fbf, language be
Found de5b426a63be47a7b6ac3eaac82e2f6f, language be
Found 9d1aaa27d60140bd96365438aad20286, language be
Found be02cf6855d2428ba40df7e9d022f03d, language be
Found d34d037fff1847e6ae669a370e694725, language be
Found 7b05ebc668384222baa8881179cfda54, language be
Found 641257651c1b4ec9a8624d7a40a9e1e7, language be
Found 0027229ca0644181a76c4e92458afa2e, language be
Found 1dee0369c7fc4736b7099b38ecb46ee7, language be
Found 24d8d4452573402496068381a6312df2, language be
Found 58432bd3bace477cb514b56381b8a758, language be
Found 36db2dfa5a9045e1bd4af5f93e1cf057, language be
Found 1675d7f172174098b1108bf8c7dc8f5d, language be
Found 4d4408cfd0d144859184d1e65d7c8a65, language be
Found f77379a8490b408bbe5f6940505a777b, language be@latin
Found d93fb3c9c24d451a97cea615ce59c00b, language be@latin
Found ec387f577b844b8fa948f33cad9a75e6, language be@latin
Found a596d6fe7bfa4994828e72309e95d61e, language be@latin
Found e9bf28e6e834481bb6f48f548ad13606, language be@latin
Found fc2e22bc6ee647b6b90729ab34a250b1, language be@latin
Found 8d45620c1a4348dbb17410da57c60c66, language be@latin
Found 3354939424b4456d9802ca8333ed424a, language be@latin
Found fcbefc5da23d428093f97c82a9290f7b, language be@latin
Found e7852bfe46784ed0accde04bc864c2d5, language be@latin
Found c7a787079b354eaaa9e77b371893cd27, language be@latin
Found 45f82f4aef7a4bbf942ce861d1f20990, language be@latin
Found b07a249cd024414a82dd00cd181378ff, language be@latin
Found 6bbd95ee977941e497c48be27c254128, language be@latin
Found 8811e6df2a8e40f58a94cea26f8ebf14, language be@latin
Found 98268866d1d54a499c4e98921d93bc40, language be@latin
Found 7d4958e842da4a758f6c1cdc7b36dcc5, language be@latin
Found 39f53479d3a045ac8e11786248231fbf, language be@latin
Found de5b426a63be47a7b6ac3eaac82e2f6f, language be@latin
Found 9d1aaa27d60140bd96365438aad20286, language be@latin
Found be02cf6855d2428ba40df7e9d022f03d, language be@latin
Found d34d037fff1847e6ae669a370e694725, language be@latin
Found 7b05ebc668384222baa8881179cfda54, language be@latin
Found 641257651c1b4ec9a8624d7a40a9e1e7, language be@latin
Found 0027229ca0644181a76c4e92458afa2e, language be@latin
Found 1dee0369c7fc4736b7099b38ecb46ee7, language be@latin
Found 24d8d4452573402496068381a6312df2, language be@latin
Found 58432bd3bace477cb514b56381b8a758, language be@latin
Found 36db2dfa5a9045e1bd4af5f93e1cf057, language be@latin
Found 1675d7f172174098b1108bf8c7dc8f5d, language be@latin
Found 4d4408cfd0d144859184d1e65d7c8a65, language be@latin
Found f77379a8490b408bbe5f6940505a777b, language bg
Found d93fb3c9c24d451a97cea615ce59c00b, language bg
Found ec387f577b844b8fa948f33cad9a75e6, language bg
Found a596d6fe7bfa4994828e72309e95d61e, language bg
Found e9bf28e6e834481bb6f48f548ad13606, language bg
Found fc2e22bc6ee647b6b90729ab34a250b1, language bg
Found 8d45620c1a4348dbb17410da57c60c66, language bg
Found 3354939424b4456d9802ca8333ed424a, language bg
Found fcbefc5da23d428093f97c82a9290f7b, language bg
Found e7852bfe46784ed0accde04bc864c2d5, language bg
Found c7a787079b354eaaa9e77b371893cd27, language bg
Found 45f82f4aef7a4bbf942ce861d1f20990, language bg
Found b07a249cd024414a82dd00cd181378ff, language bg
Found 6bbd95ee977941e497c48be27c254128, language bg
Found 8811e6df2a8e40f58a94cea26f8ebf14, language bg
Found 98268866d1d54a499c4e98921d93bc40, language bg
Found 7d4958e842da4a758f6c1cdc7b36dcc5, language bg
Found 39f53479d3a045ac8e11786248231fbf, language bg
Found de5b426a63be47a7b6ac3eaac82e2f6f, language bg
Found 9d1aaa27d60140bd96365438aad20286, language bg
Found be02cf6855d2428ba40df7e9d022f03d, language bg
Found d34d037fff1847e6ae669a370e694725, language bg
Found 7b05ebc668384222baa8881179cfda54, language bg
Found 641257651c1b4ec9a8624d7a40a9e1e7, language bg
Found 0027229ca0644181a76c4e92458afa2e, language bg
Found 1dee0369c7fc4736b7099b38ecb46ee7, language bg
Found 24d8d4452573402496068381a6312df2, language bg
Found 58432bd3bace477cb514b56381b8a758, language bg
Found 36db2dfa5a9045e1bd4af5f93e1cf057, language bg
Found 1675d7f172174098b1108bf8c7dc8f5d, language bg
Found 4d4408cfd0d144859184d1e65d7c8a65, language bg
Found f77379a8490b408bbe5f6940505a777b, language C
Found d93fb3c9c24d451a97cea615ce59c00b, language C
Found ec387f577b844b8fa948f33cad9a75e6, language C
Found a596d6fe7bfa4994828e72309e95d61e, language C
Found e9bf28e6e834481bb6f48f548ad13606, language C
Found fc2e22bc6ee647b6b90729ab34a250b1, language C
Found 5aadd8e954dc4b1a8c954d63fd9e1137, language C
Found 8d45620c1a4348dbb17410da57c60c66, language C
Found 3354939424b4456d9802ca8333ed424a, language C
Found fcbefc5da23d428093f97c82a9290f7b, language C
Found e7852bfe46784ed0accde04bc864c2d5, language C
Found c7a787079b354eaaa9e77b371893cd27, language C
Found c7a787079b354eaaa9e77b371893cd27, language de
Found 45f82f4aef7a4bbf942ce861d1f20990, language C
Found b07a249cd024414a82dd00cd181378ff, language C
Found eed00a68ffd84e31882105fd973abdd1, language C
Found 6bbd95ee977941e497c48be27c254128, language C
Found 8811e6df2a8e40f58a94cea26f8ebf14, language C
Found 98268866d1d54a499c4e98921d93bc40, language C
Found 7d4958e842da4a758f6c1cdc7b36dcc5, language C
Found 39f53479d3a045ac8e11786248231fbf, language C
Found be02cf6855d2428ba40df7e9d022f03d, language C
Found de5b426a63be47a7b6ac3eaac82e2f6f, language C
Found 9d1aaa27d60140bd96365438aad20286, language C
Found d34d037fff1847e6ae669a370e694725, language C
Found 7b05ebc668384222baa8881179cfda54, language C
Found 641257651c1b4ec9a8624d7a40a9e1e7, language C
Found 0027229ca0644181a76c4e92458afa2e, language C
Found 1dee0369c7fc4736b7099b38ecb46ee7, language C
Found 24d8d4452573402496068381a6312df2, language C
Found 58432bd3bace477cb514b56381b8a758, language C
Found 36db2dfa5a9045e1bd4af5f93e1cf057, language C
Found 1675d7f172174098b1108bf8c7dc8f5d, language C
Found 4d4408cfd0d144859184d1e65d7c8a65, language C
Found 5eb03494b6584870a536b337290809b3, language C
Found ae8f7b866b0347b9af31fe1c80b127c0, language C
Found 7ad2d189f7e94e70a38c781354912448, language C
Found 0e4284a0caca4bfc81c0bb6786972673, language C
Found d9b373ed55a64feb8242e02dbe79a49c, language C
Found 98e322203f7a4ed290d09fe03c09fe15, language C
Found 50876a9db00f4c40bde1a2ad381c3a1b, language C
Found fe6faa94e7774663a0da52717891d8ef, language C
Found fc2e22bc6ee647b6b90729ab34a250b1, language de
Found f77379a8490b408bbe5f6940505a777b, language fr
Found d93fb3c9c24d451a97cea615ce59c00b, language fr
Found ec387f577b844b8fa948f33cad9a75e6, language fr
Found a596d6fe7bfa4994828e72309e95d61e, language fr
Found e9bf28e6e834481bb6f48f548ad13606, language fr
Found fc2e22bc6ee647b6b90729ab34a250b1, language fr
Found 8d45620c1a4348dbb17410da57c60c66, language fr
Found 3354939424b4456d9802ca8333ed424a, language fr
Found fcbefc5da23d428093f97c82a9290f7b, language fr
Found e7852bfe46784ed0accde04bc864c2d5, language fr
Found c7a787079b354eaaa9e77b371893cd27, language fr
Found 45f82f4aef7a4bbf942ce861d1f20990, language fr
Found b07a249cd024414a82dd00cd181378ff, language fr
Found eed00a68ffd84e31882105fd973abdd1, language fr
Found 6bbd95ee977941e497c48be27c254128, language fr
Found 8811e6df2a8e40f58a94cea26f8ebf14, language fr
Found 98268866d1d54a499c4e98921d93bc40, language fr
Found 7d4958e842da4a758f6c1cdc7b36dcc5, language fr
Found 39f53479d3a045ac8e11786248231fbf, language fr
Found de5b426a63be47a7b6ac3eaac82e2f6f, language fr
Found 9d1aaa27d60140bd96365438aad20286, language fr
Found be02cf6855d2428ba40df7e9d022f03d, language fr
Found d34d037fff1847e6ae669a370e694725, language fr
Found 7b05ebc668384222baa8881179cfda54, language fr
Found 641257651c1b4ec9a8624d7a40a9e1e7, language fr
Found 0027229ca0644181a76c4e92458afa2e, language fr
Found 1dee0369c7fc4736b7099b38ecb46ee7, language fr
Found 24d8d4452573402496068381a6312df2, language fr
Found 58432bd3bace477cb514b56381b8a758, language fr
Found 36db2dfa5a9045e1bd4af5f93e1cf057, language fr
Found 1675d7f172174098b1108bf8c7dc8f5d, language fr
Found 4d4408cfd0d144859184d1e65d7c8a65, language fr
Found 5eb03494b6584870a536b337290809b3, language fr
Found ae8f7b866b0347b9af31fe1c80b127c0, language fr
Found 50876a9db00f4c40bde1a2ad381c3a1b, language fr
Found f77379a8490b408bbe5f6940505a777b, language it
Found d93fb3c9c24d451a97cea615ce59c00b, language it
Found ec387f577b844b8fa948f33cad9a75e6, language it
Found a596d6fe7bfa4994828e72309e95d61e, language it
Found e9bf28e6e834481bb6f48f548ad13606, language it
Found fc2e22bc6ee647b6b90729ab34a250b1, language it
Found 5aadd8e954dc4b1a8c954d63fd9e1137, language it
Found 8d45620c1a4348dbb17410da57c60c66, language it
Found 3354939424b4456d9802ca8333ed424a, language it
Found fcbefc5da23d428093f97c82a9290f7b, language it
Found e7852bfe46784ed0accde04bc864c2d5, language it
Found c7a787079b354eaaa9e77b371893cd27, language it
Found 45f82f4aef7a4bbf942ce861d1f20990, language it
Found b07a249cd024414a82dd00cd181378ff, language it
Found eed00a68ffd84e31882105fd973abdd1, language it
Found 6bbd95ee977941e497c48be27c254128, language it
Found 8811e6df2a8e40f58a94cea26f8ebf14, language it
Found 98268866d1d54a499c4e98921d93bc40, language it
Found 7d4958e842da4a758f6c1cdc7b36dcc5, language it
Found 39f53479d3a045ac8e11786248231fbf, language it
Found de5b426a63be47a7b6ac3eaac82e2f6f, language it
Found 9d1aaa27d60140bd96365438aad20286, language it
Found be02cf6855d2428ba40df7e9d022f03d, language it
Found d34d037fff1847e6ae669a370e694725, language it
Found 7b05ebc668384222baa8881179cfda54, language it
Found 641257651c1b4ec9a8624d7a40a9e1e7, language it
Found 0027229ca0644181a76c4e92458afa2e, language it
Found 1dee0369c7fc4736b7099b38ecb46ee7, language it
Found 24d8d4452573402496068381a6312df2, language it
Found 58432bd3bace477cb514b56381b8a758, language it
Found 36db2dfa5a9045e1bd4af5f93e1cf057, language it
Found 1675d7f172174098b1108bf8c7dc8f5d, language it
Found 4d4408cfd0d144859184d1e65d7c8a65, language it
Found 5eb03494b6584870a536b337290809b3, language it
Found ae8f7b866b0347b9af31fe1c80b127c0, language it
Found 7ad2d189f7e94e70a38c781354912448, language it
Found d9b373ed55a64feb8242e02dbe79a49c, language it
Found 98e322203f7a4ed290d09fe03c09fe15, language it
Found 50876a9db00f4c40bde1a2ad381c3a1b, language it
Found fe6faa94e7774663a0da52717891d8ef, language it
Found f77379a8490b408bbe5f6940505a777b, language pl
Found d93fb3c9c24d451a97cea615ce59c00b, language pl
Found ec387f577b844b8fa948f33cad9a75e6, language pl
Found a596d6fe7bfa4994828e72309e95d61e, language pl
Found e9bf28e6e834481bb6f48f548ad13606, language pl
Found fc2e22bc6ee647b6b90729ab34a250b1, language pl
Found 5aadd8e954dc4b1a8c954d63fd9e1137, language pl
Found 8d45620c1a4348dbb17410da57c60c66, language pl
Found 3354939424b4456d9802ca8333ed424a, language pl
Found fcbefc5da23d428093f97c82a9290f7b, language pl
Found e7852bfe46784ed0accde04bc864c2d5, language pl
Found c7a787079b354eaaa9e77b371893cd27, language pl
Found 45f82f4aef7a4bbf942ce861d1f20990, language pl
Found b07a249cd024414a82dd00cd181378ff, language pl
Found eed00a68ffd84e31882105fd973abdd1, language pl
Found 6bbd95ee977941e497c48be27c254128, language pl
Found 8811e6df2a8e40f58a94cea26f8ebf14, language pl
Found 98268866d1d54a499c4e98921d93bc40, language pl
Found 7d4958e842da4a758f6c1cdc7b36dcc5, language pl
Found 39f53479d3a045ac8e11786248231fbf, language pl
Found be02cf6855d2428ba40df7e9d022f03d, language pl
Found de5b426a63be47a7b6ac3eaac82e2f6f, language pl
Found 9d1aaa27d60140bd96365438aad20286, language pl
Found d34d037fff1847e6ae669a370e694725, language pl
Found 7b05ebc668384222baa8881179cfda54, language pl
Found 641257651c1b4ec9a8624d7a40a9e1e7, language pl
Found 0027229ca0644181a76c4e92458afa2e, language pl
Found 1dee0369c7fc4736b7099b38ecb46ee7, language pl
Found 24d8d4452573402496068381a6312df2, language pl
Found 58432bd3bace477cb514b56381b8a758, language pl
Found 36db2dfa5a9045e1bd4af5f93e1cf057, language pl
Found 1675d7f172174098b1108bf8c7dc8f5d, language pl
Found 4d4408cfd0d144859184d1e65d7c8a65, language pl
Found 5eb03494b6584870a536b337290809b3, language pl
Found ae8f7b866b0347b9af31fe1c80b127c0, language pl
Found 7ad2d189f7e94e70a38c781354912448, language pl
Found 0e4284a0caca4bfc81c0bb6786972673, language pl
Found d9b373ed55a64feb8242e02dbe79a49c, language pl
Found 98e322203f7a4ed290d09fe03c09fe15, language pl
Found 50876a9db00f4c40bde1a2ad381c3a1b, language pl
Found fe6faa94e7774663a0da52717891d8ef, language pl
Found f77379a8490b408bbe5f6940505a777b, language pt_BR
Found d93fb3c9c24d451a97cea615ce59c00b, language pt_BR
Found a596d6fe7bfa4994828e72309e95d61e, language pt_BR
Found e9bf28e6e834481bb6f48f548ad13606, language pt_BR
Found fc2e22bc6ee647b6b90729ab34a250b1, language pt_BR
Found 8d45620c1a4348dbb17410da57c60c66, language pt_BR
Found 3354939424b4456d9802ca8333ed424a, language pt_BR
Found fcbefc5da23d428093f97c82a9290f7b, language pt_BR
Found e7852bfe46784ed0accde04bc864c2d5, language pt_BR
Found c7a787079b354eaaa9e77b371893cd27, language pt_BR
Found 45f82f4aef7a4bbf942ce861d1f20990, language pt_BR
Found b07a249cd024414a82dd00cd181378ff, language pt_BR
Found 6bbd95ee977941e497c48be27c254128, language pt_BR
Found 8811e6df2a8e40f58a94cea26f8ebf14, language pt_BR
Found 98268866d1d54a499c4e98921d93bc40, language pt_BR
Found 7d4958e842da4a758f6c1cdc7b36dcc5, language pt_BR
Found 39f53479d3a045ac8e11786248231fbf, language pt_BR
Found de5b426a63be47a7b6ac3eaac82e2f6f, language pt_BR
Found 9d1aaa27d60140bd96365438aad20286, language pt_BR
Found be02cf6855d2428ba40df7e9d022f03d, language pt_BR
Found d34d037fff1847e6ae669a370e694725, language pt_BR
Found 7b05ebc668384222baa8881179cfda54, language pt_BR
Found 641257651c1b4ec9a8624d7a40a9e1e7, language pt_BR
Found 0027229ca0644181a76c4e92458afa2e, language pt_BR
Found 1dee0369c7fc4736b7099b38ecb46ee7, language pt_BR
Found 24d8d4452573402496068381a6312df2, language pt_BR
Found 58432bd3bace477cb514b56381b8a758, language pt_BR
Found f77379a8490b408bbe5f6940505a777b, language ru
Found d93fb3c9c24d451a97cea615ce59c00b, language ru
Found ec387f577b844b8fa948f33cad9a75e6, language ru
Found a596d6fe7bfa4994828e72309e95d61e, language ru
Found e9bf28e6e834481bb6f48f548ad13606, language ru
Found fc2e22bc6ee647b6b90729ab34a250b1, language ru
Found 5aadd8e954dc4b1a8c954d63fd9e1137, language ru
Found 8d45620c1a4348dbb17410da57c60c66, language ru
Found 3354939424b4456d9802ca8333ed424a, language ru
Found fcbefc5da23d428093f97c82a9290f7b, language ru
Found e7852bfe46784ed0accde04bc864c2d5, language ru
Found c7a787079b354eaaa9e77b371893cd27, language ru
Found 45f82f4aef7a4bbf942ce861d1f20990, language ru
Found b07a249cd024414a82dd00cd181378ff, language ru
Found eed00a68ffd84e31882105fd973abdd1, language ru
Found 6bbd95ee977941e497c48be27c254128, language ru
Found 8811e6df2a8e40f58a94cea26f8ebf14, language ru
Found 98268866d1d54a499c4e98921d93bc40, language ru
Found 7d4958e842da4a758f6c1cdc7b36dcc5, language ru
Found 39f53479d3a045ac8e11786248231fbf, language ru
Found de5b426a63be47a7b6ac3eaac82e2f6f, language ru
Found 9d1aaa27d60140bd96365438aad20286, language ru
Found be02cf6855d2428ba40df7e9d022f03d, language ru
Found d34d037fff1847e6ae669a370e694725, language ru
Found 7b05ebc668384222baa8881179cfda54, language ru
Found 641257651c1b4ec9a8624d7a40a9e1e7, language ru
Found 0027229ca0644181a76c4e92458afa2e, language ru
Found 1dee0369c7fc4736b7099b38ecb46ee7, language ru
Found 24d8d4452573402496068381a6312df2, language ru
Found 58432bd3bace477cb514b56381b8a758, language ru
Found 36db2dfa5a9045e1bd4af5f93e1cf057, language ru
Found 1675d7f172174098b1108bf8c7dc8f5d, language ru
Found 4d4408cfd0d144859184d1e65d7c8a65, language ru
Found 5eb03494b6584870a536b337290809b3, language ru
Found ae8f7b866b0347b9af31fe1c80b127c0, language ru
Found 50876a9db00f4c40bde1a2ad381c3a1b, language ru
Found f77379a8490b408bbe5f6940505a777b, language zh_CN
Found d93fb3c9c24d451a97cea615ce59c00b, language zh_CN
Found a596d6fe7bfa4994828e72309e95d61e, language zh_CN
Found e9bf28e6e834481bb6f48f548ad13606, language zh_CN
Found fc2e22bc6ee647b6b90729ab34a250b1, language zh_CN
Found 8d45620c1a4348dbb17410da57c60c66, language zh_CN
Found 3354939424b4456d9802ca8333ed424a, language zh_CN
Found fcbefc5da23d428093f97c82a9290f7b, language zh_CN
Found e7852bfe46784ed0accde04bc864c2d5, language zh_CN
Found c7a787079b354eaaa9e77b371893cd27, language zh_CN
Found 45f82f4aef7a4bbf942ce861d1f20990, language zh_CN
Found b07a249cd024414a82dd00cd181378ff, language zh_CN
Found 6bbd95ee977941e497c48be27c254128, language zh_CN
Found 8811e6df2a8e40f58a94cea26f8ebf14, language zh_CN
Found 98268866d1d54a499c4e98921d93bc40, language zh_CN
Found 7d4958e842da4a758f6c1cdc7b36dcc5, language zh_CN
Found 39f53479d3a045ac8e11786248231fbf, language zh_CN
Found de5b426a63be47a7b6ac3eaac82e2f6f, language zh_CN
Found 9d1aaa27d60140bd96365438aad20286, language zh_CN
Found be02cf6855d2428ba40df7e9d022f03d, language zh_CN
Found d34d037fff1847e6ae669a370e694725, language zh_CN
Found 7b05ebc668384222baa8881179cfda54, language zh_CN
Found 641257651c1b4ec9a8624d7a40a9e1e7, language zh_CN
Found 0027229ca0644181a76c4e92458afa2e, language zh_CN
Found 1dee0369c7fc4736b7099b38ecb46ee7, language zh_CN
Found 24d8d4452573402496068381a6312df2, language zh_CN
Found 58432bd3bace477cb514b56381b8a758, language zh_CN
Found f77379a8490b408bbe5f6940505a777b, language zh_TW
Found d93fb3c9c24d451a97cea615ce59c00b, language zh_TW
Found a596d6fe7bfa4994828e72309e95d61e, language zh_TW
Found e9bf28e6e834481bb6f48f548ad13606, language zh_TW
Found fc2e22bc6ee647b6b90729ab34a250b1, language zh_TW
Found 8d45620c1a4348dbb17410da57c60c66, language zh_TW
Found 3354939424b4456d9802ca8333ed424a, language zh_TW
Found fcbefc5da23d428093f97c82a9290f7b, language zh_TW
Found e7852bfe46784ed0accde04bc864c2d5, language zh_TW
Found c7a787079b354eaaa9e77b371893cd27, language zh_TW
Found 45f82f4aef7a4bbf942ce861d1f20990, language zh_TW
Found b07a249cd024414a82dd00cd181378ff, language zh_TW
Found 6bbd95ee977941e497c48be27c254128, language zh_TW
Found 8811e6df2a8e40f58a94cea26f8ebf14, language zh_TW
Found 98268866d1d54a499c4e98921d93bc40, language zh_TW
Found 7d4958e842da4a758f6c1cdc7b36dcc5, language zh_TW
Found 39f53479d3a045ac8e11786248231fbf, language zh_TW
Found de5b426a63be47a7b6ac3eaac82e2f6f, language zh_TW
Found 9d1aaa27d60140bd96365438aad20286, language zh_TW
Found be02cf6855d2428ba40df7e9d022f03d, language zh_TW
Found d34d037fff1847e6ae669a370e694725, language zh_TW
Found 7b05ebc668384222baa8881179cfda54, language zh_TW
Found 641257651c1b4ec9a8624d7a40a9e1e7, language zh_TW
Found 0027229ca0644181a76c4e92458afa2e, language zh_TW
Found 1dee0369c7fc4736b7099b38ecb46ee7, language zh_TW
Found 24d8d4452573402496068381a6312df2, language zh_TW
Found 58432bd3bace477cb514b56381b8a758, language zh_TW
/var/lib/systemd/catalog/database: wrote 369 items, with 118849 bytes of strings, 139553 total size.
Setting up dmsetup (2:1.02.167-1) ...
Selecting previously unselected package systemd-sysv.
(Reading database ... 15554 files and directories currently installed.)
Preparing to unpack .../systemd-sysv_244-3+rpi1+b1_armhf.deb ...
Unpacking systemd-sysv (244-3+rpi1+b1) ...
Selecting previously unselected package libpython3.7-minimal:armhf.
Preparing to unpack .../libpython3.7-minimal_3.7.6-1_armhf.deb ...
Unpacking libpython3.7-minimal:armhf (3.7.6-1) ...
Selecting previously unselected package libexpat1:armhf.
Preparing to unpack .../libexpat1_2.2.9-1_armhf.deb ...
Unpacking libexpat1:armhf (2.2.9-1) ...
Selecting previously unselected package python3.7-minimal.
Preparing to unpack .../python3.7-minimal_3.7.6-1_armhf.deb ...
Unpacking python3.7-minimal (3.7.6-1) ...
Setting up libpython3.7-minimal:armhf (3.7.6-1) ...
Setting up libexpat1:armhf (2.2.9-1) ...
Setting up python3.7-minimal (3.7.6-1) ...
Selecting previously unselected package python3-minimal.
(Reading database ... 15822 files and directories currently installed.)
Preparing to unpack .../0-python3-minimal_3.7.5-3_armhf.deb ...
Unpacking python3-minimal (3.7.5-3) ...
Selecting previously unselected package mime-support.
Preparing to unpack .../1-mime-support_3.64_all.deb ...
Unpacking mime-support (3.64) ...
Selecting previously unselected package libmpdec2:armhf.
Preparing to unpack .../2-libmpdec2_2.4.2-2_armhf.deb ...
Unpacking libmpdec2:armhf (2.4.2-2) ...
Selecting previously unselected package libpython3.7-stdlib:armhf.
Preparing to unpack .../3-libpython3.7-stdlib_3.7.6-1_armhf.deb ...
Unpacking libpython3.7-stdlib:armhf (3.7.6-1) ...
Selecting previously unselected package python3.7.
Preparing to unpack .../4-python3.7_3.7.6-1_armhf.deb ...
Unpacking python3.7 (3.7.6-1) ...
Selecting previously unselected package libpython3-stdlib:armhf.
Preparing to unpack .../5-libpython3-stdlib_3.7.5-3_armhf.deb ...
Unpacking libpython3-stdlib:armhf (3.7.5-3) ...
Setting up python3-minimal (3.7.5-3) ...
Selecting previously unselected package python3.
(Reading database ... 16260 files and directories currently installed.)
Preparing to unpack .../000-python3_3.7.5-3_armhf.deb ...
Unpacking python3 (3.7.5-3) ...
Selecting previously unselected package netbase.
Preparing to unpack .../001-netbase_6.0_all.deb ...
Unpacking netbase (6.0) ...
Selecting previously unselected package sensible-utils.
Preparing to unpack .../002-sensible-utils_0.0.12+nmu1_all.deb ...
Unpacking sensible-utils (0.0.12+nmu1) ...
Selecting previously unselected package libdbus-1-3:armhf.
Preparing to unpack .../003-libdbus-1-3_1.12.16-2+b1_armhf.deb ...
Unpacking libdbus-1-3:armhf (1.12.16-2+b1) ...
Selecting previously unselected package dbus.
Preparing to unpack .../004-dbus_1.12.16-2+b1_armhf.deb ...
Unpacking dbus (1.12.16-2+b1) ...
Selecting previously unselected package libmagic-mgc.
Preparing to unpack .../005-libmagic-mgc_1%3a5.38-3_armhf.deb ...
Unpacking libmagic-mgc (1:5.38-3) ...
Selecting previously unselected package libmagic1:armhf.
Preparing to unpack .../006-libmagic1_1%3a5.38-3_armhf.deb ...
Unpacking libmagic1:armhf (1:5.38-3) ...
Selecting previously unselected package file.
Preparing to unpack .../007-file_1%3a5.38-3_armhf.deb ...
Unpacking file (1:5.38-3) ...
Selecting previously unselected package gettext-base.
Preparing to unpack .../008-gettext-base_0.19.8.1-10_armhf.deb ...
Unpacking gettext-base (0.19.8.1-10) ...
Selecting previously unselected package libpam-systemd:armhf.
Preparing to unpack .../009-libpam-systemd_244-3+rpi1+b1_armhf.deb ...
Unpacking libpam-systemd:armhf (244-3+rpi1+b1) ...
Selecting previously unselected package ucf.
Preparing to unpack .../010-ucf_3.0038+nmu1_all.deb ...
Moving old data out of the way
Unpacking ucf (3.0038+nmu1) ...
Selecting previously unselected package hicolor-icon-theme.
Preparing to unpack .../011-hicolor-icon-theme_0.17-2_all.deb ...
Unpacking hicolor-icon-theme (0.17-2) ...
Selecting previously unselected package libglib2.0-0:armhf.
Preparing to unpack .../012-libglib2.0-0_2.62.4-1_armhf.deb ...
Unpacking libglib2.0-0:armhf (2.62.4-1) ...
Selecting previously unselected package libjpeg62-turbo:armhf.
Preparing to unpack .../013-libjpeg62-turbo_1%3a1.5.2-2+b1_armhf.deb ...
Unpacking libjpeg62-turbo:armhf (1:1.5.2-2+b1) ...
Selecting previously unselected package libpng16-16:armhf.
Preparing to unpack .../014-libpng16-16_1.6.37-1_armhf.deb ...
Unpacking libpng16-16:armhf (1.6.37-1) ...
Selecting previously unselected package libjbig0:armhf.
Preparing to unpack .../015-libjbig0_2.1-3.1+b2_armhf.deb ...
Unpacking libjbig0:armhf (2.1-3.1+b2) ...
Selecting previously unselected package libwebp6:armhf.
Preparing to unpack .../016-libwebp6_0.6.1-2_armhf.deb ...
Unpacking libwebp6:armhf (0.6.1-2) ...
Selecting previously unselected package libtiff5:armhf.
Preparing to unpack .../017-libtiff5_4.1.0+git191117-2_armhf.deb ...
Unpacking libtiff5:armhf (4.1.0+git191117-2) ...
Selecting previously unselected package libxau6:armhf.
Preparing to unpack .../018-libxau6_1%3a1.0.8-1+b2_armhf.deb ...
Unpacking libxau6:armhf (1:1.0.8-1+b2) ...
Selecting previously unselected package libxdmcp6:armhf.
Preparing to unpack .../019-libxdmcp6_1%3a1.1.2-3_armhf.deb ...
Unpacking libxdmcp6:armhf (1:1.1.2-3) ...
Selecting previously unselected package libxcb1:armhf.
Preparing to unpack .../020-libxcb1_1.13.1-2_armhf.deb ...
Unpacking libxcb1:armhf (1.13.1-2) ...
Selecting previously unselected package libx11-data.
Preparing to unpack .../021-libx11-data_2%3a1.6.8-1_all.deb ...
Unpacking libx11-data (2:1.6.8-1) ...
Selecting previously unselected package libx11-6:armhf.
Preparing to unpack .../022-libx11-6_2%3a1.6.8-1_armhf.deb ...
Unpacking libx11-6:armhf (2:1.6.8-1) ...
Selecting previously unselected package libicu63:armhf.
Preparing to unpack .../023-libicu63_63.2-2_armhf.deb ...
Unpacking libicu63:armhf (63.2-2) ...
Selecting previously unselected package libxml2:armhf.
Preparing to unpack .../024-libxml2_2.9.4+dfsg1-8_armhf.deb ...
Unpacking libxml2:armhf (2.9.4+dfsg1-8) ...
Selecting previously unselected package shared-mime-info.
Preparing to unpack .../025-shared-mime-info_1.10-1_armhf.deb ...
Unpacking shared-mime-info (1.10-1) ...
Selecting previously unselected package libgdk-pixbuf2.0-common.
Preparing to unpack .../026-libgdk-pixbuf2.0-common_2.40.0+dfsg-2+rpi1_all.deb ...
Unpacking libgdk-pixbuf2.0-common (2.40.0+dfsg-2+rpi1) ...
Selecting previously unselected package libgdk-pixbuf2.0-0:armhf.
Preparing to unpack .../027-libgdk-pixbuf2.0-0_2.40.0+dfsg-2+rpi1_armhf.deb ...
Unpacking libgdk-pixbuf2.0-0:armhf (2.40.0+dfsg-2+rpi1) ...
Selecting previously unselected package gtk-update-icon-cache.
Preparing to unpack .../028-gtk-update-icon-cache_3.24.13-1_armhf.deb ...
No diversion 'diversion of /usr/sbin/update-icon-caches to /usr/sbin/update-icon-caches.gtk2 by libgtk-3-bin', none removed.
No diversion 'diversion of /usr/share/man/man8/update-icon-caches.8.gz to /usr/share/man/man8/update-icon-caches.gtk2.8.gz by libgtk-3-bin', none removed.
Unpacking gtk-update-icon-cache (3.24.13-1) ...
Selecting previously unselected package libfreetype6:armhf.
Preparing to unpack .../029-libfreetype6_2.10.1-2_armhf.deb ...
Unpacking libfreetype6:armhf (2.10.1-2) ...
Selecting previously unselected package fonts-dejavu-core.
Preparing to unpack .../030-fonts-dejavu-core_2.37-1_all.deb ...
Unpacking fonts-dejavu-core (2.37-1) ...
Selecting previously unselected package fontconfig-config.
Preparing to unpack .../031-fontconfig-config_2.13.1-2_all.deb ...
Unpacking fontconfig-config (2.13.1-2) ...
Selecting previously unselected package libfontconfig1:armhf.
Preparing to unpack .../032-libfontconfig1_2.13.1-2_armhf.deb ...
Unpacking libfontconfig1:armhf (2.13.1-2) ...
Selecting previously unselected package libpixman-1-0:armhf.
Preparing to unpack .../033-libpixman-1-0_0.36.0-1_armhf.deb ...
Unpacking libpixman-1-0:armhf (0.36.0-1) ...
Selecting previously unselected package libxcb-render0:armhf.
Preparing to unpack .../034-libxcb-render0_1.13.1-2_armhf.deb ...
Unpacking libxcb-render0:armhf (1.13.1-2) ...
Selecting previously unselected package libxcb-shm0:armhf.
Preparing to unpack .../035-libxcb-shm0_1.13.1-2_armhf.deb ...
Unpacking libxcb-shm0:armhf (1.13.1-2) ...
Selecting previously unselected package libxext6:armhf.
Preparing to unpack .../036-libxext6_2%3a1.3.3-1+b2_armhf.deb ...
Unpacking libxext6:armhf (2:1.3.3-1+b2) ...
Selecting previously unselected package libxrender1:armhf.
Preparing to unpack .../037-libxrender1_1%3a0.9.10-1_armhf.deb ...
Unpacking libxrender1:armhf (1:0.9.10-1) ...
Selecting previously unselected package libcairo2:armhf.
Preparing to unpack .../038-libcairo2_1.16.0-4_armhf.deb ...
Unpacking libcairo2:armhf (1.16.0-4) ...
Selecting previously unselected package libcroco3:armhf.
Preparing to unpack .../039-libcroco3_0.6.13-1_armhf.deb ...
Unpacking libcroco3:armhf (0.6.13-1) ...
Selecting previously unselected package fontconfig.
Preparing to unpack .../040-fontconfig_2.13.1-2_armhf.deb ...
Unpacking fontconfig (2.13.1-2) ...
Selecting previously unselected package libfribidi0:armhf.
Preparing to unpack .../041-libfribidi0_1.0.7-1.1_armhf.deb ...
Unpacking libfribidi0:armhf (1.0.7-1.1) ...
Selecting previously unselected package libthai-data.
Preparing to unpack .../042-libthai-data_0.1.28-3_all.deb ...
Unpacking libthai-data (0.1.28-3) ...
Selecting previously unselected package libdatrie1:armhf.
Preparing to unpack .../043-libdatrie1_0.2.12-3+b1_armhf.deb ...
Unpacking libdatrie1:armhf (0.2.12-3+b1) ...
Selecting previously unselected package libthai0:armhf.
Preparing to unpack .../044-libthai0_0.1.28-3_armhf.deb ...
Unpacking libthai0:armhf (0.1.28-3) ...
Selecting previously unselected package libpango-1.0-0:armhf.
Preparing to unpack .../045-libpango-1.0-0_1.42.4-7+b1_armhf.deb ...
Unpacking libpango-1.0-0:armhf (1.42.4-7+b1) ...
Selecting previously unselected package libgraphite2-3:armhf.
Preparing to unpack .../046-libgraphite2-3_1.3.13-11_armhf.deb ...
Unpacking libgraphite2-3:armhf (1.3.13-11) ...
Selecting previously unselected package libharfbuzz0b:armhf.
Preparing to unpack .../047-libharfbuzz0b_2.6.4-1+rpi1_armhf.deb ...
Unpacking libharfbuzz0b:armhf (2.6.4-1+rpi1) ...
Selecting previously unselected package libpangoft2-1.0-0:armhf.
Preparing to unpack .../048-libpangoft2-1.0-0_1.42.4-7+b1_armhf.deb ...
Unpacking libpangoft2-1.0-0:armhf (1.42.4-7+b1) ...
Selecting previously unselected package libpangocairo-1.0-0:armhf.
Preparing to unpack .../049-libpangocairo-1.0-0_1.42.4-7+b1_armhf.deb ...
Unpacking libpangocairo-1.0-0:armhf (1.42.4-7+b1) ...
Selecting previously unselected package librsvg2-2:armhf.
Preparing to unpack .../050-librsvg2-2_2.46.4-1_armhf.deb ...
Unpacking librsvg2-2:armhf (2.46.4-1) ...
Selecting previously unselected package librsvg2-common:armhf.
Preparing to unpack .../051-librsvg2-common_2.46.4-1_armhf.deb ...
Unpacking librsvg2-common:armhf (2.46.4-1) ...
Selecting previously unselected package adwaita-icon-theme.
Preparing to unpack .../052-adwaita-icon-theme_3.34.0-2_all.deb ...
Unpacking adwaita-icon-theme (3.34.0-2) ...
Selecting previously unselected package libsigsegv2:armhf.
Preparing to unpack .../053-libsigsegv2_2.12-2_armhf.deb ...
Unpacking libsigsegv2:armhf (2.12-2) ...
Selecting previously unselected package m4.
Preparing to unpack .../054-m4_1.4.18-4_armhf.deb ...
Unpacking m4 (1.4.18-4) ...
Selecting previously unselected package autoconf.
Preparing to unpack .../055-autoconf_2.69-11_all.deb ...
Unpacking autoconf (2.69-11) ...
Selecting previously unselected package autotools-dev.
Preparing to unpack .../056-autotools-dev_20180224.1_all.deb ...
Unpacking autotools-dev (20180224.1) ...
Selecting previously unselected package automake.
Preparing to unpack .../057-automake_1%3a1.16.1-4_all.deb ...
Unpacking automake (1:1.16.1-4) ...
Selecting previously unselected package autopoint.
Preparing to unpack .../058-autopoint_0.19.8.1-10_all.deb ...
Unpacking autopoint (0.19.8.1-10) ...
Selecting previously unselected package openssl.
Preparing to unpack .../059-openssl_1.1.1d-2_armhf.deb ...
Unpacking openssl (1.1.1d-2) ...
Selecting previously unselected package ca-certificates.
Preparing to unpack .../060-ca-certificates_20190110_all.deb ...
Unpacking ca-certificates (20190110) ...
Selecting previously unselected package dbus-user-session.
Preparing to unpack .../061-dbus-user-session_1.12.16-2+b1_armhf.deb ...
Unpacking dbus-user-session (1.12.16-2+b1) ...
Selecting previously unselected package libtool.
Preparing to unpack .../062-libtool_2.4.6-11_all.deb ...
Unpacking libtool (2.4.6-11) ...
Selecting previously unselected package dh-autoreconf.
Preparing to unpack .../063-dh-autoreconf_19_all.deb ...
Unpacking dh-autoreconf (19) ...
Selecting previously unselected package libdebhelper-perl.
Preparing to unpack .../064-libdebhelper-perl_12.7.3_all.deb ...
Unpacking libdebhelper-perl (12.7.3) ...
Selecting previously unselected package libarchive-zip-perl.
Preparing to unpack .../065-libarchive-zip-perl_1.67-1_all.deb ...
Unpacking libarchive-zip-perl (1.67-1) ...
Selecting previously unselected package libsub-override-perl.
Preparing to unpack .../066-libsub-override-perl_0.09-2_all.deb ...
Unpacking libsub-override-perl (0.09-2) ...
Selecting previously unselected package libfile-stripnondeterminism-perl.
Preparing to unpack .../067-libfile-stripnondeterminism-perl_1.6.3-2_all.deb ...
Unpacking libfile-stripnondeterminism-perl (1.6.3-2) ...
Selecting previously unselected package dh-strip-nondeterminism.
Preparing to unpack .../068-dh-strip-nondeterminism_1.6.3-2_all.deb ...
Unpacking dh-strip-nondeterminism (1.6.3-2) ...
Selecting previously unselected package libelf1:armhf.
Preparing to unpack .../069-libelf1_0.176-1.1_armhf.deb ...
Unpacking libelf1:armhf (0.176-1.1) ...
Selecting previously unselected package dwz.
Preparing to unpack .../070-dwz_0.13-5_armhf.deb ...
Unpacking dwz (0.13-5) ...
Selecting previously unselected package gettext.
Preparing to unpack .../071-gettext_0.19.8.1-10_armhf.deb ...
Unpacking gettext (0.19.8.1-10) ...
Selecting previously unselected package intltool-debian.
Preparing to unpack .../072-intltool-debian_0.35.0+20060710.5_all.deb ...
Unpacking intltool-debian (0.35.0+20060710.5) ...
Selecting previously unselected package po-debconf.
Preparing to unpack .../073-po-debconf_1.0.21_all.deb ...
Unpacking po-debconf (1.0.21) ...
Selecting previously unselected package debhelper.
Preparing to unpack .../074-debhelper_12.7.3_all.deb ...
Unpacking debhelper (12.7.3) ...
Selecting previously unselected package libdbus-glib-1-2:armhf.
Preparing to unpack .../075-libdbus-glib-1-2_0.110-5_armhf.deb ...
Unpacking libdbus-glib-1-2:armhf (0.110-5) ...
Selecting previously unselected package gconf2-common.
Preparing to unpack .../076-gconf2-common_3.2.6-6_all.deb ...
Unpacking gconf2-common (3.2.6-6) ...
Selecting previously unselected package libgconf-2-4:armhf.
Preparing to unpack .../077-libgconf-2-4_3.2.6-6_armhf.deb ...
Unpacking libgconf-2-4:armhf (3.2.6-6) ...
Selecting previously unselected package gconf-service.
Preparing to unpack .../078-gconf-service_3.2.6-6_armhf.deb ...
Unpacking gconf-service (3.2.6-6) ...
Selecting previously unselected package psmisc.
Preparing to unpack .../079-psmisc_23.3-1_armhf.deb ...
Unpacking psmisc (23.3-1) ...
Selecting previously unselected package gconf2.
Preparing to unpack .../080-gconf2_3.2.6-6_armhf.deb ...
Unpacking gconf2 (3.2.6-6) ...
Selecting previously unselected package libgirepository-1.0-1:armhf.
Preparing to unpack .../081-libgirepository-1.0-1_1.62.0-2_armhf.deb ...
Unpacking libgirepository-1.0-1:armhf (1.62.0-2) ...
Selecting previously unselected package gir1.2-glib-2.0:armhf.
Preparing to unpack .../082-gir1.2-glib-2.0_1.62.0-2_armhf.deb ...
Unpacking gir1.2-glib-2.0:armhf (1.62.0-2) ...
Selecting previously unselected package libatk1.0-data.
Preparing to unpack .../083-libatk1.0-data_2.34.1-1_all.deb ...
Unpacking libatk1.0-data (2.34.1-1) ...
Selecting previously unselected package libatk1.0-0:armhf.
Preparing to unpack .../084-libatk1.0-0_2.34.1-1_armhf.deb ...
Unpacking libatk1.0-0:armhf (2.34.1-1) ...
Selecting previously unselected package gir1.2-atk-1.0:armhf.
Preparing to unpack .../085-gir1.2-atk-1.0_2.34.1-1_armhf.deb ...
Unpacking gir1.2-atk-1.0:armhf (2.34.1-1) ...
Selecting previously unselected package gir1.2-freedesktop:armhf.
Preparing to unpack .../086-gir1.2-freedesktop_1.62.0-2_armhf.deb ...
Unpacking gir1.2-freedesktop:armhf (1.62.0-2) ...
Selecting previously unselected package gir1.2-gconf-2.0.
Preparing to unpack .../087-gir1.2-gconf-2.0_3.2.6-6_armhf.deb ...
Unpacking gir1.2-gconf-2.0 (3.2.6-6) ...
Selecting previously unselected package gir1.2-gdkpixbuf-2.0:armhf.
Preparing to unpack .../088-gir1.2-gdkpixbuf-2.0_2.40.0+dfsg-2+rpi1_armhf.deb ...
Unpacking gir1.2-gdkpixbuf-2.0:armhf (2.40.0+dfsg-2+rpi1) ...
Selecting previously unselected package libgtk2.0-common.
Preparing to unpack .../089-libgtk2.0-common_2.24.32-4_all.deb ...
Unpacking libgtk2.0-common (2.24.32-4) ...
Selecting previously unselected package libxft2:armhf.
Preparing to unpack .../090-libxft2_2.3.2-2_armhf.deb ...
Unpacking libxft2:armhf (2.3.2-2) ...
Selecting previously unselected package libpangoxft-1.0-0:armhf.
Preparing to unpack .../091-libpangoxft-1.0-0_1.42.4-7+b1_armhf.deb ...
Unpacking libpangoxft-1.0-0:armhf (1.42.4-7+b1) ...
Selecting previously unselected package gir1.2-pango-1.0:armhf.
Preparing to unpack .../092-gir1.2-pango-1.0_1.42.4-7+b1_armhf.deb ...
Unpacking gir1.2-pango-1.0:armhf (1.42.4-7+b1) ...
Selecting previously unselected package libavahi-common-data:armhf.
Preparing to unpack .../093-libavahi-common-data_0.7-5_armhf.deb ...
Unpacking libavahi-common-data:armhf (0.7-5) ...
Selecting previously unselected package libavahi-common3:armhf.
Preparing to unpack .../094-libavahi-common3_0.7-5_armhf.deb ...
Unpacking libavahi-common3:armhf (0.7-5) ...
Selecting previously unselected package libavahi-client3:armhf.
Preparing to unpack .../095-libavahi-client3_0.7-5_armhf.deb ...
Unpacking libavahi-client3:armhf (0.7-5) ...
Selecting previously unselected package libkeyutils1:armhf.
Preparing to unpack .../096-libkeyutils1_1.6-6_armhf.deb ...
Unpacking libkeyutils1:armhf (1.6-6) ...
Selecting previously unselected package libkrb5support0:armhf.
Preparing to unpack .../097-libkrb5support0_1.17-6+b1_armhf.deb ...
Unpacking libkrb5support0:armhf (1.17-6+b1) ...
Selecting previously unselected package libk5crypto3:armhf.
Preparing to unpack .../098-libk5crypto3_1.17-6+b1_armhf.deb ...
Unpacking libk5crypto3:armhf (1.17-6+b1) ...
Selecting previously unselected package libkrb5-3:armhf.
Preparing to unpack .../099-libkrb5-3_1.17-6+b1_armhf.deb ...
Unpacking libkrb5-3:armhf (1.17-6+b1) ...
Selecting previously unselected package libgssapi-krb5-2:armhf.
Preparing to unpack .../100-libgssapi-krb5-2_1.17-6+b1_armhf.deb ...
Unpacking libgssapi-krb5-2:armhf (1.17-6+b1) ...
Selecting previously unselected package libcups2:armhf.
Preparing to unpack .../101-libcups2_2.3.1-1_armhf.deb ...
Unpacking libcups2:armhf (2.3.1-1) ...
Selecting previously unselected package libxcomposite1:armhf.
Preparing to unpack .../102-libxcomposite1_1%3a0.4.4-2_armhf.deb ...
Unpacking libxcomposite1:armhf (1:0.4.4-2) ...
Selecting previously unselected package libxfixes3:armhf.
Preparing to unpack .../103-libxfixes3_1%3a5.0.3-1_armhf.deb ...
Unpacking libxfixes3:armhf (1:5.0.3-1) ...
Selecting previously unselected package libxcursor1:armhf.
Preparing to unpack .../104-libxcursor1_1%3a1.2.0-2_armhf.deb ...
Unpacking libxcursor1:armhf (1:1.2.0-2) ...
Selecting previously unselected package libxdamage1:armhf.
Preparing to unpack .../105-libxdamage1_1%3a1.1.5-1_armhf.deb ...
Unpacking libxdamage1:armhf (1:1.1.5-1) ...
Selecting previously unselected package libxi6:armhf.
Preparing to unpack .../106-libxi6_2%3a1.7.9-1_armhf.deb ...
Unpacking libxi6:armhf (2:1.7.9-1) ...
Selecting previously unselected package libxinerama1:armhf.
Preparing to unpack .../107-libxinerama1_2%3a1.1.4-2_armhf.deb ...
Unpacking libxinerama1:armhf (2:1.1.4-2) ...
Selecting previously unselected package libxrandr2:armhf.
Preparing to unpack .../108-libxrandr2_2%3a1.5.1-1_armhf.deb ...
Unpacking libxrandr2:armhf (2:1.5.1-1) ...
Selecting previously unselected package libgtk2.0-0:armhf.
Preparing to unpack .../109-libgtk2.0-0_2.24.32-4_armhf.deb ...
Unpacking libgtk2.0-0:armhf (2.24.32-4) ...
Selecting previously unselected package gir1.2-gtk-2.0:armhf.
Preparing to unpack .../110-gir1.2-gtk-2.0_2.24.32-4_armhf.deb ...
Unpacking gir1.2-gtk-2.0:armhf (2.24.32-4) ...
Selecting previously unselected package gir1.2-harfbuzz-0.0:armhf.
Preparing to unpack .../111-gir1.2-harfbuzz-0.0_2.6.4-1+rpi1_armhf.deb ...
Unpacking gir1.2-harfbuzz-0.0:armhf (2.6.4-1+rpi1) ...
Selecting previously unselected package icu-devtools.
Preparing to unpack .../112-icu-devtools_63.2-2_armhf.deb ...
Unpacking icu-devtools (63.2-2) ...
Selecting previously unselected package liburi-perl.
Preparing to unpack .../113-liburi-perl_1.76-1_all.deb ...
Unpacking liburi-perl (1.76-1) ...
Selecting previously unselected package libencode-locale-perl.
Preparing to unpack .../114-libencode-locale-perl_1.05-1_all.deb ...
Unpacking libencode-locale-perl (1.05-1) ...
Selecting previously unselected package libtimedate-perl.
Preparing to unpack .../115-libtimedate-perl_2.3100-1_all.deb ...
Unpacking libtimedate-perl (2.3100-1) ...
Selecting previously unselected package libhttp-date-perl.
Preparing to unpack .../116-libhttp-date-perl_6.05-1_all.deb ...
Unpacking libhttp-date-perl (6.05-1) ...
Selecting previously unselected package libfile-listing-perl.
Preparing to unpack .../117-libfile-listing-perl_6.04-1_all.deb ...
Unpacking libfile-listing-perl (6.04-1) ...
Selecting previously unselected package libhtml-tagset-perl.
Preparing to unpack .../118-libhtml-tagset-perl_3.20-4_all.deb ...
Unpacking libhtml-tagset-perl (3.20-4) ...
Selecting previously unselected package libhtml-parser-perl.
Preparing to unpack .../119-libhtml-parser-perl_3.72-3+b5_armhf.deb ...
Unpacking libhtml-parser-perl (3.72-3+b5) ...
Selecting previously unselected package libhtml-tree-perl.
Preparing to unpack .../120-libhtml-tree-perl_5.07-2_all.deb ...
Unpacking libhtml-tree-perl (5.07-2) ...
Selecting previously unselected package libio-html-perl.
Preparing to unpack .../121-libio-html-perl_1.001-1_all.deb ...
Unpacking libio-html-perl (1.001-1) ...
Selecting previously unselected package liblwp-mediatypes-perl.
Preparing to unpack .../122-liblwp-mediatypes-perl_6.04-1_all.deb ...
Unpacking liblwp-mediatypes-perl (6.04-1) ...
Selecting previously unselected package libhttp-message-perl.
Preparing to unpack .../123-libhttp-message-perl_6.18-1_all.deb ...
Unpacking libhttp-message-perl (6.18-1) ...
Selecting previously unselected package libhttp-cookies-perl.
Preparing to unpack .../124-libhttp-cookies-perl_6.08-1_all.deb ...
Unpacking libhttp-cookies-perl (6.08-1) ...
Selecting previously unselected package libhttp-negotiate-perl.
Preparing to unpack .../125-libhttp-negotiate-perl_6.01-1_all.deb ...
Unpacking libhttp-negotiate-perl (6.01-1) ...
Selecting previously unselected package perl-openssl-defaults:armhf.
Preparing to unpack .../126-perl-openssl-defaults_3_armhf.deb ...
Unpacking perl-openssl-defaults:armhf (3) ...
Selecting previously unselected package libnet-ssleay-perl.
Preparing to unpack .../127-libnet-ssleay-perl_1.88-2_armhf.deb ...
Unpacking libnet-ssleay-perl (1.88-2) ...
Selecting previously unselected package libio-socket-ssl-perl.
Preparing to unpack .../128-libio-socket-ssl-perl_2.066-1_all.deb ...
Unpacking libio-socket-ssl-perl (2.066-1) ...
Selecting previously unselected package libnet-http-perl.
Preparing to unpack .../129-libnet-http-perl_6.19-1_all.deb ...
Unpacking libnet-http-perl (6.19-1) ...
Selecting previously unselected package liblwp-protocol-https-perl.
Preparing to unpack .../130-liblwp-protocol-https-perl_6.07-2_all.deb ...
Unpacking liblwp-protocol-https-perl (6.07-2) ...
Selecting previously unselected package libtry-tiny-perl.
Preparing to unpack .../131-libtry-tiny-perl_0.30-1_all.deb ...
Unpacking libtry-tiny-perl (0.30-1) ...
Selecting previously unselected package libwww-robotrules-perl.
Preparing to unpack .../132-libwww-robotrules-perl_6.02-1_all.deb ...
Unpacking libwww-robotrules-perl (6.02-1) ...
Selecting previously unselected package libwww-perl.
Preparing to unpack .../133-libwww-perl_6.43-1_all.deb ...
Unpacking libwww-perl (6.43-1) ...
Selecting previously unselected package libxml-parser-perl.
Preparing to unpack .../134-libxml-parser-perl_2.46-1+b1_armhf.deb ...
Unpacking libxml-parser-perl (2.46-1+b1) ...
Selecting previously unselected package intltool.
Preparing to unpack .../135-intltool_0.51.0-5_all.deb ...
Unpacking intltool (0.51.0-5) ...
Selecting previously unselected package pkg-config.
Preparing to unpack .../136-pkg-config_0.29-6_armhf.deb ...
Unpacking pkg-config (0.29-6) ...
Selecting previously unselected package libffi-dev:armhf.
Preparing to unpack .../137-libffi-dev_3.2.1-9_armhf.deb ...
Unpacking libffi-dev:armhf (3.2.1-9) ...
Selecting previously unselected package libglib2.0-data.
Preparing to unpack .../138-libglib2.0-data_2.62.4-1_all.deb ...
Unpacking libglib2.0-data (2.62.4-1) ...
Selecting previously unselected package libglib2.0-bin.
Preparing to unpack .../139-libglib2.0-bin_2.62.4-1_armhf.deb ...
Unpacking libglib2.0-bin (2.62.4-1) ...
Selecting previously unselected package python3-lib2to3.
Preparing to unpack .../140-python3-lib2to3_3.8.0-1_all.deb ...
Unpacking python3-lib2to3 (3.8.0-1) ...
Selecting previously unselected package python3-distutils.
Preparing to unpack .../141-python3-distutils_3.8.0-1_all.deb ...
Unpacking python3-distutils (3.8.0-1) ...
Selecting previously unselected package libglib2.0-dev-bin.
Preparing to unpack .../142-libglib2.0-dev-bin_2.62.4-1_armhf.deb ...
Unpacking libglib2.0-dev-bin (2.62.4-1) ...
Selecting previously unselected package uuid-dev:armhf.
Preparing to unpack .../143-uuid-dev_2.34-0.1_armhf.deb ...
Unpacking uuid-dev:armhf (2.34-0.1) ...
Selecting previously unselected package libblkid-dev:armhf.
Preparing to unpack .../144-libblkid-dev_2.34-0.1_armhf.deb ...
Unpacking libblkid-dev:armhf (2.34-0.1) ...
Selecting previously unselected package libmount-dev:armhf.
Preparing to unpack .../145-libmount-dev_2.34-0.1_armhf.deb ...
Unpacking libmount-dev:armhf (2.34-0.1) ...
Selecting previously unselected package libpcre16-3:armhf.
Preparing to unpack .../146-libpcre16-3_2%3a8.39-12_armhf.deb ...
Unpacking libpcre16-3:armhf (2:8.39-12) ...
Selecting previously unselected package libpcre32-3:armhf.
Preparing to unpack .../147-libpcre32-3_2%3a8.39-12_armhf.deb ...
Unpacking libpcre32-3:armhf (2:8.39-12) ...
Selecting previously unselected package libpcrecpp0v5:armhf.
Preparing to unpack .../148-libpcrecpp0v5_2%3a8.39-12_armhf.deb ...
Unpacking libpcrecpp0v5:armhf (2:8.39-12) ...
Selecting previously unselected package libpcre3-dev:armhf.
Preparing to unpack .../149-libpcre3-dev_2%3a8.39-12_armhf.deb ...
Unpacking libpcre3-dev:armhf (2:8.39-12) ...
Selecting previously unselected package libsepol1-dev:armhf.
Preparing to unpack .../150-libsepol1-dev_3.0-1_armhf.deb ...
Unpacking libsepol1-dev:armhf (3.0-1) ...
Selecting previously unselected package libpcre2-16-0:armhf.
Preparing to unpack .../151-libpcre2-16-0_10.34-7_armhf.deb ...
Unpacking libpcre2-16-0:armhf (10.34-7) ...
Selecting previously unselected package libpcre2-32-0:armhf.
Preparing to unpack .../152-libpcre2-32-0_10.34-7_armhf.deb ...
Unpacking libpcre2-32-0:armhf (10.34-7) ...
Selecting previously unselected package libpcre2-posix2:armhf.
Preparing to unpack .../153-libpcre2-posix2_10.34-7_armhf.deb ...
Unpacking libpcre2-posix2:armhf (10.34-7) ...
Selecting previously unselected package libpcre2-dev:armhf.
Preparing to unpack .../154-libpcre2-dev_10.34-7_armhf.deb ...
Unpacking libpcre2-dev:armhf (10.34-7) ...
Selecting previously unselected package libselinux1-dev:armhf.
Preparing to unpack .../155-libselinux1-dev_3.0-1_armhf.deb ...
Unpacking libselinux1-dev:armhf (3.0-1) ...
Selecting previously unselected package zlib1g-dev:armhf.
Preparing to unpack .../156-zlib1g-dev_1%3a1.2.11.dfsg-1_armhf.deb ...
Unpacking zlib1g-dev:armhf (1:1.2.11.dfsg-1) ...
Selecting previously unselected package libglib2.0-dev:armhf.
Preparing to unpack .../157-libglib2.0-dev_2.62.4-1_armhf.deb ...
Unpacking libglib2.0-dev:armhf (2.62.4-1) ...
Selecting previously unselected package libatk1.0-dev:armhf.
Preparing to unpack .../158-libatk1.0-dev_2.34.1-1_armhf.deb ...
Unpacking libatk1.0-dev:armhf (2.34.1-1) ...
Selecting previously unselected package libsigc++-2.0-0v5:armhf.
Preparing to unpack .../159-libsigc++-2.0-0v5_2.10.2-1_armhf.deb ...
Unpacking libsigc++-2.0-0v5:armhf (2.10.2-1) ...
Selecting previously unselected package libglibmm-2.4-1v5:armhf.
Preparing to unpack .../160-libglibmm-2.4-1v5_2.62.0-1_armhf.deb ...
Unpacking libglibmm-2.4-1v5:armhf (2.62.0-1) ...
Selecting previously unselected package libatkmm-1.6-1v5:armhf.
Preparing to unpack .../161-libatkmm-1.6-1v5_2.28.0-2_armhf.deb ...
Unpacking libatkmm-1.6-1v5:armhf (2.28.0-2) ...
Selecting previously unselected package libsigc++-2.0-dev:armhf.
Preparing to unpack .../162-libsigc++-2.0-dev_2.10.2-1_armhf.deb ...
Unpacking libsigc++-2.0-dev:armhf (2.10.2-1) ...
Selecting previously unselected package libglibmm-2.4-dev:armhf.
Preparing to unpack .../163-libglibmm-2.4-dev_2.62.0-1_armhf.deb ...
Unpacking libglibmm-2.4-dev:armhf (2.62.0-1) ...
Selecting previously unselected package libatkmm-1.6-dev:armhf.
Preparing to unpack .../164-libatkmm-1.6-dev_2.28.0-2_armhf.deb ...
Unpacking libatkmm-1.6-dev:armhf (2.28.0-2) ...
Selecting previously unselected package libcairo-gobject2:armhf.
Preparing to unpack .../165-libcairo-gobject2_1.16.0-4_armhf.deb ...
Unpacking libcairo-gobject2:armhf (1.16.0-4) ...
Selecting previously unselected package liblzo2-2:armhf.
Preparing to unpack .../166-liblzo2-2_2.10-0.1_armhf.deb ...
Unpacking liblzo2-2:armhf (2.10-0.1) ...
Selecting previously unselected package libcairo-script-interpreter2:armhf.
Preparing to unpack .../167-libcairo-script-interpreter2_1.16.0-4_armhf.deb ...
Unpacking libcairo-script-interpreter2:armhf (1.16.0-4) ...
Selecting previously unselected package libexpat1-dev:armhf.
Preparing to unpack .../168-libexpat1-dev_2.2.9-1_armhf.deb ...
Unpacking libexpat1-dev:armhf (2.2.9-1) ...
Selecting previously unselected package libpng-dev:armhf.
Preparing to unpack .../169-libpng-dev_1.6.37-1_armhf.deb ...
Unpacking libpng-dev:armhf (1.6.37-1) ...
Selecting previously unselected package libfreetype-dev:armhf.
Preparing to unpack .../170-libfreetype-dev_2.10.1-2_armhf.deb ...
Unpacking libfreetype-dev:armhf (2.10.1-2) ...
Selecting previously unselected package libfreetype6-dev:armhf.
Preparing to unpack .../171-libfreetype6-dev_2.10.1-2_armhf.deb ...
Unpacking libfreetype6-dev:armhf (2.10.1-2) ...
Selecting previously unselected package libfontconfig1-dev:armhf.
Preparing to unpack .../172-libfontconfig1-dev_2.13.1-2_armhf.deb ...
Unpacking libfontconfig1-dev:armhf (2.13.1-2) ...
Selecting previously unselected package xorg-sgml-doctools.
Preparing to unpack .../173-xorg-sgml-doctools_1%3a1.11-1_all.deb ...
Unpacking xorg-sgml-doctools (1:1.11-1) ...
Selecting previously unselected package x11proto-dev.
Preparing to unpack .../174-x11proto-dev_2018.4-4_all.deb ...
Unpacking x11proto-dev (2018.4-4) ...
Selecting previously unselected package x11proto-core-dev.
Preparing to unpack .../175-x11proto-core-dev_2018.4-4_all.deb ...
Unpacking x11proto-core-dev (2018.4-4) ...
Selecting previously unselected package libxau-dev:armhf.
Preparing to unpack .../176-libxau-dev_1%3a1.0.8-1+b2_armhf.deb ...
Unpacking libxau-dev:armhf (1:1.0.8-1+b2) ...
Selecting previously unselected package libxdmcp-dev:armhf.
Preparing to unpack .../177-libxdmcp-dev_1%3a1.1.2-3_armhf.deb ...
Unpacking libxdmcp-dev:armhf (1:1.1.2-3) ...
Selecting previously unselected package x11proto-input-dev.
Preparing to unpack .../178-x11proto-input-dev_2018.4-4_all.deb ...
Unpacking x11proto-input-dev (2018.4-4) ...
Selecting previously unselected package xtrans-dev.
Preparing to unpack .../179-xtrans-dev_1.3.5-1_all.deb ...
Unpacking xtrans-dev (1.3.5-1) ...
Selecting previously unselected package libpthread-stubs0-dev:armhf.
Preparing to unpack .../180-libpthread-stubs0-dev_0.4-1_armhf.deb ...
Unpacking libpthread-stubs0-dev:armhf (0.4-1) ...
Selecting previously unselected package libxcb1-dev:armhf.
Preparing to unpack .../181-libxcb1-dev_1.13.1-2_armhf.deb ...
Unpacking libxcb1-dev:armhf (1.13.1-2) ...
Selecting previously unselected package libx11-dev:armhf.
Preparing to unpack .../182-libx11-dev_2%3a1.6.8-1_armhf.deb ...
Unpacking libx11-dev:armhf (2:1.6.8-1) ...
Selecting previously unselected package libxrender-dev:armhf.
Preparing to unpack .../183-libxrender-dev_1%3a0.9.10-1_armhf.deb ...
Unpacking libxrender-dev:armhf (1:0.9.10-1) ...
Selecting previously unselected package x11proto-xext-dev.
Preparing to unpack .../184-x11proto-xext-dev_2018.4-4_all.deb ...
Unpacking x11proto-xext-dev (2018.4-4) ...
Selecting previously unselected package libxext-dev:armhf.
Preparing to unpack .../185-libxext-dev_2%3a1.3.3-1+b2_armhf.deb ...
Unpacking libxext-dev:armhf (2:1.3.3-1+b2) ...
Selecting previously unselected package x11-common.
Preparing to unpack .../186-x11-common_1%3a7.7+20_all.deb ...
Unpacking x11-common (1:7.7+20) ...
Selecting previously unselected package libice6:armhf.
Preparing to unpack .../187-libice6_2%3a1.0.9-2_armhf.deb ...
Unpacking libice6:armhf (2:1.0.9-2) ...
Selecting previously unselected package libsm6:armhf.
Preparing to unpack .../188-libsm6_2%3a1.2.3-1_armhf.deb ...
Unpacking libsm6:armhf (2:1.2.3-1) ...
Selecting previously unselected package libice-dev:armhf.
Preparing to unpack .../189-libice-dev_2%3a1.0.9-2_armhf.deb ...
Unpacking libice-dev:armhf (2:1.0.9-2) ...
Selecting previously unselected package libsm-dev:armhf.
Preparing to unpack .../190-libsm-dev_2%3a1.2.3-1_armhf.deb ...
Unpacking libsm-dev:armhf (2:1.2.3-1) ...
Selecting previously unselected package libpixman-1-dev:armhf.
Preparing to unpack .../191-libpixman-1-dev_0.36.0-1_armhf.deb ...
Unpacking libpixman-1-dev:armhf (0.36.0-1) ...
Selecting previously unselected package libxcb-render0-dev:armhf.
Preparing to unpack .../192-libxcb-render0-dev_1.13.1-2_armhf.deb ...
Unpacking libxcb-render0-dev:armhf (1.13.1-2) ...
Selecting previously unselected package libxcb-shm0-dev:armhf.
Preparing to unpack .../193-libxcb-shm0-dev_1.13.1-2_armhf.deb ...
Unpacking libxcb-shm0-dev:armhf (1.13.1-2) ...
Selecting previously unselected package libcairo2-dev:armhf.
Preparing to unpack .../194-libcairo2-dev_1.16.0-4_armhf.deb ...
Unpacking libcairo2-dev:armhf (1.16.0-4) ...
Selecting previously unselected package libcairomm-1.0-1v5:armhf.
Preparing to unpack .../195-libcairomm-1.0-1v5_1.12.2-4_armhf.deb ...
Unpacking libcairomm-1.0-1v5:armhf (1.12.2-4) ...
Selecting previously unselected package libcairomm-1.0-dev:armhf.
Preparing to unpack .../196-libcairomm-1.0-dev_1.12.2-4_armhf.deb ...
Unpacking libcairomm-1.0-dev:armhf (1.12.2-4) ...
Selecting previously unselected package libdbus-1-dev:armhf.
Preparing to unpack .../197-libdbus-1-dev_1.12.16-2+b1_armhf.deb ...
Unpacking libdbus-1-dev:armhf (1.12.16-2+b1) ...
Selecting previously unselected package libdbus-glib-1-dev-bin.
Preparing to unpack .../198-libdbus-glib-1-dev-bin_0.110-5_armhf.deb ...
Unpacking libdbus-glib-1-dev-bin (0.110-5) ...
Selecting previously unselected package libdbus-glib-1-dev:armhf.
Preparing to unpack .../199-libdbus-glib-1-dev_0.110-5_armhf.deb ...
Unpacking libdbus-glib-1-dev:armhf (0.110-5) ...
Selecting previously unselected package libfribidi-dev:armhf.
Preparing to unpack .../200-libfribidi-dev_1.0.7-1.1_armhf.deb ...
Unpacking libfribidi-dev:armhf (1.0.7-1.1) ...
Selecting previously unselected package libgconf2-dev.
Preparing to unpack .../201-libgconf2-dev_3.2.6-6_armhf.deb ...
Unpacking libgconf2-dev (3.2.6-6) ...
Selecting previously unselected package libgconfmm-2.6-1v5:armhf.
Preparing to unpack .../202-libgconfmm-2.6-1v5_2.28.3-1_armhf.deb ...
Unpacking libgconfmm-2.6-1v5:armhf (2.28.3-1) ...
Selecting previously unselected package libgconfmm-2.6-dev:armhf.
Preparing to unpack .../203-libgconfmm-2.6-dev_2.28.3-1_armhf.deb ...
Unpacking libgconfmm-2.6-dev:armhf (2.28.3-1) ...
Selecting previously unselected package libgdk-pixbuf2.0-bin.
Preparing to unpack .../204-libgdk-pixbuf2.0-bin_2.40.0+dfsg-2+rpi1_armhf.deb ...
Unpacking libgdk-pixbuf2.0-bin (2.40.0+dfsg-2+rpi1) ...
Selecting previously unselected package libgdk-pixbuf2.0-dev:armhf.
Preparing to unpack .../205-libgdk-pixbuf2.0-dev_2.40.0+dfsg-2+rpi1_armhf.deb ...
Unpacking libgdk-pixbuf2.0-dev:armhf (2.40.0+dfsg-2+rpi1) ...
Selecting previously unselected package libgraphite2-dev:armhf.
Preparing to unpack .../206-libgraphite2-dev_1.3.13-11_armhf.deb ...
Unpacking libgraphite2-dev:armhf (1.3.13-11) ...
Selecting previously unselected package libharfbuzz-icu0:armhf.
Preparing to unpack .../207-libharfbuzz-icu0_2.6.4-1+rpi1_armhf.deb ...
Unpacking libharfbuzz-icu0:armhf (2.6.4-1+rpi1) ...
Selecting previously unselected package libharfbuzz-gobject0:armhf.
Preparing to unpack .../208-libharfbuzz-gobject0_2.6.4-1+rpi1_armhf.deb ...
Unpacking libharfbuzz-gobject0:armhf (2.6.4-1+rpi1) ...
Selecting previously unselected package libicu-dev:armhf.
Preparing to unpack .../209-libicu-dev_63.2-2_armhf.deb ...
Unpacking libicu-dev:armhf (63.2-2) ...
Selecting previously unselected package libharfbuzz-dev:armhf.
Preparing to unpack .../210-libharfbuzz-dev_2.6.4-1+rpi1_armhf.deb ...
Unpacking libharfbuzz-dev:armhf (2.6.4-1+rpi1) ...
Selecting previously unselected package libxft-dev:armhf.
Preparing to unpack .../211-libxft-dev_2.3.2-2_armhf.deb ...
Unpacking libxft-dev:armhf (2.3.2-2) ...
Selecting previously unselected package pango1.0-tools.
Preparing to unpack .../212-pango1.0-tools_1.42.4-7+b1_armhf.deb ...
Unpacking pango1.0-tools (1.42.4-7+b1) ...
Selecting previously unselected package libpango1.0-dev:armhf.
Preparing to unpack .../213-libpango1.0-dev_1.42.4-7+b1_armhf.deb ...
Unpacking libpango1.0-dev:armhf (1.42.4-7+b1) ...
Selecting previously unselected package x11proto-xinerama-dev.
Preparing to unpack .../214-x11proto-xinerama-dev_2018.4-4_all.deb ...
Unpacking x11proto-xinerama-dev (2018.4-4) ...
Selecting previously unselected package libxinerama-dev:armhf.
Preparing to unpack .../215-libxinerama-dev_2%3a1.1.4-2_armhf.deb ...
Unpacking libxinerama-dev:armhf (2:1.1.4-2) ...
Selecting previously unselected package x11proto-fixes-dev.
Preparing to unpack .../216-x11proto-fixes-dev_1%3a2018.4-4_all.deb ...
Unpacking x11proto-fixes-dev (1:2018.4-4) ...
Selecting previously unselected package libxfixes-dev:armhf.
Preparing to unpack .../217-libxfixes-dev_1%3a5.0.3-1_armhf.deb ...
Unpacking libxfixes-dev:armhf (1:5.0.3-1) ...
Selecting previously unselected package libxi-dev:armhf.
Preparing to unpack .../218-libxi-dev_2%3a1.7.9-1_armhf.deb ...
Unpacking libxi-dev:armhf (2:1.7.9-1) ...
Selecting previously unselected package x11proto-randr-dev.
Preparing to unpack .../219-x11proto-randr-dev_2018.4-4_all.deb ...
Unpacking x11proto-randr-dev (2018.4-4) ...
Selecting previously unselected package libxrandr-dev:armhf.
Preparing to unpack .../220-libxrandr-dev_2%3a1.5.1-1_armhf.deb ...
Unpacking libxrandr-dev:armhf (2:1.5.1-1) ...
Selecting previously unselected package libxcursor-dev:armhf.
Preparing to unpack .../221-libxcursor-dev_1%3a1.2.0-2_armhf.deb ...
Unpacking libxcursor-dev:armhf (1:1.2.0-2) ...
Selecting previously unselected package x11proto-composite-dev.
Preparing to unpack .../222-x11proto-composite-dev_1%3a2018.4-4_all.deb ...
Unpacking x11proto-composite-dev (1:2018.4-4) ...
Selecting previously unselected package libxcomposite-dev:armhf.
Preparing to unpack .../223-libxcomposite-dev_1%3a0.4.4-2_armhf.deb ...
Unpacking libxcomposite-dev:armhf (1:0.4.4-2) ...
Selecting previously unselected package x11proto-damage-dev.
Preparing to unpack .../224-x11proto-damage-dev_1%3a2018.4-4_all.deb ...
Unpacking x11proto-damage-dev (1:2018.4-4) ...
Selecting previously unselected package libxdamage-dev:armhf.
Preparing to unpack .../225-libxdamage-dev_1%3a1.1.5-1_armhf.deb ...
Unpacking libxdamage-dev:armhf (1:1.1.5-1) ...
Selecting previously unselected package libxml2-utils.
Preparing to unpack .../226-libxml2-utils_2.9.4+dfsg1-8_armhf.deb ...
Unpacking libxml2-utils (2.9.4+dfsg1-8) ...
Selecting previously unselected package libgtk2.0-dev:armhf.
Preparing to unpack .../227-libgtk2.0-dev_2.24.32-4_armhf.deb ...
Unpacking libgtk2.0-dev:armhf (2.24.32-4) ...
Selecting previously unselected package libpangomm-1.4-1v5:armhf.
Preparing to unpack .../228-libpangomm-1.4-1v5_2.42.0-2_armhf.deb ...
Unpacking libpangomm-1.4-1v5:armhf (2.42.0-2) ...
Selecting previously unselected package libgtkmm-2.4-1v5:armhf.
Preparing to unpack .../229-libgtkmm-2.4-1v5_1%3a2.24.5-4_armhf.deb ...
Unpacking libgtkmm-2.4-1v5:armhf (1:2.24.5-4) ...
Selecting previously unselected package libpangomm-1.4-dev:armhf.
Preparing to unpack .../230-libpangomm-1.4-dev_2.42.0-2_armhf.deb ...
Unpacking libpangomm-1.4-dev:armhf (2.42.0-2) ...
Selecting previously unselected package libgtkmm-2.4-dev:armhf.
Preparing to unpack .../231-libgtkmm-2.4-dev_1%3a2.24.5-4_armhf.deb ...
Unpacking libgtkmm-2.4-dev:armhf (1:2.24.5-4) ...
Selecting previously unselected package libsqlite3-dev:armhf.
Preparing to unpack .../232-libsqlite3-dev_3.30.1+fossil191229-1_armhf.deb ...
Unpacking libsqlite3-dev:armhf (3.30.1+fossil191229-1) ...
Selecting previously unselected package libunique-1.0-0.
Preparing to unpack .../233-libunique-1.0-0_1.1.6-6_armhf.deb ...
Unpacking libunique-1.0-0 (1.1.6-6) ...
Selecting previously unselected package libunique-dev.
Preparing to unpack .../234-libunique-dev_1.1.6-6_armhf.deb ...
Unpacking libunique-dev (1.1.6-6) ...
Selecting previously unselected package libxine2-bin.
Preparing to unpack .../235-libxine2-bin_1.2.9-1+b4_armhf.deb ...
Unpacking libxine2-bin (1.2.9-1+b4) ...
Selecting previously unselected package libxine2-dev.
Preparing to unpack .../236-libxine2-dev_1.2.9-1+b4_armhf.deb ...
Unpacking libxine2-dev (1.2.9-1+b4) ...
Selecting previously unselected package sbuild-build-depends-me-tv-dummy.
Preparing to unpack .../237-sbuild-build-depends-me-tv-dummy_0.invalid.0_armhf.deb ...
Unpacking sbuild-build-depends-me-tv-dummy (0.invalid.0) ...
Setting up libpcrecpp0v5:armhf (2:8.39-12) ...
Setting up libpipeline1:armhf (1.5.2-2) ...
Setting up libgraphite2-3:armhf (1.3.13-11) ...
Setting up libpixman-1-0:armhf (0.36.0-1) ...
Setting up systemd-sysv (244-3+rpi1+b1) ...
Setting up libxau6:armhf (1:1.0.8-1+b2) ...
Setting up libkeyutils1:armhf (1.6-6) ...
Setting up libpixman-1-dev:armhf (0.36.0-1) ...
Setting up mime-support (3.64) ...
Setting up libpcre16-3:armhf (2:8.39-12) ...
Setting up hicolor-icon-theme (0.17-2) ...
Setting up libdatrie1:armhf (0.2.12-3+b1) ...
Setting up libmagic-mgc (1:5.38-3) ...
Setting up psmisc (23.3-1) ...
Setting up libarchive-zip-perl (1.67-1) ...
Setting up libglib2.0-0:armhf (2.62.4-1) ...
No schema files found: doing nothing.
Setting up libhtml-tagset-perl (3.20-4) ...
Setting up libdebhelper-perl (12.7.3) ...
Setting up liblwp-mediatypes-perl (6.04-1) ...
Setting up libgdk-pixbuf2.0-common (2.40.0+dfsg-2+rpi1) ...
Setting up x11-common (1:7.7+20) ...
update-rc.d: warning: start and stop actions are no longer supported; falling back to defaults
Running in chroot, ignoring request.
All runlevel operations denied by policy
invoke-rc.d: policy-rc.d denied execution of start.
Setting up libtry-tiny-perl (0.30-1) ...
Setting up libmagic1:armhf (1:5.38-3) ...
Setting up libsepol1-dev:armhf (3.0-1) ...
Setting up perl-openssl-defaults:armhf (3) ...
Setting up gettext-base (0.19.8.1-10) ...
Setting up liblzo2-2:armhf (2.10-0.1) ...
Setting up libencode-locale-perl (1.05-1) ...
Setting up file (1:5.38-3) ...
Setting up libffi-dev:armhf (3.2.1-9) ...
Setting up libpthread-stubs0-dev:armhf (0.4-1) ...
Setting up libjbig0:armhf (2.1-3.1+b2) ...
Setting up libpcre2-16-0:armhf (10.34-7) ...
Setting up libicu63:armhf (63.2-2) ...
Setting up libkrb5support0:armhf (1.17-6+b1) ...
Setting up xtrans-dev (1.3.5-1) ...
Setting up libgraphite2-dev:armhf (1.3.13-11) ...
Setting up autotools-dev (20180224.1) ...
Setting up libpcre2-32-0:armhf (10.34-7) ...
Setting up libglib2.0-data (2.62.4-1) ...
Setting up libexpat1-dev:armhf (2.2.9-1) ...
Setting up libjpeg62-turbo:armhf (1:1.5.2-2+b1) ...
Setting up libsqlite3-dev:armhf (3.30.1+fossil191229-1) ...
Setting up libx11-data (2:1.6.8-1) ...
Setting up libsigc++-2.0-0v5:armhf (2.10.2-1) ...
Setting up uuid-dev:armhf (2.34-0.1) ...
Setting up libavahi-common-data:armhf (0.7-5) ...
Setting up libdbus-1-3:armhf (1.12.16-2+b1) ...
Setting up dbus (1.12.16-2+b1) ...
Running in chroot, ignoring request.
All runlevel operations denied by policy
invoke-rc.d: policy-rc.d denied execution of start.
Setting up libsigsegv2:armhf (2.12-2) ...
Setting up libfribidi0:armhf (1.0.7-1.1) ...
Setting up libpng16-16:armhf (1.6.37-1) ...
Setting up libpcre32-3:armhf (2:8.39-12) ...
Setting up libio-html-perl (1.001-1) ...
Setting up autopoint (0.19.8.1-10) ...
Setting up libwebp6:armhf (0.6.1-2) ...
Setting up icu-devtools (63.2-2) ...
Setting up pkg-config (0.29-6) ...
Setting up fonts-dejavu-core (2.37-1) ...
Setting up libpcre2-posix2:armhf (10.34-7) ...
Setting up libk5crypto3:armhf (1.17-6+b1) ...
Setting up libtimedate-perl (2.3100-1) ...
Setting up zlib1g-dev:armhf (1:1.2.11.dfsg-1) ...
Setting up libatk1.0-data (2.34.1-1) ...
Setting up sensible-utils (0.0.12+nmu1) ...
Setting up libuchardet0:armhf (0.0.6-3) ...
Setting up libpam-systemd:armhf (244-3+rpi1+b1) ...
Setting up libsub-override-perl (0.09-2) ...
Setting up libthai-data (0.1.28-3) ...
Setting up libgirepository-1.0-1:armhf (1.62.0-2) ...
Setting up xorg-sgml-doctools (1:1.11-1) ...
Setting up netbase (6.0) ...
Setting up libgtk2.0-common (2.24.32-4) ...
Setting up libatk1.0-0:armhf (2.34.1-1) ...
Setting up libkrb5-3:armhf (1.17-6+b1) ...
Setting up libtiff5:armhf (4.1.0+git191117-2) ...
Setting up libmpdec2:armhf (2.4.2-2) ...
Setting up openssl (1.1.1d-2) ...
Setting up libbsd0:armhf (0.10.0-1) ...
Setting up libtinfo5:armhf (6.1+20191019-1) ...
Setting up libelf1:armhf (0.176-1.1) ...
Setting up libicu-dev:armhf (63.2-2) ...
Setting up libxml2:armhf (2.9.4+dfsg1-8) ...
Setting up liburi-perl (1.76-1) ...
Setting up libnet-ssleay-perl (1.88-2) ...
Setting up x11proto-dev (2018.4-4) ...
Setting up libfile-stripnondeterminism-perl (1.6.3-2) ...
Setting up libglibmm-2.4-1v5:armhf (2.62.0-1) ...
Setting up libblkid-dev:armhf (2.34-0.1) ...
Setting up libice6:armhf (2:1.0.9-2) ...
Setting up libhttp-date-perl (6.05-1) ...
Setting up libxdmcp6:armhf (1:1.1.2-3) ...
Setting up libpython3.7-stdlib:armhf (3.7.6-1) ...
Setting up libxcb1:armhf (1.13.1-2) ...
Setting up libfile-listing-perl (6.04-1) ...
Setting up libxau-dev:armhf (1:1.0.8-1+b2) ...
Setting up libpcre2-dev:armhf (10.34-7) ...
Setting up libice-dev:armhf (2:1.0.9-2) ...
Setting up libtool (2.4.6-11) ...
Setting up libxcb-render0:armhf (1.13.1-2) ...
Setting up libselinux1-dev:armhf (3.0-1) ...
Setting up libpcre3-dev:armhf (2:8.39-12) ...
Setting up x11proto-randr-dev (2018.4-4) ...
Setting up libfribidi-dev:armhf (1.0.7-1.1) ...
Setting up libpng-dev:armhf (1.6.37-1) ...
Setting up libavahi-common3:armhf (0.7-5) ...
Setting up libglib2.0-bin (2.62.4-1) ...
Setting up libnet-http-perl (6.19-1) ...
Setting up m4 (1.4.18-4) ...
Setting up libxcb-shm0:armhf (1.13.1-2) ...
Setting up x11proto-xinerama-dev (2018.4-4) ...
Setting up libsigc++-2.0-dev:armhf (2.10.2-1) ...
Setting up libthai0:armhf (0.1.28-3) ...
Setting up ca-certificates (20190110) ...
Updating certificates in /etc/ssl/certs...
128 added, 0 removed; done.
Setting up dbus-user-session (1.12.16-2+b1) ...
Setting up libxdmcp-dev:armhf (1:1.1.2-3) ...
Setting up x11proto-damage-dev (1:2018.4-4) ...
Setting up x11proto-composite-dev (1:2018.4-4) ...
Setting up libfreetype6:armhf (2.10.1-2) ...
Setting up libdbus-1-dev:armhf (1.12.16-2+b1) ...
Setting up libdbus-glib-1-2:armhf (0.110-5) ...
Setting up x11proto-core-dev (2018.4-4) ...
Setting up shared-mime-info (1.10-1) ...
Setting up bsdmainutils (11.1.2) ...
update-alternatives: using /usr/bin/bsd-write to provide /usr/bin/write (write) in auto mode
update-alternatives: using /usr/bin/bsd-from to provide /usr/bin/from (from) in auto mode
Setting up libgssapi-krb5-2:armhf (1.17-6+b1) ...
Setting up x11proto-input-dev (2018.4-4) ...
Setting up libcroco3:armhf (0.6.13-1) ...
Setting up ucf (3.0038+nmu1) ...
Setting up gir1.2-glib-2.0:armhf (1.62.0-2) ...
Setting up autoconf (2.69-11) ...
Setting up dh-strip-nondeterminism (1.6.3-2) ...
Setting up libwww-robotrules-perl (6.02-1) ...
Setting up x11proto-xext-dev (2018.4-4) ...
Setting up dwz (0.13-5) ...
Setting up groff-base (1.22.4-4) ...
Setting up libhtml-parser-perl (3.72-3+b5) ...
Setting up libx11-6:armhf (2:1.6.8-1) ...
Setting up libharfbuzz0b:armhf (2.6.4-1+rpi1) ...
Setting up libatkmm-1.6-1v5:armhf (2.28.0-2) ...
Setting up libxml2-utils (2.9.4+dfsg1-8) ...
Setting up x11proto-fixes-dev (1:2018.4-4) ...
Setting up libxcomposite1:armhf (1:0.4.4-2) ...
Setting up libsm6:armhf (2:1.2.3-1) ...
Setting up libavahi-client3:armhf (0.7-5) ...
Setting up libmount-dev:armhf (2.34-0.1) ...
Setting up libio-socket-ssl-perl (2.066-1) ...
Setting up libpython3-stdlib:armhf (3.7.5-3) ...
Setting up libhttp-message-perl (6.18-1) ...
Setting up automake (1:1.16.1-4) ...
update-alternatives: using /usr/bin/automake-1.16 to provide /usr/bin/automake (automake) in auto mode
Setting up python3.7 (3.7.6-1) ...
Setting up libhttp-negotiate-perl (6.01-1) ...
Setting up gettext (0.19.8.1-10) ...
Setting up gir1.2-freedesktop:armhf (1.62.0-2) ...
Setting up libharfbuzz-icu0:armhf (2.6.4-1+rpi1) ...
Setting up libxcb1-dev:armhf (1.13.1-2) ...
Setting up libxine2-bin (1.2.9-1+b4) ...
Setting up libxrender1:armhf (1:0.9.10-1) ...
Setting up libhttp-cookies-perl (6.08-1) ...
Setting up gir1.2-atk-1.0:armhf (2.34.1-1) ...
Setting up libsm-dev:armhf (2:1.2.3-1) ...
Setting up fontconfig-config (2.13.1-2) ...
Setting up libhtml-tree-perl (5.07-2) ...
Setting up libdbus-glib-1-dev-bin (0.110-5) ...
Setting up libx11-dev:armhf (2:1.6.8-1) ...
Setting up libxext6:armhf (2:1.3.3-1+b2) ...
Setting up python3 (3.7.5-3) ...
Setting up libharfbuzz-gobject0:armhf (2.6.4-1+rpi1) ...
Setting up man-db (2.9.0-2) ...
Not building database; man-db/auto-update is not 'true'.
Preset files don't specify rule for man-db.timer. Enabling.
Created symlink /etc/systemd/system/timers.target.wants/man-db.timer -> /lib/systemd/system/man-db.timer.
Setting up gir1.2-harfbuzz-0.0:armhf (2.6.4-1+rpi1) ...
Setting up libfreetype-dev:armhf (2.10.1-2) ...
Setting up intltool-debian (0.35.0+20060710.5) ...
Setting up libxcb-shm0-dev:armhf (1.13.1-2) ...
Setting up gconf2-common (3.2.6-6) ...

Creating config file /etc/gconf/2/path with new version
Setting up libxfixes3:armhf (1:5.0.3-1) ...
Setting up libgdk-pixbuf2.0-0:armhf (2.40.0+dfsg-2+rpi1) ...
Setting up libxinerama1:armhf (2:1.1.4-2) ...
Setting up libxrandr2:armhf (2:1.5.1-1) ...
Setting up libxcb-render0-dev:armhf (1.13.1-2) ...
Setting up libxext-dev:armhf (2:1.3.3-1+b2) ...
Setting up libcups2:armhf (2.3.1-1) ...
Setting up libgdk-pixbuf2.0-bin (2.40.0+dfsg-2+rpi1) ...
Setting up libfontconfig1:armhf (2.13.1-2) ...
Setting up libxine2-dev (1.2.9-1+b4) ...
Setting up python3-lib2to3 (3.8.0-1) ...
Setting up libxrender-dev:armhf (1:0.9.10-1) ...
Setting up python3-distutils (3.8.0-1) ...
Setting up libglib2.0-dev-bin (2.62.4-1) ...
Setting up gtk-update-icon-cache (3.24.13-1) ...
Setting up fontconfig (2.13.1-2) ...
Regenerating fonts cache... done.
Setting up libxft2:armhf (2.3.2-2) ...
Setting up libxdamage1:armhf (1:1.1.5-1) ...
Setting up libxi6:armhf (2:1.7.9-1) ...
Setting up gir1.2-gdkpixbuf-2.0:armhf (2.40.0+dfsg-2+rpi1) ...
Setting up libgconf-2-4:armhf (3.2.6-6) ...
Setting up po-debconf (1.0.21) ...
Setting up libxcursor1:armhf (1:1.2.0-2) ...
Setting up libpango-1.0-0:armhf (1.42.4-7+b1) ...
Setting up libcairo2:armhf (1.16.0-4) ...
Setting up libfreetype6-dev:armhf (2.10.1-2) ...
Setting up libcairomm-1.0-1v5:armhf (1.12.2-4) ...
Setting up libxfixes-dev:armhf (1:5.0.3-1) ...
Setting up libxrandr-dev:armhf (2:1.5.1-1) ...
Setting up libglib2.0-dev:armhf (2.62.4-1) ...
Setting up libglibmm-2.4-dev:armhf (2.62.0-1) ...
Setting up libxinerama-dev:armhf (2:1.1.4-2) ...
Setting up gconf-service (3.2.6-6) ...
Setting up libcairo-gobject2:armhf (1.16.0-4) ...
Setting up libpangoft2-1.0-0:armhf (1.42.4-7+b1) ...
Setting up libxi-dev:armhf (2:1.7.9-1) ...
Setting up libatk1.0-dev:armhf (2.34.1-1) ...
Setting up libpangocairo-1.0-0:armhf (1.42.4-7+b1) ...
Setting up libxdamage-dev:armhf (1:1.1.5-1) ...
Setting up libcairo-script-interpreter2:armhf (1.16.0-4) ...
Setting up gir1.2-gconf-2.0 (3.2.6-6) ...
Setting up libharfbuzz-dev:armhf (2.6.4-1+rpi1) ...
Setting up libfontconfig1-dev:armhf (2.13.1-2) ...
Setting up libpangoxft-1.0-0:armhf (1.42.4-7+b1) ...
Setting up libgconfmm-2.6-1v5:armhf (2.28.3-1) ...
Setting up libdbus-glib-1-dev:armhf (0.110-5) ...
Setting up libxcomposite-dev:armhf (1:0.4.4-2) ...
Setting up libxcursor-dev:armhf (1:1.2.0-2) ...
Setting up pango1.0-tools (1.42.4-7+b1) ...
Setting up gconf2 (3.2.6-6) ...
Setting up libgdk-pixbuf2.0-dev:armhf (2.40.0+dfsg-2+rpi1) ...
Setting up librsvg2-2:armhf (2.46.4-1) ...
Setting up gir1.2-pango-1.0:armhf (1.42.4-7+b1) ...
Setting up librsvg2-common:armhf (2.46.4-1) ...
Setting up libpangomm-1.4-1v5:armhf (2.42.0-2) ...
Setting up libatkmm-1.6-dev:armhf (2.28.0-2) ...
Setting up libcairo2-dev:armhf (1.16.0-4) ...
Setting up libxft-dev:armhf (2.3.2-2) ...
Setting up libgconf2-dev (3.2.6-6) ...
Setting up libcairomm-1.0-dev:armhf (1.12.2-4) ...
Setting up adwaita-icon-theme (3.34.0-2) ...
update-alternatives: using /usr/share/icons/Adwaita/cursor.theme to provide /usr/share/icons/default/index.theme (x-cursor-theme) in auto mode
Setting up libpango1.0-dev:armhf (1.42.4-7+b1) ...
Setting up libpangomm-1.4-dev:armhf (2.42.0-2) ...
Setting up libgconfmm-2.6-dev:armhf (2.28.3-1) ...
Setting up libgtk2.0-0:armhf (2.24.32-4) ...
Setting up gir1.2-gtk-2.0:armhf (2.24.32-4) ...
Setting up libunique-1.0-0 (1.1.6-6) ...
Setting up libgtkmm-2.4-1v5:armhf (1:2.24.5-4) ...
Setting up libgtk2.0-dev:armhf (2.24.32-4) ...
Setting up libgtkmm-2.4-dev:armhf (1:2.24.5-4) ...
Setting up libunique-dev (1.1.6-6) ...
Setting up dh-autoreconf (19) ...
Setting up liblwp-protocol-https-perl (6.07-2) ...
Setting up libwww-perl (6.43-1) ...
Setting up debhelper (12.7.3) ...
Setting up libxml-parser-perl (2.46-1+b1) ...
Setting up intltool (0.51.0-5) ...
Setting up sbuild-build-depends-me-tv-dummy (0.invalid.0) ...
Processing triggers for libc-bin (2.29-7+rpi1) ...
Processing triggers for systemd (244-3+rpi1+b1) ...
Processing triggers for ca-certificates (20190110) ...
Updating certificates in /etc/ssl/certs...
0 added, 0 removed; done.
Running hooks in /etc/ca-certificates/update.d...
done.
Processing triggers for libgdk-pixbuf2.0-0:armhf (2.40.0+dfsg-2+rpi1) ...

+------------------------------------------------------------------------------+
| Build environment                                                            |
+------------------------------------------------------------------------------+

Kernel: Linux 4.19.20-v7+ armhf (armv7l)
Toolchain package versions: binutils_2.33.1-6+rpi1 dpkg-dev_1.19.7 g++-9_9.2.1-22+rpi1 gcc-9_9.2.1-22+rpi1 libc6-dev_2.29-7+rpi1 libstdc++-9-dev_9.2.1-22+rpi1 libstdc++6_9.2.1-22+rpi1 linux-libc-dev_5.2.17-1+rpi1+b2
Package versions: adduser_3.118 adwaita-icon-theme_3.34.0-2 apt_1.8.4 autoconf_2.69-11 automake_1:1.16.1-4 autopoint_0.19.8.1-10 autotools-dev_20180224.1 base-files_11+rpi1 base-passwd_3.5.47 bash_5.0-5 binutils_2.33.1-6+rpi1 binutils-arm-linux-gnueabihf_2.33.1-6+rpi1 binutils-common_2.33.1-6+rpi1 bsdmainutils_11.1.2 bsdutils_1:2.34-0.1 build-essential_12.8 bzip2_1.0.8-2 ca-certificates_20190110 coreutils_8.30-3 cpp_4:9.2.1-3.1+rpi1 cpp-9_9.2.1-22+rpi1 dash_0.5.10.2-6 dbus_1.12.16-2+b1 dbus-user-session_1.12.16-2+b1 debconf_1.5.73 debhelper_12.7.3 debianutils_4.9.1 dh-autoreconf_19 dh-strip-nondeterminism_1.6.3-2 diffutils_1:3.7-3 dirmngr_2.2.19-1 dmsetup_2:1.02.167-1 dpkg_1.19.7 dpkg-dev_1.19.7 dwz_0.13-5 e2fsprogs_1.45.5-2 fakeroot_1.24-1 fdisk_2.34-0.1 file_1:5.38-3 findutils_4.7.0-1 fontconfig_2.13.1-2 fontconfig-config_2.13.1-2 fonts-dejavu-core_2.37-1 g++_4:9.2.1-3.1+rpi1 g++-9_9.2.1-22+rpi1 gcc_4:9.2.1-3.1+rpi1 gcc-9_9.2.1-22+rpi1 gcc-9-base_9.2.1-22+rpi1 gconf-service_3.2.6-6 gconf2_3.2.6-6 gconf2-common_3.2.6-6 gettext_0.19.8.1-10 gettext-base_0.19.8.1-10 gir1.2-atk-1.0_2.34.1-1 gir1.2-freedesktop_1.62.0-2 gir1.2-gconf-2.0_3.2.6-6 gir1.2-gdkpixbuf-2.0_2.40.0+dfsg-2+rpi1 gir1.2-glib-2.0_1.62.0-2 gir1.2-gtk-2.0_2.24.32-4 gir1.2-harfbuzz-0.0_2.6.4-1+rpi1 gir1.2-pango-1.0_1.42.4-7+b1 gnupg_2.2.19-1 gnupg-l10n_2.2.19-1 gnupg-utils_2.2.19-1 gpg_2.2.19-1 gpg-agent_2.2.19-1 gpg-wks-client_2.2.19-1 gpg-wks-server_2.2.19-1 gpgconf_2.2.19-1 gpgsm_2.2.19-1 gpgv_2.2.19-1 grep_3.3-1 groff-base_1.22.4-4 gtk-update-icon-cache_3.24.13-1 gzip_1.9-3 hicolor-icon-theme_0.17-2 hostname_3.23 icu-devtools_63.2-2 init-system-helpers_1.57 intltool_0.51.0-5 intltool-debian_0.35.0+20060710.5 iputils-ping_3:20190709-2 libacl1_2.2.53-5 libapparmor1_2.13.3-7 libapt-pkg5.0_1.8.4 libarchive-zip-perl_1.67-1 libargon2-1_0~20171227-0.2 libasan5_9.2.1-22+rpi1 libassuan0_2.5.3-7 libatk1.0-0_2.34.1-1 libatk1.0-data_2.34.1-1 libatk1.0-dev_2.34.1-1 libatkmm-1.6-1v5_2.28.0-2 libatkmm-1.6-dev_2.28.0-2 libatomic1_9.2.1-22+rpi1 libattr1_1:2.4.48-5 libaudit-common_1:2.8.5-2 libaudit1_1:2.8.5-2+b1 libavahi-client3_0.7-5 libavahi-common-data_0.7-5 libavahi-common3_0.7-5 libbinutils_2.33.1-6+rpi1 libblkid-dev_2.34-0.1 libblkid1_2.34-0.1 libbsd0_0.10.0-1 libbz2-1.0_1.0.8-2 libc-bin_2.29-7+rpi1 libc-dev-bin_2.29-7+rpi1 libc6_2.29-7+rpi1 libc6-dev_2.29-7+rpi1 libcairo-gobject2_1.16.0-4 libcairo-script-interpreter2_1.16.0-4 libcairo2_1.16.0-4 libcairo2-dev_1.16.0-4 libcairomm-1.0-1v5_1.12.2-4 libcairomm-1.0-dev_1.12.2-4 libcap-ng0_0.7.9-2.1 libcap2_1:2.27-1 libcap2-bin_1:2.27-1 libcc1-0_9.2.1-22+rpi1 libcom-err2_1.45.5-2 libcroco3_0.6.13-1 libcrypt-dev_1:4.4.10-10+b5 libcrypt1_1:4.4.10-10+b5 libcryptsetup12_2:2.2.2-2 libcups2_2.3.1-1 libdatrie1_0.2.12-3+b1 libdb5.3_5.3.28+dfsg1-0.6 libdbus-1-3_1.12.16-2+b1 libdbus-1-dev_1.12.16-2+b1 libdbus-glib-1-2_0.110-5 libdbus-glib-1-dev_0.110-5 libdbus-glib-1-dev-bin_0.110-5 libdebconfclient0_0.250 libdebhelper-perl_12.7.3 libdevmapper1.02.1_2:1.02.167-1 libdpkg-perl_1.19.7 libelf1_0.176-1.1 libencode-locale-perl_1.05-1 libexpat1_2.2.9-1 libexpat1-dev_2.2.9-1 libext2fs2_1.45.5-2 libfakeroot_1.24-1 libfdisk1_2.34-0.1 libffi-dev_3.2.1-9 libffi6_3.2.1-9 libfile-listing-perl_6.04-1 libfile-stripnondeterminism-perl_1.6.3-2 libfontconfig1_2.13.1-2 libfontconfig1-dev_2.13.1-2 libfreetype-dev_2.10.1-2 libfreetype6_2.10.1-2 libfreetype6-dev_2.10.1-2 libfribidi-dev_1.0.7-1.1 libfribidi0_1.0.7-1.1 libgcc-9-dev_9.2.1-22+rpi1 libgcc1_1:9.2.1-22+rpi1 libgconf-2-4_3.2.6-6 libgconf2-dev_3.2.6-6 libgconfmm-2.6-1v5_2.28.3-1 libgconfmm-2.6-dev_2.28.3-1 libgcrypt20_1.8.5-3 libgdbm-compat4_1.18.1-5 libgdbm6_1.18.1-5 libgdk-pixbuf2.0-0_2.40.0+dfsg-2+rpi1 libgdk-pixbuf2.0-bin_2.40.0+dfsg-2+rpi1 libgdk-pixbuf2.0-common_2.40.0+dfsg-2+rpi1 libgdk-pixbuf2.0-dev_2.40.0+dfsg-2+rpi1 libgirepository-1.0-1_1.62.0-2 libglib2.0-0_2.62.4-1 libglib2.0-bin_2.62.4-1 libglib2.0-data_2.62.4-1 libglib2.0-dev_2.62.4-1 libglib2.0-dev-bin_2.62.4-1 libglibmm-2.4-1v5_2.62.0-1 libglibmm-2.4-dev_2.62.0-1 libgmp10_2:6.1.2+dfsg-4 libgnutls30_3.6.11.1-2 libgomp1_9.2.1-22+rpi1 libgpg-error0_1.36-7 libgraphite2-3_1.3.13-11 libgraphite2-dev_1.3.13-11 libgssapi-krb5-2_1.17-6+b1 libgtk2.0-0_2.24.32-4 libgtk2.0-common_2.24.32-4 libgtk2.0-dev_2.24.32-4 libgtkmm-2.4-1v5_1:2.24.5-4 libgtkmm-2.4-dev_1:2.24.5-4 libharfbuzz-dev_2.6.4-1+rpi1 libharfbuzz-gobject0_2.6.4-1+rpi1 libharfbuzz-icu0_2.6.4-1+rpi1 libharfbuzz0b_2.6.4-1+rpi1 libhogweed5_3.5.1+really3.5.1-2 libhtml-parser-perl_3.72-3+b5 libhtml-tagset-perl_3.20-4 libhtml-tree-perl_5.07-2 libhttp-cookies-perl_6.08-1 libhttp-date-perl_6.05-1 libhttp-message-perl_6.18-1 libhttp-negotiate-perl_6.01-1 libice-dev_2:1.0.9-2 libice6_2:1.0.9-2 libicu-dev_63.2-2 libicu63_63.2-2 libidn2-0_2.2.0-2 libio-html-perl_1.001-1 libio-socket-ssl-perl_2.066-1 libip4tc2_1.8.3-2 libisl22_0.22-2 libjbig0_2.1-3.1+b2 libjpeg62-turbo_1:1.5.2-2+b1 libjson-c4_0.13.1+dfsg-6 libk5crypto3_1.17-6+b1 libkeyutils1_1.6-6 libkmod2_26+20191223-1 libkrb5-3_1.17-6+b1 libkrb5support0_1.17-6+b1 libksba8_1.3.5-2 libldap-2.4-2_2.4.48+dfsg-1+b2 libldap-common_2.4.48+dfsg-1 liblwp-mediatypes-perl_6.04-1 liblwp-protocol-https-perl_6.07-2 liblz4-1_1.9.2-2 liblzma5_5.2.4-1 liblzo2-2_2.10-0.1 libmagic-mgc_1:5.38-3 libmagic1_1:5.38-3 libmount-dev_2.34-0.1 libmount1_2.34-0.1 libmpc3_1.1.0-1 libmpdec2_2.4.2-2 libmpfr6_4.0.2-1 libncursesw6_6.1+20191019-1 libnet-http-perl_6.19-1 libnet-ssleay-perl_1.88-2 libnettle7_3.5.1+really3.5.1-2 libnpth0_1.6-1 libp11-kit0_0.23.18.1-2 libpam-cap_1:2.27-1 libpam-modules_1.3.1-5 libpam-modules-bin_1.3.1-5 libpam-runtime_1.3.1-5 libpam-systemd_244-3+rpi1+b1 libpam0g_1.3.1-5 libpango-1.0-0_1.42.4-7+b1 libpango1.0-dev_1.42.4-7+b1 libpangocairo-1.0-0_1.42.4-7+b1 libpangoft2-1.0-0_1.42.4-7+b1 libpangomm-1.4-1v5_2.42.0-2 libpangomm-1.4-dev_2.42.0-2 libpangoxft-1.0-0_1.42.4-7+b1 libpcre16-3_2:8.39-12 libpcre2-16-0_10.34-7 libpcre2-32-0_10.34-7 libpcre2-8-0_10.34-7 libpcre2-dev_10.34-7 libpcre2-posix2_10.34-7 libpcre3_2:8.39-12 libpcre3-dev_2:8.39-12 libpcre32-3_2:8.39-12 libpcrecpp0v5_2:8.39-12 libperl5.28_5.28.1-6 libperl5.30_5.30.0-9 libpipeline1_1.5.2-2 libpixman-1-0_0.36.0-1 libpixman-1-dev_0.36.0-1 libpng-dev_1.6.37-1 libpng16-16_1.6.37-1 libpthread-stubs0-dev_0.4-1 libpython3-stdlib_3.7.5-3 libpython3.7-minimal_3.7.6-1 libpython3.7-stdlib_3.7.6-1 libreadline7_7.0-5 libreadline8_8.0-3 librsvg2-2_2.46.4-1 librsvg2-common_2.46.4-1 libsasl2-2_2.1.27+dfsg-2 libsasl2-modules-db_2.1.27+dfsg-2 libseccomp2_2.4.2-2+rpi1 libselinux1_3.0-1 libselinux1-dev_3.0-1 libsemanage-common_3.0-1 libsemanage1_3.0-1 libsepol1_3.0-1 libsepol1-dev_3.0-1 libsigc++-2.0-0v5_2.10.2-1 libsigc++-2.0-dev_2.10.2-1 libsigsegv2_2.12-2 libsm-dev_2:1.2.3-1 libsm6_2:1.2.3-1 libsmartcols1_2.34-0.1 libsqlite3-0_3.30.1+fossil191229-1 libsqlite3-dev_3.30.1+fossil191229-1 libss2_1.45.5-2 libssl1.1_1.1.1d-2 libstdc++-9-dev_9.2.1-22+rpi1 libstdc++6_9.2.1-22+rpi1 libsub-override-perl_0.09-2 libsystemd0_244-3+rpi1+b1 libtasn1-6_4.15.0-2 libthai-data_0.1.28-3 libthai0_0.1.28-3 libtiff5_4.1.0+git191117-2 libtimedate-perl_2.3100-1 libtinfo5_6.1+20191019-1 libtinfo6_6.1+20191019-1 libtool_2.4.6-11 libtry-tiny-perl_0.30-1 libubsan1_9.2.1-22+rpi1 libuchardet0_0.0.6-3 libudev1_244-3+rpi1+b1 libunique-1.0-0_1.1.6-6 libunique-dev_1.1.6-6 libunistring2_0.9.10-2 liburi-perl_1.76-1 libuuid1_2.34-0.1 libwebp6_0.6.1-2 libwww-perl_6.43-1 libwww-robotrules-perl_6.02-1 libx11-6_2:1.6.8-1 libx11-data_2:1.6.8-1 libx11-dev_2:1.6.8-1 libxau-dev_1:1.0.8-1+b2 libxau6_1:1.0.8-1+b2 libxcb-render0_1.13.1-2 libxcb-render0-dev_1.13.1-2 libxcb-shm0_1.13.1-2 libxcb-shm0-dev_1.13.1-2 libxcb1_1.13.1-2 libxcb1-dev_1.13.1-2 libxcomposite-dev_1:0.4.4-2 libxcomposite1_1:0.4.4-2 libxcursor-dev_1:1.2.0-2 libxcursor1_1:1.2.0-2 libxdamage-dev_1:1.1.5-1 libxdamage1_1:1.1.5-1 libxdmcp-dev_1:1.1.2-3 libxdmcp6_1:1.1.2-3 libxext-dev_2:1.3.3-1+b2 libxext6_2:1.3.3-1+b2 libxfixes-dev_1:5.0.3-1 libxfixes3_1:5.0.3-1 libxft-dev_2.3.2-2 libxft2_2.3.2-2 libxi-dev_2:1.7.9-1 libxi6_2:1.7.9-1 libxine2-bin_1.2.9-1+b4 libxine2-dev_1.2.9-1+b4 libxinerama-dev_2:1.1.4-2 libxinerama1_2:1.1.4-2 libxml-parser-perl_2.46-1+b1 libxml2_2.9.4+dfsg1-8 libxml2-utils_2.9.4+dfsg1-8 libxrandr-dev_2:1.5.1-1 libxrandr2_2:1.5.1-1 libxrender-dev_1:0.9.10-1 libxrender1_1:0.9.10-1 libzstd1_1.4.4+dfsg-1+rpi1 linux-libc-dev_5.2.17-1+rpi1+b2 login_1:4.8-1 logsave_1.45.5-2 lsb-base_11.1.0+rpi1 m4_1.4.18-4 make_4.2.1-1.2 man-db_2.9.0-2 mawk_1.3.3-17 mime-support_3.64 mount_2.34-0.1 ncurses-base_6.1+20191019-1 ncurses-bin_6.1+20191019-1 netbase_6.0 openssl_1.1.1d-2 pango1.0-tools_1.42.4-7+b1 passwd_1:4.8-1 patch_2.7.6-6 perl_5.30.0-9 perl-base_5.30.0-9 perl-modules-5.28_5.28.1-6 perl-modules-5.30_5.30.0-9 perl-openssl-defaults_3 pinentry-curses_1.1.0-3 pkg-config_0.29-6 po-debconf_1.0.21 psmisc_23.3-1 python3_3.7.5-3 python3-distutils_3.8.0-1 python3-lib2to3_3.8.0-1 python3-minimal_3.7.5-3 python3.7_3.7.6-1 python3.7-minimal_3.7.6-1 raspbian-archive-keyring_20120528.2 readline-common_8.0-3 sbuild-build-depends-core-dummy_0.invalid.0 sbuild-build-depends-me-tv-dummy_0.invalid.0 sed_4.7-1 sensible-utils_0.0.12+nmu1 shared-mime-info_1.10-1 systemd_244-3+rpi1+b1 systemd-sysv_244-3+rpi1+b1 sysvinit-utils_2.96-1 tar_1.30+dfsg-6 tzdata_2019c-3 ucf_3.0038+nmu1 util-linux_2.34-0.1 uuid-dev_2.34-0.1 x11-common_1:7.7+20 x11proto-composite-dev_1:2018.4-4 x11proto-core-dev_2018.4-4 x11proto-damage-dev_1:2018.4-4 x11proto-dev_2018.4-4 x11proto-fixes-dev_1:2018.4-4 x11proto-input-dev_2018.4-4 x11proto-randr-dev_2018.4-4 x11proto-xext-dev_2018.4-4 x11proto-xinerama-dev_2018.4-4 xorg-sgml-doctools_1:1.11-1 xtrans-dev_1.3.5-1 xz-utils_5.2.4-1 zlib1g_1:1.2.11.dfsg-1 zlib1g-dev_1:1.2.11.dfsg-1

+------------------------------------------------------------------------------+
| Build                                                                        |
+------------------------------------------------------------------------------+


Unpack source
-------------

gpgv: unknown type of key resource 'trustedkeys.kbx'
gpgv: keyblock resource '/sbuild-nonexistent/.gnupg/trustedkeys.kbx': General error
gpgv: Signature made Sun Jul 20 23:24:03 2014 UTC
gpgv:                using DSA key AC2A5FFE00823EC2
gpgv: Can't check signature: No public key
dpkg-source: warning: failed to verify signature on ./me-tv_1.3.7-1.dsc
dpkg-source: info: extracting me-tv in /<<PKGBUILDDIR>>
dpkg-source: info: unpacking me-tv_1.3.7.orig.tar.gz
dpkg-source: info: unpacking me-tv_1.3.7-1.debian.tar.xz
dpkg-source: info: using patch list from debian/patches/series
dpkg-source: info: applying add_po_makefile_in_in.patch
dpkg-source: info: applying fix_database_access_problem.patch

Check disk space
----------------

Sufficient free space for build

Hack binNMU version
-------------------

Created changelog entry for binNMU version 1.3.7-1+b2

User Environment
----------------

APT_CONFIG=/var/lib/sbuild/apt.conf
DBUS_SESSION_BUS_ADDRESS=unix:path=/run/user/112/bus
DEB_BUILD_OPTIONS=parallel=4
HOME=/sbuild-nonexistent
INVOCATION_ID=c605eeb4e47242eab5a84ad883abfd9b
JOURNAL_STREAM=8:18382
LANG=en_GB.UTF-8
LC_ALL=POSIX
LOGNAME=buildd
PATH=/usr/local/sbin:/usr/local/bin:/usr/sbin:/usr/bin:/sbin:/bin:/usr/games
PWD=/
SCHROOT_ALIAS_NAME=bullseye-staging-armhf-sbuild
SCHROOT_CHROOT_NAME=bullseye-staging-armhf-sbuild
SCHROOT_COMMAND=env
SCHROOT_GID=116
SCHROOT_GROUP=buildd
SCHROOT_SESSION_ID=bullseye-staging-armhf-sbuild-0486d88b-2544-4783-b0d7-d437ce0d5c0c
SCHROOT_UID=112
SCHROOT_USER=buildd
SHELL=/bin/sh
USER=buildd
XDG_RUNTIME_DIR=/run/user/112
XDG_SESSION_ID=c15450

dpkg-buildpackage
-----------------

dpkg-buildpackage: info: source package me-tv
dpkg-buildpackage: info: source version 1.3.7-1+b2
dpkg-buildpackage: info: source distribution bullseye-staging
 dpkg-source --before-build .
dpkg-buildpackage: info: host architecture armhf
 fakeroot debian/rules clean
dh --with xine clean
dh: Compatibility levels before 9 are deprecated (level 7 in use)
   dh_clean
dh_clean: Compatibility levels before 9 are deprecated (level 7 in use)
 debian/rules build-arch
dh --with xine build-arch
dh: Compatibility levels before 9 are deprecated (level 7 in use)
   dh_update_autotools_config -a
   debian/rules override_dh_auto_configure
make[1]: Entering directory '/<<PKGBUILDDIR>>'
dh_autoreconf
configure.ac:8: installing './compile'
configure.ac:7: installing './install-sh'
configure.ac:7: installing './missing'
src/Makefile.am: installing './depcomp'
dh_auto_configure -- --disable-schemas-install
dh_auto_configure: Compatibility levels before 9 are deprecated (level 7 in use)
	./configure --build=arm-linux-gnueabihf --prefix=/usr --includedir=\${prefix}/include --mandir=\${prefix}/share/man --infodir=\${prefix}/share/info --sysconfdir=/etc --localstatedir=/var --disable-silent-rules --libexecdir=\${prefix}/lib/me-tv --disable-maintainer-mode --disable-dependency-tracking --disable-schemas-install
checking for a BSD-compatible install... /usr/bin/install -c
checking whether build environment is sane... yes
checking for a thread-safe mkdir -p... /bin/mkdir -p
checking for gawk... no
checking for mawk... mawk
checking whether make sets $(MAKE)... yes
checking whether make supports nested variables... yes
checking whether make supports the include directive... yes (GNU style)
checking for gcc... gcc
checking whether the C compiler works... yes
checking for C compiler default output file name... a.out
checking for suffix of executables... 
checking whether we are cross compiling... no
checking for suffix of object files... o
checking whether we are using the GNU C compiler... yes
checking whether gcc accepts -g... yes
checking for gcc option to accept ISO C89... none needed
checking whether gcc understands -c and -o together... yes
checking dependency style of gcc... none
checking how to run the C preprocessor... gcc -E
checking for grep that handles long lines and -e... /bin/grep
checking for egrep... /bin/grep -E
checking for ANSI C header files... yes
checking for sys/types.h... yes
checking for sys/stat.h... yes
checking for stdlib.h... yes
checking for string.h... yes
checking for memory.h... yes
checking for strings.h... yes
checking for inttypes.h... yes
checking for stdint.h... yes
checking for unistd.h... yes
checking minix/config.h usability... no
checking minix/config.h presence... no
checking for minix/config.h... no
checking whether it is safe to define __EXTENSIONS__... yes
checking whether to enable maintainer-specific portions of Makefiles... no
checking for g++... g++
checking whether we are using the GNU C++ compiler... yes
checking whether g++ accepts -g... yes
checking dependency style of g++... none
checking for gcc... (cached) gcc
checking whether we are using the GNU C compiler... (cached) yes
checking whether gcc accepts -g... (cached) yes
checking for gcc option to accept ISO C89... (cached) none needed
checking whether gcc understands -c and -o together... (cached) yes
checking dependency style of gcc... (cached) none
checking for library containing strerror... none required
checking for gcc... (cached) gcc
checking whether we are using the GNU C compiler... (cached) yes
checking whether gcc accepts -g... (cached) yes
checking for gcc option to accept ISO C89... (cached) none needed
checking whether gcc understands -c and -o together... (cached) yes
checking dependency style of gcc... (cached) none
checking how to run the C preprocessor... gcc -E
checking whether ln -s works... yes
checking whether make sets $(MAKE)... (cached) yes
checking for ranlib... ranlib
./configure: line 6727: GNOME_COMMON_INIT: command not found
./configure: line 6741: GNOME_DEBUG_CHECK: command not found
./configure: line 6742: GNOME_MAINTAINER_MODE_DEFINES: command not found
./configure: line 6743: GNOME_CXX_WARNINGS: command not found
checking what more warning flags to pass to the C compiler... none
checking for X... libraries , headers 
checking for ANSI C header files... (cached) yes
checking for sys/wait.h that is POSIX.1 compatible... yes
checking fcntl.h usability... yes
checking fcntl.h presence... yes
checking for fcntl.h... yes
checking for stdint.h... (cached) yes
checking for stdlib.h... (cached) yes
checking for string.h... (cached) yes
checking sys/ioctl.h usability... yes
checking sys/ioctl.h presence... yes
checking for sys/ioctl.h... yes
checking for unistd.h... (cached) yes
checking for stdbool.h that conforms to C99... yes
checking for _Bool... yes
checking for an ANSI C-conforming const... yes
checking for inline... inline
checking for mode_t... yes
checking for size_t... yes
checking whether struct tm is in sys/time.h or time.h... time.h
checking for uint16_t... yes
checking for uint32_t... yes
checking for uint8_t... yes
checking whether gcc needs -traditional... no
checking whether time.h and sys/time.h may both be included... yes
checking for sys/time.h... yes
checking for unistd.h... (cached) yes
checking for alarm... yes
checking for working mktime... yes
checking for stdlib.h... (cached) yes
checking for GNU libc compatible realloc... yes
checking sys/select.h usability... yes
checking sys/select.h presence... yes
checking for sys/select.h... yes
checking sys/socket.h usability... yes
checking sys/socket.h presence... yes
checking for sys/socket.h... yes
checking types of arguments for select... int,fd_set *,struct timeval *
checking for strftime... yes
checking for localtime_r... yes
checking for mempcpy... yes
checking for memset... yes
checking for mkfifo... yes
checking for select... yes
checking for strerror... yes
checking for tzset... yes
checking locale.h usability... yes
checking locale.h presence... yes
checking for locale.h... yes
checking for LC_MESSAGES... yes
checking for CFPreferencesCopyAppValue... no
checking for CFLocaleCopyCurrent... no
checking libintl.h usability... yes
checking libintl.h presence... yes
checking for libintl.h... yes
checking for ngettext in libc... yes
checking for dgettext in libc... yes
checking for bind_textdomain_codeset... yes
checking for msgfmt... /usr/bin/msgfmt
checking for dcgettext... yes
checking if msgfmt accepts -c... yes
checking for gmsgfmt... /usr/bin/msgfmt
checking for xgettext... /usr/bin/xgettext
checking whether NLS is requested... yes
checking for intltool >= 0.35.0... 0.51.0 found
checking for intltool-update... /usr/bin/intltool-update
checking for intltool-merge... /usr/bin/intltool-merge
checking for intltool-extract... /usr/bin/intltool-extract
checking for xgettext... (cached) /usr/bin/xgettext
checking for msgmerge... /usr/bin/msgmerge
checking for msgfmt... (cached) /usr/bin/msgfmt
checking for gmsgfmt... (cached) /usr/bin/msgfmt
checking for perl... /usr/bin/perl
checking for perl >= 5.8.1... 5.30.0
checking for XML::Parser... ok
checking for pkg-config... /usr/bin/pkg-config
checking pkg-config is at least version 0.9.0... yes
checking for SQLITE... yes
checking for ME_TV... yes
checking for gconftool-2... /usr/bin/gconftool-2
Using config source xml:merged:/etc/gconf/gconf.xml.defaults for schema installation
Using $(sysconfdir)/gconf/schemas as install directory for schema files
checking gtk-doc version >= 1.0... no
checking for ME_TV_PLAYER... yes
checking that generated files are newer than configure... done
configure: creating ./config.status
config.status: creating Makefile
config.status: creating src/Makefile
config.status: creating po/Makefile.in
config.status: creating config.h
config.status: executing depfiles commands
config.status: executing default-1 commands
config.status: executing po/stamp-it commands


Configure summary:

	Source code location .......: .
	Compiler ...................: gcc
	Compiler flags .............: -g -O2
	Enable compile warnings ....: 
	Enable more warnings .......: no
	Extra Compiler Warnings ....: 
	Debug support ..............: 
	Installing into prefix .....: /usr

Type make to build Me TV 1.3.7


make[1]: Leaving directory '/<<PKGBUILDDIR>>'
   dh_auto_build -a
dh_auto_build: Compatibility levels before 9 are deprecated (level 7 in use)
	make -j1
make[1]: Entering directory '/<<PKGBUILDDIR>>'
make  all-recursive
make[2]: Entering directory '/<<PKGBUILDDIR>>'
Making all in src
make[3]: Entering directory '/<<PKGBUILDDIR>>/src'
g++ -DHAVE_CONFIG_H -I. -I..  -I.. -I.. -pthread -I/usr/include/gtkmm-2.4 -I/usr/lib/arm-linux-gnueabihf/gtkmm-2.4/include -I/usr/include/atkmm-1.6 -I/usr/include/gtk-unix-print-2.0 -I/usr/include/gtk-2.0 -I/usr/include/gdkmm-2.4 -I/usr/lib/arm-linux-gnueabihf/gdkmm-2.4/include -I/usr/include/pangomm-1.4 -I/usr/lib/arm-linux-gnueabihf/pangomm-1.4/include -I/usr/include/cairomm-1.0 -I/usr/lib/arm-linux-gnueabihf/cairomm-1.0/include -I/usr/include/giomm-2.4 -I/usr/lib/arm-linux-gnueabihf/giomm-2.4/include -I/usr/include/gconfmm-2.6 -I/usr/lib/arm-linux-gnueabihf/gconfmm-2.6/include -I/usr/include/glibmm-2.4 -I/usr/lib/arm-linux-gnueabihf/glibmm-2.4/include -I/usr/include/sigc++-2.0 -I/usr/lib/arm-linux-gnueabihf/sigc++-2.0/include -I/usr/include/gconf/2 -I/usr/include/unique-1.0 -I/usr/include/gtk-2.0 -I/usr/lib/arm-linux-gnueabihf/gtk-2.0/include -I/usr/include/pango-1.0 -I/usr/include/atk-1.0 -I/usr/include/cairo -I/usr/include/pixman-1 -I/usr/include/gdk-pixbuf-2.0 -I/usr/include/libmount -I/usr/include/blkid -I/usr/include/pango-1.0 -I/usr/include/harfbuzz -I/usr/include/pango-1.0 -I/usr/include/fribidi -I/usr/include/uuid -I/usr/include/freetype2 -I/usr/include/libpng16 -I/usr/include/dbus-1.0 -I/usr/lib/arm-linux-gnueabihf/dbus-1.0/include -I/usr/include/glib-2.0 -I/usr/lib/arm-linux-gnueabihf/glib-2.0/include    -DPACKAGE_DATA_DIR=\""/usr/share"\" -DPACKAGE_SRC_DIR=\""."\"    -g -O2 -c -o main.o main.cc
In file included from /usr/include/gdkmm-2.4/gdkmm.h:34,
                 from /usr/include/gtkmm-2.4/gtkmm.h:89,
                 from me-tv.h:30,
                 from main.cc:21:
/usr/include/gdkmm-2.4/gdkmm/pixbufanimation.h:124:72: warning: 'GTimeVal' is deprecated: Use 'GDateTime' instead [-Wdeprecated-declarations]
  124 |   Glib::RefPtr<PixbufAnimationIter> get_iter(const GTimeVal* start_time);
      |                                                                        ^
In file included from /usr/include/glib-2.0/glib/galloca.h:32,
                 from /usr/include/glib-2.0/glib.h:30,
                 from /usr/include/glibmm-2.4/glibmm/thread.h:39,
                 from /usr/include/glibmm-2.4/glibmm.h:88,
                 from /usr/include/gtkmm-2.4/gtkmm.h:87,
                 from me-tv.h:30,
                 from main.cc:21:
/usr/include/glib-2.0/glib/gtypes.h:549:26: note: declared here
  549 | typedef struct _GTimeVal GTimeVal GLIB_DEPRECATED_TYPE_IN_2_62_FOR(GDateTime);
      |                          ^~~~~~~~
In file included from /usr/include/gtk-2.0/gtk/gtkobject.h:37,
                 from /usr/include/gtk-2.0/gtk/gtkwidget.h:36,
                 from /usr/include/gtk-2.0/gtk/gtkcontainer.h:35,
                 from /usr/include/gtk-2.0/gtk/gtkbin.h:35,
                 from /usr/include/gtk-2.0/gtk/gtkwindow.h:36,
                 from /usr/include/gtk-2.0/gtk/gtkdialog.h:35,
                 from /usr/include/gtk-2.0/gtk/gtkaboutdialog.h:32,
                 from /usr/include/gtk-2.0/gtk/gtk.h:33,
                 from /usr/include/gtkmm-2.4/gtkmm/box.h:44,
                 from /usr/include/gtkmm-2.4/gtkmm.h:91,
                 from me-tv.h:30,
                 from main.cc:21:
/usr/include/gtk-2.0/gtk/gtktypeutils.h:236:64: warning: 'GTypeDebugFlags' is deprecated [-Wdeprecated-declarations]
  236 | void            gtk_type_init   (GTypeDebugFlags    debug_flags);
      |                                                                ^
In file included from /usr/include/glib-2.0/gobject/gobject.h:24,
                 from /usr/include/glib-2.0/gobject/gbinding.h:29,
                 from /usr/include/glib-2.0/glib-object.h:23,
                 from /usr/include/glibmm-2.4/glibmm/value.h:24,
                 from /usr/include/glibmm-2.4/glibmm/error.h:22,
                 from /usr/include/glibmm-2.4/glibmm/thread.h:48,
                 from /usr/include/glibmm-2.4/glibmm.h:88,
                 from /usr/include/gtkmm-2.4/gtkmm.h:87,
                 from me-tv.h:30,
                 from main.cc:21:
/usr/include/glib-2.0/gobject/gtype.h:685:3: note: declared here
  685 | } GTypeDebugFlags GLIB_DEPRECATED_TYPE_IN_2_36;
      |   ^~~~~~~~~~~~~~~
In file included from /usr/include/gtk-2.0/gtk/gtktoolitem.h:31,
                 from /usr/include/gtk-2.0/gtk/gtktoolbutton.h:30,
                 from /usr/include/gtk-2.0/gtk/gtkmenutoolbutton.h:30,
                 from /usr/include/gtk-2.0/gtk/gtk.h:126,
                 from /usr/include/gtkmm-2.4/gtkmm/box.h:44,
                 from /usr/include/gtkmm-2.4/gtkmm.h:91,
                 from me-tv.h:30,
                 from main.cc:21:
/usr/include/gtk-2.0/gtk/gtktooltips.h:73:12: warning: 'GTimeVal' is deprecated: Use 'GDateTime' instead [-Wdeprecated-declarations]
   73 |   GTimeVal last_popdown;
      |            ^~~~~~~~~~~~
In file included from /usr/include/glib-2.0/glib/galloca.h:32,
                 from /usr/include/glib-2.0/glib.h:30,
                 from /usr/include/glibmm-2.4/glibmm/thread.h:39,
                 from /usr/include/glibmm-2.4/glibmm.h:88,
                 from /usr/include/gtkmm-2.4/gtkmm.h:87,
                 from me-tv.h:30,
                 from main.cc:21:
/usr/include/glib-2.0/glib/gtypes.h:549:26: note: declared here
  549 | typedef struct _GTimeVal GTimeVal GLIB_DEPRECATED_TYPE_IN_2_62_FOR(GDateTime);
      |                          ^~~~~~~~
g++ -DHAVE_CONFIG_H -I. -I..  -I.. -I.. -pthread -I/usr/include/gtkmm-2.4 -I/usr/lib/arm-linux-gnueabihf/gtkmm-2.4/include -I/usr/include/atkmm-1.6 -I/usr/include/gtk-unix-print-2.0 -I/usr/include/gtk-2.0 -I/usr/include/gdkmm-2.4 -I/usr/lib/arm-linux-gnueabihf/gdkmm-2.4/include -I/usr/include/pangomm-1.4 -I/usr/lib/arm-linux-gnueabihf/pangomm-1.4/include -I/usr/include/cairomm-1.0 -I/usr/lib/arm-linux-gnueabihf/cairomm-1.0/include -I/usr/include/giomm-2.4 -I/usr/lib/arm-linux-gnueabihf/giomm-2.4/include -I/usr/include/gconfmm-2.6 -I/usr/lib/arm-linux-gnueabihf/gconfmm-2.6/include -I/usr/include/glibmm-2.4 -I/usr/lib/arm-linux-gnueabihf/glibmm-2.4/include -I/usr/include/sigc++-2.0 -I/usr/lib/arm-linux-gnueabihf/sigc++-2.0/include -I/usr/include/gconf/2 -I/usr/include/unique-1.0 -I/usr/include/gtk-2.0 -I/usr/lib/arm-linux-gnueabihf/gtk-2.0/include -I/usr/include/pango-1.0 -I/usr/include/atk-1.0 -I/usr/include/cairo -I/usr/include/pixman-1 -I/usr/include/gdk-pixbuf-2.0 -I/usr/include/libmount -I/usr/include/blkid -I/usr/include/pango-1.0 -I/usr/include/harfbuzz -I/usr/include/pango-1.0 -I/usr/include/fribidi -I/usr/include/uuid -I/usr/include/freetype2 -I/usr/include/libpng16 -I/usr/include/dbus-1.0 -I/usr/lib/arm-linux-gnueabihf/dbus-1.0/include -I/usr/include/glib-2.0 -I/usr/lib/arm-linux-gnueabihf/glib-2.0/include    -DPACKAGE_DATA_DIR=\""/usr/share"\" -DPACKAGE_SRC_DIR=\""."\"    -g -O2 -c -o channel_stream.o channel_stream.cc
In file included from /usr/include/gdkmm-2.4/gdkmm.h:34,
                 from /usr/include/gtkmm-2.4/gtkmm.h:89,
                 from me-tv.h:30,
                 from dvb_demuxer.h:29,
                 from channel_stream.h:25,
                 from channel_stream.cc:21:
/usr/include/gdkmm-2.4/gdkmm/pixbufanimation.h:124:72: warning: 'GTimeVal' is deprecated: Use 'GDateTime' instead [-Wdeprecated-declarations]
  124 |   Glib::RefPtr<PixbufAnimationIter> get_iter(const GTimeVal* start_time);
      |                                                                        ^
In file included from /usr/include/glib-2.0/glib/galloca.h:32,
                 from /usr/include/glib-2.0/glib.h:30,
                 from /usr/include/glibmm-2.4/glibmm/thread.h:39,
                 from /usr/include/glibmm-2.4/glibmm.h:88,
                 from mpeg_stream.h:35,
                 from channel_stream.h:24,
                 from channel_stream.cc:21:
/usr/include/glib-2.0/glib/gtypes.h:549:26: note: declared here
  549 | typedef struct _GTimeVal GTimeVal GLIB_DEPRECATED_TYPE_IN_2_62_FOR(GDateTime);
      |                          ^~~~~~~~
In file included from /usr/include/gtk-2.0/gtk/gtkobject.h:37,
                 from /usr/include/gtk-2.0/gtk/gtkwidget.h:36,
                 from /usr/include/gtk-2.0/gtk/gtkcontainer.h:35,
                 from /usr/include/gtk-2.0/gtk/gtkbin.h:35,
                 from /usr/include/gtk-2.0/gtk/gtkwindow.h:36,
                 from /usr/include/gtk-2.0/gtk/gtkdialog.h:35,
                 from /usr/include/gtk-2.0/gtk/gtkaboutdialog.h:32,
                 from /usr/include/gtk-2.0/gtk/gtk.h:33,
                 from /usr/include/gtkmm-2.4/gtkmm/box.h:44,
                 from /usr/include/gtkmm-2.4/gtkmm.h:91,
                 from me-tv.h:30,
                 from dvb_demuxer.h:29,
                 from channel_stream.h:25,
                 from channel_stream.cc:21:
/usr/include/gtk-2.0/gtk/gtktypeutils.h:236:64: warning: 'GTypeDebugFlags' is deprecated [-Wdeprecated-declarations]
  236 | void            gtk_type_init   (GTypeDebugFlags    debug_flags);
      |                                                                ^
In file included from /usr/include/glib-2.0/gobject/gobject.h:24,
                 from /usr/include/glib-2.0/gobject/gbinding.h:29,
                 from /usr/include/glib-2.0/glib-object.h:23,
                 from /usr/include/glibmm-2.4/glibmm/value.h:24,
                 from /usr/include/glibmm-2.4/glibmm/error.h:22,
                 from /usr/include/glibmm-2.4/glibmm/thread.h:48,
                 from /usr/include/glibmm-2.4/glibmm.h:88,
                 from mpeg_stream.h:35,
                 from channel_stream.h:24,
                 from channel_stream.cc:21:
/usr/include/glib-2.0/gobject/gtype.h:685:3: note: declared here
  685 | } GTypeDebugFlags GLIB_DEPRECATED_TYPE_IN_2_36;
      |   ^~~~~~~~~~~~~~~
In file included from /usr/include/gtk-2.0/gtk/gtktoolitem.h:31,
                 from /usr/include/gtk-2.0/gtk/gtktoolbutton.h:30,
                 from /usr/include/gtk-2.0/gtk/gtkmenutoolbutton.h:30,
                 from /usr/include/gtk-2.0/gtk/gtk.h:126,
                 from /usr/include/gtkmm-2.4/gtkmm/box.h:44,
                 from /usr/include/gtkmm-2.4/gtkmm.h:91,
                 from me-tv.h:30,
                 from dvb_demuxer.h:29,
                 from channel_stream.h:25,
                 from channel_stream.cc:21:
/usr/include/gtk-2.0/gtk/gtktooltips.h:73:12: warning: 'GTimeVal' is deprecated: Use 'GDateTime' instead [-Wdeprecated-declarations]
   73 |   GTimeVal last_popdown;
      |            ^~~~~~~~~~~~
In file included from /usr/include/glib-2.0/glib/galloca.h:32,
                 from /usr/include/glib-2.0/glib.h:30,
                 from /usr/include/glibmm-2.4/glibmm/thread.h:39,
                 from /usr/include/glibmm-2.4/glibmm.h:88,
                 from mpeg_stream.h:35,
                 from channel_stream.h:24,
                 from channel_stream.cc:21:
/usr/include/glib-2.0/glib/gtypes.h:549:26: note: declared here
  549 | typedef struct _GTimeVal GTimeVal GLIB_DEPRECATED_TYPE_IN_2_62_FOR(GDateTime);
      |                          ^~~~~~~~
channel_stream.cc: In constructor 'ChannelStream::ChannelStream(ChannelStreamType, Channel&, const Glib::ustring&, const Glib::ustring&)':
channel_stream.cc:35:38: warning: 'void g_static_rec_mutex_init(GStaticRecMutex*)' is deprecated: Use 'g_rec_mutex_init' instead [-Wdeprecated-declarations]
   35 |  g_static_rec_mutex_init(mutex.gobj());
      |                                      ^
In file included from /usr/include/glib-2.0/glib.h:110,
                 from /usr/include/glibmm-2.4/glibmm/thread.h:39,
                 from /usr/include/glibmm-2.4/glibmm.h:88,
                 from mpeg_stream.h:35,
                 from channel_stream.h:24,
                 from channel_stream.cc:21:
/usr/include/glib-2.0/glib/deprecated/gthread.h:172:10: note: declared here
  172 | void     g_static_rec_mutex_init        (GStaticRecMutex *mutex);
      |          ^~~~~~~~~~~~~~~~~~~~~~~
channel_stream.cc:35:38: warning: 'void g_static_rec_mutex_init(GStaticRecMutex*)' is deprecated: Use 'g_rec_mutex_init' instead [-Wdeprecated-declarations]
   35 |  g_static_rec_mutex_init(mutex.gobj());
      |                                      ^
In file included from /usr/include/glib-2.0/glib.h:110,
                 from /usr/include/glibmm-2.4/glibmm/thread.h:39,
                 from /usr/include/glibmm-2.4/glibmm.h:88,
                 from mpeg_stream.h:35,
                 from channel_stream.h:24,
                 from channel_stream.cc:21:
/usr/include/glib-2.0/glib/deprecated/gthread.h:172:10: note: declared here
  172 | void     g_static_rec_mutex_init        (GStaticRecMutex *mutex);
      |          ^~~~~~~~~~~~~~~~~~~~~~~
g++ -DHAVE_CONFIG_H -I. -I..  -I.. -I.. -pthread -I/usr/include/gtkmm-2.4 -I/usr/lib/arm-linux-gnueabihf/gtkmm-2.4/include -I/usr/include/atkmm-1.6 -I/usr/include/gtk-unix-print-2.0 -I/usr/include/gtk-2.0 -I/usr/include/gdkmm-2.4 -I/usr/lib/arm-linux-gnueabihf/gdkmm-2.4/include -I/usr/include/pangomm-1.4 -I/usr/lib/arm-linux-gnueabihf/pangomm-1.4/include -I/usr/include/cairomm-1.0 -I/usr/lib/arm-linux-gnueabihf/cairomm-1.0/include -I/usr/include/giomm-2.4 -I/usr/lib/arm-linux-gnueabihf/giomm-2.4/include -I/usr/include/gconfmm-2.6 -I/usr/lib/arm-linux-gnueabihf/gconfmm-2.6/include -I/usr/include/glibmm-2.4 -I/usr/lib/arm-linux-gnueabihf/glibmm-2.4/include -I/usr/include/sigc++-2.0 -I/usr/lib/arm-linux-gnueabihf/sigc++-2.0/include -I/usr/include/gconf/2 -I/usr/include/unique-1.0 -I/usr/include/gtk-2.0 -I/usr/lib/arm-linux-gnueabihf/gtk-2.0/include -I/usr/include/pango-1.0 -I/usr/include/atk-1.0 -I/usr/include/cairo -I/usr/include/pixman-1 -I/usr/include/gdk-pixbuf-2.0 -I/usr/include/libmount -I/usr/include/blkid -I/usr/include/pango-1.0 -I/usr/include/harfbuzz -I/usr/include/pango-1.0 -I/usr/include/fribidi -I/usr/include/uuid -I/usr/include/freetype2 -I/usr/include/libpng16 -I/usr/include/dbus-1.0 -I/usr/lib/arm-linux-gnueabihf/dbus-1.0/include -I/usr/include/glib-2.0 -I/usr/lib/arm-linux-gnueabihf/glib-2.0/include    -DPACKAGE_DATA_DIR=\""/usr/share"\" -DPACKAGE_SRC_DIR=\""."\"    -g -O2 -c -o frontend_thread.o frontend_thread.cc
In file included from /usr/include/gdkmm-2.4/gdkmm.h:34,
                 from /usr/include/gtkmm-2.4/gtkmm.h:89,
                 from me-tv.h:30,
                 from exception.h:24,
                 from thread.h:25,
                 from frontend_thread.h:24,
                 from frontend_thread.cc:21:
/usr/include/gdkmm-2.4/gdkmm/pixbufanimation.h:124:72: warning: 'GTimeVal' is deprecated: Use 'GDateTime' instead [-Wdeprecated-declarations]
  124 |   Glib::RefPtr<PixbufAnimationIter> get_iter(const GTimeVal* start_time);
      |                                                                        ^
In file included from /usr/include/glib-2.0/glib/galloca.h:32,
                 from /usr/include/glib-2.0/glib.h:30,
                 from /usr/include/glibmm-2.4/glibmm/thread.h:39,
                 from /usr/include/glibmm-2.4/glibmm.h:88,
                 from thread.h:24,
                 from frontend_thread.h:24,
                 from frontend_thread.cc:21:
/usr/include/glib-2.0/glib/gtypes.h:549:26: note: declared here
  549 | typedef struct _GTimeVal GTimeVal GLIB_DEPRECATED_TYPE_IN_2_62_FOR(GDateTime);
      |                          ^~~~~~~~
In file included from /usr/include/gtk-2.0/gtk/gtkobject.h:37,
                 from /usr/include/gtk-2.0/gtk/gtkwidget.h:36,
                 from /usr/include/gtk-2.0/gtk/gtkcontainer.h:35,
                 from /usr/include/gtk-2.0/gtk/gtkbin.h:35,
                 from /usr/include/gtk-2.0/gtk/gtkwindow.h:36,
                 from /usr/include/gtk-2.0/gtk/gtkdialog.h:35,
                 from /usr/include/gtk-2.0/gtk/gtkaboutdialog.h:32,
                 from /usr/include/gtk-2.0/gtk/gtk.h:33,
                 from /usr/include/gtkmm-2.4/gtkmm/box.h:44,
                 from /usr/include/gtkmm-2.4/gtkmm.h:91,
                 from me-tv.h:30,
                 from exception.h:24,
                 from thread.h:25,
                 from frontend_thread.h:24,
                 from frontend_thread.cc:21:
/usr/include/gtk-2.0/gtk/gtktypeutils.h:236:64: warning: 'GTypeDebugFlags' is deprecated [-Wdeprecated-declarations]
  236 | void            gtk_type_init   (GTypeDebugFlags    debug_flags);
      |                                                                ^
In file included from /usr/include/glib-2.0/gobject/gobject.h:24,
                 from /usr/include/glib-2.0/gobject/gbinding.h:29,
                 from /usr/include/glib-2.0/glib-object.h:23,
                 from /usr/include/glibmm-2.4/glibmm/value.h:24,
                 from /usr/include/glibmm-2.4/glibmm/error.h:22,
                 from /usr/include/glibmm-2.4/glibmm/thread.h:48,
                 from /usr/include/glibmm-2.4/glibmm.h:88,
                 from thread.h:24,
                 from frontend_thread.h:24,
                 from frontend_thread.cc:21:
/usr/include/glib-2.0/gobject/gtype.h:685:3: note: declared here
  685 | } GTypeDebugFlags GLIB_DEPRECATED_TYPE_IN_2_36;
      |   ^~~~~~~~~~~~~~~
In file included from /usr/include/gtk-2.0/gtk/gtktoolitem.h:31,
                 from /usr/include/gtk-2.0/gtk/gtktoolbutton.h:30,
                 from /usr/include/gtk-2.0/gtk/gtkmenutoolbutton.h:30,
                 from /usr/include/gtk-2.0/gtk/gtk.h:126,
                 from /usr/include/gtkmm-2.4/gtkmm/box.h:44,
                 from /usr/include/gtkmm-2.4/gtkmm.h:91,
                 from me-tv.h:30,
                 from exception.h:24,
                 from thread.h:25,
                 from frontend_thread.h:24,
                 from frontend_thread.cc:21:
/usr/include/gtk-2.0/gtk/gtktooltips.h:73:12: warning: 'GTimeVal' is deprecated: Use 'GDateTime' instead [-Wdeprecated-declarations]
   73 |   GTimeVal last_popdown;
      |            ^~~~~~~~~~~~
In file included from /usr/include/glib-2.0/glib/galloca.h:32,
                 from /usr/include/glib-2.0/glib.h:30,
                 from /usr/include/glibmm-2.4/glibmm/thread.h:39,
                 from /usr/include/glibmm-2.4/glibmm.h:88,
                 from thread.h:24,
                 from frontend_thread.h:24,
                 from frontend_thread.cc:21:
/usr/include/glib-2.0/glib/gtypes.h:549:26: note: declared here
  549 | typedef struct _GTimeVal GTimeVal GLIB_DEPRECATED_TYPE_IN_2_62_FOR(GDateTime);
      |                          ^~~~~~~~
g++ -DHAVE_CONFIG_H -I. -I..  -I.. -I.. -pthread -I/usr/include/gtkmm-2.4 -I/usr/lib/arm-linux-gnueabihf/gtkmm-2.4/include -I/usr/include/atkmm-1.6 -I/usr/include/gtk-unix-print-2.0 -I/usr/include/gtk-2.0 -I/usr/include/gdkmm-2.4 -I/usr/lib/arm-linux-gnueabihf/gdkmm-2.4/include -I/usr/include/pangomm-1.4 -I/usr/lib/arm-linux-gnueabihf/pangomm-1.4/include -I/usr/include/cairomm-1.0 -I/usr/lib/arm-linux-gnueabihf/cairomm-1.0/include -I/usr/include/giomm-2.4 -I/usr/lib/arm-linux-gnueabihf/giomm-2.4/include -I/usr/include/gconfmm-2.6 -I/usr/lib/arm-linux-gnueabihf/gconfmm-2.6/include -I/usr/include/glibmm-2.4 -I/usr/lib/arm-linux-gnueabihf/glibmm-2.4/include -I/usr/include/sigc++-2.0 -I/usr/lib/arm-linux-gnueabihf/sigc++-2.0/include -I/usr/include/gconf/2 -I/usr/include/unique-1.0 -I/usr/include/gtk-2.0 -I/usr/lib/arm-linux-gnueabihf/gtk-2.0/include -I/usr/include/pango-1.0 -I/usr/include/atk-1.0 -I/usr/include/cairo -I/usr/include/pixman-1 -I/usr/include/gdk-pixbuf-2.0 -I/usr/include/libmount -I/usr/include/blkid -I/usr/include/pango-1.0 -I/usr/include/harfbuzz -I/usr/include/pango-1.0 -I/usr/include/fribidi -I/usr/include/uuid -I/usr/include/freetype2 -I/usr/include/libpng16 -I/usr/include/dbus-1.0 -I/usr/lib/arm-linux-gnueabihf/dbus-1.0/include -I/usr/include/glib-2.0 -I/usr/lib/arm-linux-gnueabihf/glib-2.0/include    -DPACKAGE_DATA_DIR=\""/usr/share"\" -DPACKAGE_SRC_DIR=\""."\"    -g -O2 -c -o mpeg_stream.o mpeg_stream.cc
In file included from /usr/include/gdkmm-2.4/gdkmm.h:34,
                 from /usr/include/gtkmm-2.4/gtkmm.h:89,
                 from me-tv.h:30,
                 from application.h:24,
                 from mpeg_stream.cc:23:
/usr/include/gdkmm-2.4/gdkmm/pixbufanimation.h:124:72: warning: 'GTimeVal' is deprecated: Use 'GDateTime' instead [-Wdeprecated-declarations]
  124 |   Glib::RefPtr<PixbufAnimationIter> get_iter(const GTimeVal* start_time);
      |                                                                        ^
In file included from /usr/include/glib-2.0/glib/galloca.h:32,
                 from /usr/include/glib-2.0/glib.h:30,
                 from /usr/include/glibmm-2.4/glibmm/thread.h:39,
                 from /usr/include/glibmm-2.4/glibmm.h:88,
                 from mpeg_stream.cc:21:
/usr/include/glib-2.0/glib/gtypes.h:549:26: note: declared here
  549 | typedef struct _GTimeVal GTimeVal GLIB_DEPRECATED_TYPE_IN_2_62_FOR(GDateTime);
      |                          ^~~~~~~~
In file included from /usr/include/gtk-2.0/gtk/gtkobject.h:37,
                 from /usr/include/gtk-2.0/gtk/gtkwidget.h:36,
                 from /usr/include/gtk-2.0/gtk/gtkcontainer.h:35,
                 from /usr/include/gtk-2.0/gtk/gtkbin.h:35,
                 from /usr/include/gtk-2.0/gtk/gtkwindow.h:36,
                 from /usr/include/gtk-2.0/gtk/gtkdialog.h:35,
                 from /usr/include/gtk-2.0/gtk/gtkaboutdialog.h:32,
                 from /usr/include/gtk-2.0/gtk/gtk.h:33,
                 from /usr/include/gtkmm-2.4/gtkmm/box.h:44,
                 from /usr/include/gtkmm-2.4/gtkmm.h:91,
                 from me-tv.h:30,
                 from application.h:24,
                 from mpeg_stream.cc:23:
/usr/include/gtk-2.0/gtk/gtktypeutils.h:236:64: warning: 'GTypeDebugFlags' is deprecated [-Wdeprecated-declarations]
  236 | void            gtk_type_init   (GTypeDebugFlags    debug_flags);
      |                                                                ^
In file included from /usr/include/glib-2.0/gobject/gobject.h:24,
                 from /usr/include/glib-2.0/gobject/gbinding.h:29,
                 from /usr/include/glib-2.0/glib-object.h:23,
                 from /usr/include/glibmm-2.4/glibmm/value.h:24,
                 from /usr/include/glibmm-2.4/glibmm/error.h:22,
                 from /usr/include/glibmm-2.4/glibmm/thread.h:48,
                 from /usr/include/glibmm-2.4/glibmm.h:88,
                 from mpeg_stream.cc:21:
/usr/include/glib-2.0/gobject/gtype.h:685:3: note: declared here
  685 | } GTypeDebugFlags GLIB_DEPRECATED_TYPE_IN_2_36;
      |   ^~~~~~~~~~~~~~~
In file included from /usr/include/gtk-2.0/gtk/gtktoolitem.h:31,
                 from /usr/include/gtk-2.0/gtk/gtktoolbutton.h:30,
                 from /usr/include/gtk-2.0/gtk/gtkmenutoolbutton.h:30,
                 from /usr/include/gtk-2.0/gtk/gtk.h:126,
                 from /usr/include/gtkmm-2.4/gtkmm/box.h:44,
                 from /usr/include/gtkmm-2.4/gtkmm.h:91,
                 from me-tv.h:30,
                 from application.h:24,
                 from mpeg_stream.cc:23:
/usr/include/gtk-2.0/gtk/gtktooltips.h:73:12: warning: 'GTimeVal' is deprecated: Use 'GDateTime' instead [-Wdeprecated-declarations]
   73 |   GTimeVal last_popdown;
      |            ^~~~~~~~~~~~
In file included from /usr/include/glib-2.0/glib/galloca.h:32,
                 from /usr/include/glib-2.0/glib.h:30,
                 from /usr/include/glibmm-2.4/glibmm/thread.h:39,
                 from /usr/include/glibmm-2.4/glibmm.h:88,
                 from mpeg_stream.cc:21:
/usr/include/glib-2.0/glib/gtypes.h:549:26: note: declared here
  549 | typedef struct _GTimeVal GTimeVal GLIB_DEPRECATED_TYPE_IN_2_62_FOR(GDateTime);
      |                          ^~~~~~~~
g++ -DHAVE_CONFIG_H -I. -I..  -I.. -I.. -pthread -I/usr/include/gtkmm-2.4 -I/usr/lib/arm-linux-gnueabihf/gtkmm-2.4/include -I/usr/include/atkmm-1.6 -I/usr/include/gtk-unix-print-2.0 -I/usr/include/gtk-2.0 -I/usr/include/gdkmm-2.4 -I/usr/lib/arm-linux-gnueabihf/gdkmm-2.4/include -I/usr/include/pangomm-1.4 -I/usr/lib/arm-linux-gnueabihf/pangomm-1.4/include -I/usr/include/cairomm-1.0 -I/usr/lib/arm-linux-gnueabihf/cairomm-1.0/include -I/usr/include/giomm-2.4 -I/usr/lib/arm-linux-gnueabihf/giomm-2.4/include -I/usr/include/gconfmm-2.6 -I/usr/lib/arm-linux-gnueabihf/gconfmm-2.6/include -I/usr/include/glibmm-2.4 -I/usr/lib/arm-linux-gnueabihf/glibmm-2.4/include -I/usr/include/sigc++-2.0 -I/usr/lib/arm-linux-gnueabihf/sigc++-2.0/include -I/usr/include/gconf/2 -I/usr/include/unique-1.0 -I/usr/include/gtk-2.0 -I/usr/lib/arm-linux-gnueabihf/gtk-2.0/include -I/usr/include/pango-1.0 -I/usr/include/atk-1.0 -I/usr/include/cairo -I/usr/include/pixman-1 -I/usr/include/gdk-pixbuf-2.0 -I/usr/include/libmount -I/usr/include/blkid -I/usr/include/pango-1.0 -I/usr/include/harfbuzz -I/usr/include/pango-1.0 -I/usr/include/fribidi -I/usr/include/uuid -I/usr/include/freetype2 -I/usr/include/libpng16 -I/usr/include/dbus-1.0 -I/usr/lib/arm-linux-gnueabihf/dbus-1.0/include -I/usr/include/glib-2.0 -I/usr/lib/arm-linux-gnueabihf/glib-2.0/include    -DPACKAGE_DATA_DIR=\""/usr/share"\" -DPACKAGE_SRC_DIR=\""."\"    -g -O2 -c -o buffer.o buffer.cc
g++ -DHAVE_CONFIG_H -I. -I..  -I.. -I.. -pthread -I/usr/include/gtkmm-2.4 -I/usr/lib/arm-linux-gnueabihf/gtkmm-2.4/include -I/usr/include/atkmm-1.6 -I/usr/include/gtk-unix-print-2.0 -I/usr/include/gtk-2.0 -I/usr/include/gdkmm-2.4 -I/usr/lib/arm-linux-gnueabihf/gdkmm-2.4/include -I/usr/include/pangomm-1.4 -I/usr/lib/arm-linux-gnueabihf/pangomm-1.4/include -I/usr/include/cairomm-1.0 -I/usr/lib/arm-linux-gnueabihf/cairomm-1.0/include -I/usr/include/giomm-2.4 -I/usr/lib/arm-linux-gnueabihf/giomm-2.4/include -I/usr/include/gconfmm-2.6 -I/usr/lib/arm-linux-gnueabihf/gconfmm-2.6/include -I/usr/include/glibmm-2.4 -I/usr/lib/arm-linux-gnueabihf/glibmm-2.4/include -I/usr/include/sigc++-2.0 -I/usr/lib/arm-linux-gnueabihf/sigc++-2.0/include -I/usr/include/gconf/2 -I/usr/include/unique-1.0 -I/usr/include/gtk-2.0 -I/usr/lib/arm-linux-gnueabihf/gtk-2.0/include -I/usr/include/pango-1.0 -I/usr/include/atk-1.0 -I/usr/include/cairo -I/usr/include/pixman-1 -I/usr/include/gdk-pixbuf-2.0 -I/usr/include/libmount -I/usr/include/blkid -I/usr/include/pango-1.0 -I/usr/include/harfbuzz -I/usr/include/pango-1.0 -I/usr/include/fribidi -I/usr/include/uuid -I/usr/include/freetype2 -I/usr/include/libpng16 -I/usr/include/dbus-1.0 -I/usr/lib/arm-linux-gnueabihf/dbus-1.0/include -I/usr/include/glib-2.0 -I/usr/lib/arm-linux-gnueabihf/glib-2.0/include    -DPACKAGE_DATA_DIR=\""/usr/share"\" -DPACKAGE_SRC_DIR=\""."\"    -g -O2 -c -o main_window.o main_window.cc
In file included from /usr/include/gdkmm-2.4/gdkmm.h:34,
                 from /usr/include/gtkmm-2.4/gtkmm.h:89,
                 from me-tv.h:30,
                 from main_window.cc:21:
/usr/include/gdkmm-2.4/gdkmm/pixbufanimation.h:124:72: warning: 'GTimeVal' is deprecated: Use 'GDateTime' instead [-Wdeprecated-declarations]
  124 |   Glib::RefPtr<PixbufAnimationIter> get_iter(const GTimeVal* start_time);
      |                                                                        ^
In file included from /usr/include/glib-2.0/glib/galloca.h:32,
                 from /usr/include/glib-2.0/glib.h:30,
                 from /usr/include/glibmm-2.4/glibmm/thread.h:39,
                 from /usr/include/glibmm-2.4/glibmm.h:88,
                 from /usr/include/gtkmm-2.4/gtkmm.h:87,
                 from me-tv.h:30,
                 from main_window.cc:21:
/usr/include/glib-2.0/glib/gtypes.h:549:26: note: declared here
  549 | typedef struct _GTimeVal GTimeVal GLIB_DEPRECATED_TYPE_IN_2_62_FOR(GDateTime);
      |                          ^~~~~~~~
In file included from /usr/include/gtk-2.0/gtk/gtkobject.h:37,
                 from /usr/include/gtk-2.0/gtk/gtkwidget.h:36,
                 from /usr/include/gtk-2.0/gtk/gtkcontainer.h:35,
                 from /usr/include/gtk-2.0/gtk/gtkbin.h:35,
                 from /usr/include/gtk-2.0/gtk/gtkwindow.h:36,
                 from /usr/include/gtk-2.0/gtk/gtkdialog.h:35,
                 from /usr/include/gtk-2.0/gtk/gtkaboutdialog.h:32,
                 from /usr/include/gtk-2.0/gtk/gtk.h:33,
                 from /usr/include/gtkmm-2.4/gtkmm/box.h:44,
                 from /usr/include/gtkmm-2.4/gtkmm.h:91,
                 from me-tv.h:30,
                 from main_window.cc:21:
/usr/include/gtk-2.0/gtk/gtktypeutils.h:236:64: warning: 'GTypeDebugFlags' is deprecated [-Wdeprecated-declarations]
  236 | void            gtk_type_init   (GTypeDebugFlags    debug_flags);
      |                                                                ^
In file included from /usr/include/glib-2.0/gobject/gobject.h:24,
                 from /usr/include/glib-2.0/gobject/gbinding.h:29,
                 from /usr/include/glib-2.0/glib-object.h:23,
                 from /usr/include/glibmm-2.4/glibmm/value.h:24,
                 from /usr/include/glibmm-2.4/glibmm/error.h:22,
                 from /usr/include/glibmm-2.4/glibmm/thread.h:48,
                 from /usr/include/glibmm-2.4/glibmm.h:88,
                 from /usr/include/gtkmm-2.4/gtkmm.h:87,
                 from me-tv.h:30,
                 from main_window.cc:21:
/usr/include/glib-2.0/gobject/gtype.h:685:3: note: declared here
  685 | } GTypeDebugFlags GLIB_DEPRECATED_TYPE_IN_2_36;
      |   ^~~~~~~~~~~~~~~
In file included from /usr/include/gtk-2.0/gtk/gtktoolitem.h:31,
                 from /usr/include/gtk-2.0/gtk/gtktoolbutton.h:30,
                 from /usr/include/gtk-2.0/gtk/gtkmenutoolbutton.h:30,
                 from /usr/include/gtk-2.0/gtk/gtk.h:126,
                 from /usr/include/gtkmm-2.4/gtkmm/box.h:44,
                 from /usr/include/gtkmm-2.4/gtkmm.h:91,
                 from me-tv.h:30,
                 from main_window.cc:21:
/usr/include/gtk-2.0/gtk/gtktooltips.h:73:12: warning: 'GTimeVal' is deprecated: Use 'GDateTime' instead [-Wdeprecated-declarations]
   73 |   GTimeVal last_popdown;
      |            ^~~~~~~~~~~~
In file included from /usr/include/glib-2.0/glib/galloca.h:32,
                 from /usr/include/glib-2.0/glib.h:30,
                 from /usr/include/glibmm-2.4/glibmm/thread.h:39,
                 from /usr/include/glibmm-2.4/glibmm.h:88,
                 from /usr/include/gtkmm-2.4/gtkmm.h:87,
                 from me-tv.h:30,
                 from main_window.cc:21:
/usr/include/glib-2.0/glib/gtypes.h:549:26: note: declared here
  549 | typedef struct _GTimeVal GTimeVal GLIB_DEPRECATED_TYPE_IN_2_62_FOR(GDateTime);
      |                          ^~~~~~~~
main_window.cc: In member function 'gboolean MainWindow::is_fullscreen()':
main_window.cc:302:22: error: no match for 'operator!=' (operand types are 'Glib::RefPtr<Gdk::Window>' and 'int')
  302 |  return get_window() != NULL && get_window()->get_state() & Gdk::WINDOW_STATE_FULLSCREEN;
      |                      ^
main_window.cc:302:22: note: candidate: 'operator!=(int, int)' <built-in>
main_window.cc:302:22: note:   no known conversion for argument 1 from 'Glib::RefPtr<Gdk::Window>' to 'int'
In file included from /usr/include/glibmm-2.4/glibmm/value.h:21,
                 from /usr/include/glibmm-2.4/glibmm/error.h:22,
                 from /usr/include/glibmm-2.4/glibmm/thread.h:48,
                 from /usr/include/glibmm-2.4/glibmm.h:88,
                 from /usr/include/gtkmm-2.4/gtkmm.h:87,
                 from me-tv.h:30,
                 from main_window.cc:21:
/usr/include/glibmm-2.4/glibmm/refptr.h:399:1: note: candidate: 'bool Glib::RefPtr<T_CppObject>::operator!=(const Glib::RefPtr<T_CppObject>&) const [with T_CppObject = Gdk::Window]'
  399 | RefPtr<T_CppObject>::operator!=(const RefPtr& src) const noexcept
      | ^~~~~~~~~~~~~~~~~~~
/usr/include/glibmm-2.4/glibmm/refptr.h:399:47: note:   no known conversion for argument 1 from 'int' to 'const Glib::RefPtr<Gdk::Window>&'
  399 | RefPtr<T_CppObject>::operator!=(const RefPtr& src) const noexcept
      |                                 ~~~~~~~~~~~~~~^~~
In file included from /usr/include/glibmm-2.4/glibmm/exception.h:22,
                 from /usr/include/glibmm-2.4/glibmm/error.h:21,
                 from /usr/include/glibmm-2.4/glibmm/thread.h:48,
                 from /usr/include/glibmm-2.4/glibmm.h:88,
                 from /usr/include/gtkmm-2.4/gtkmm.h:87,
                 from me-tv.h:30,
                 from main_window.cc:21:
/usr/include/glibmm-2.4/glibmm/ustring.h:1121:1: note: candidate: 'bool Glib::operator!=(const const_iterator&, const const_iterator&)'
 1121 | operator!=(const Glib::ustring::const_iterator& lhs, const Glib::ustring::const_iterator& rhs)
      | ^~~~~~~~
/usr/include/glibmm-2.4/glibmm/ustring.h:1121:49: note:   no known conversion for argument 1 from 'Glib::RefPtr<Gdk::Window>' to 'const const_iterator&' {aka 'const Glib::ustring_Iterator<__gnu_cxx::__normal_iterator<const char*, std::__cxx11::basic_string<char> > >&'}
 1121 | operator!=(const Glib::ustring::const_iterator& lhs, const Glib::ustring::const_iterator& rhs)
      |            ~~~~~~~~~~~~~~~~~~~~~~~~~~~~~~~~~~~~~^~~
/usr/include/glibmm-2.4/glibmm/ustring.h:1709:1: note: candidate: 'bool Glib::operator!=(const Glib::ustring&, const Glib::ustring&)'
 1709 | operator!=(const ustring& lhs, const ustring& rhs)
      | ^~~~~~~~
/usr/include/glibmm-2.4/glibmm/ustring.h:1709:27: note:   no known conversion for argument 1 from 'Glib::RefPtr<Gdk::Window>' to 'const Glib::ustring&'
 1709 | operator!=(const ustring& lhs, const ustring& rhs)
      |            ~~~~~~~~~~~~~~~^~~
/usr/include/glibmm-2.4/glibmm/ustring.h:1716:1: note: candidate: 'bool Glib::operator!=(const Glib::ustring&, const char*)'
 1716 | operator!=(const ustring& lhs, const char* rhs)
      | ^~~~~~~~
/usr/include/glibmm-2.4/glibmm/ustring.h:1716:27: note:   no known conversion for argument 1 from 'Glib::RefPtr<Gdk::Window>' to 'const Glib::ustring&'
 1716 | operator!=(const ustring& lhs, const char* rhs)
      |            ~~~~~~~~~~~~~~~^~~
/usr/include/glibmm-2.4/glibmm/ustring.h:1723:1: note: candidate: 'bool Glib::operator!=(const char*, const Glib::ustring&)'
 1723 | operator!=(const char* lhs, const ustring& rhs)
      | ^~~~~~~~
/usr/include/glibmm-2.4/glibmm/ustring.h:1723:24: note:   no known conversion for argument 1 from 'Glib::RefPtr<Gdk::Window>' to 'const char*'
 1723 | operator!=(const char* lhs, const ustring& rhs)
      |            ~~~~~~~~~~~~^~~
In file included from /usr/include/glibmm-2.4/glibmm/thread.h:49,
                 from /usr/include/glibmm-2.4/glibmm.h:88,
                 from /usr/include/gtkmm-2.4/gtkmm.h:87,
                 from me-tv.h:30,
                 from main_window.cc:21:
/usr/include/glibmm-2.4/glibmm/timeval.h:216:1: note: candidate: 'bool Glib::operator!=(const Glib::TimeVal&, const Glib::TimeVal&)'
  216 | operator!=(const TimeVal& lhs, const TimeVal& rhs)
      | ^~~~~~~~
/usr/include/glibmm-2.4/glibmm/timeval.h:216:27: note:   no known conversion for argument 1 from 'Glib::RefPtr<Gdk::Window>' to 'const Glib::TimeVal&'
  216 | operator!=(const TimeVal& lhs, const TimeVal& rhs)
      |            ~~~~~~~~~~~~~~~^~~
In file included from /usr/include/glibmm-2.4/glibmm/objectbase.h:26,
                 from /usr/include/glibmm-2.4/glibmm/wrap.h:22,
                 from /usr/include/glibmm-2.4/glibmm/containerhandle_shared.h:24,
                 from /usr/include/glibmm-2.4/glibmm/arrayhandle.h:21,
                 from /usr/include/glibmm-2.4/glibmm.h:92,
                 from /usr/include/gtkmm-2.4/gtkmm.h:87,
                 from me-tv.h:30,
                 from main_window.cc:21:
/usr/include/glibmm-2.4/glibmm/quark.h:76:1: note: candidate: 'bool Glib::operator!=(const Glib::QueryQuark&, const Glib::QueryQuark&)'
   76 | operator!=(const QueryQuark& a, const QueryQuark& b)
      | ^~~~~~~~
/usr/include/glibmm-2.4/glibmm/quark.h:76:30: note:   no known conversion for argument 1 from 'Glib::RefPtr<Gdk::Window>' to 'const Glib::QueryQuark&'
   76 | operator!=(const QueryQuark& a, const QueryQuark& b)
      |            ~~~~~~~~~~~~~~~~~~^
In file included from /usr/include/glibmm-2.4/glibmm.h:105,
                 from /usr/include/gtkmm-2.4/gtkmm.h:87,
                 from me-tv.h:30,
                 from main_window.cc:21:
/usr/include/glibmm-2.4/glibmm/date.h:599:13: note: candidate: 'bool Glib::operator!=(const Glib::Date&, const Glib::Date&)'
  599 | inline bool operator!=(const Date& lhs, const Date& rhs)
      |             ^~~~~~~~
/usr/include/glibmm-2.4/glibmm/date.h:599:36: note:   no known conversion for argument 1 from 'Glib::RefPtr<Gdk::Window>' to 'const Glib::Date&'
  599 | inline bool operator!=(const Date& lhs, const Date& rhs)
      |                        ~~~~~~~~~~~~^~~
In file included from /usr/include/gdkmm-2.4/gdkmm/region.h:67,
                 from /usr/include/gdkmm-2.4/gdkmm/screen.h:33,
                 from /usr/include/gdkmm-2.4/gdkmm.h:27,
                 from /usr/include/gtkmm-2.4/gtkmm.h:89,
                 from me-tv.h:30,
                 from main_window.cc:21:
/usr/include/gdkmm-2.4/gdkmm/types.h:338:13: note: candidate: 'bool Gdk::operator!=(const Gdk::Point&, const Gdk::Point&)'
  338 | inline bool operator!=(const Point& lhs, const Point& rhs)
      |             ^~~~~~~~
/usr/include/gdkmm-2.4/gdkmm/types.h:338:37: note:   no known conversion for argument 1 from 'Glib::RefPtr<Gdk::Window>' to 'const Gdk::Point&'
  338 | inline bool operator!=(const Point& lhs, const Point& rhs)
      |                        ~~~~~~~~~~~~~^~~
In file included from /usr/include/gdkmm-2.4/gdkmm/screen.h:33,
                 from /usr/include/gdkmm-2.4/gdkmm.h:27,
                 from /usr/include/gtkmm-2.4/gtkmm.h:89,
                 from me-tv.h:30,
                 from main_window.cc:21:
/usr/include/gdkmm-2.4/gdkmm/region.h:310:6: note: candidate: 'bool Gdk::operator!=(const Gdk::Region&, const Gdk::Region&)'
  310 | bool operator!=(const Region& lhs, const Region& rhs);
      |      ^~~~~~~~
/usr/include/gdkmm-2.4/gdkmm/region.h:310:31: note:   no known conversion for argument 1 from 'Glib::RefPtr<Gdk::Window>' to 'const Gdk::Region&'
  310 | bool operator!=(const Region& lhs, const Region& rhs);
      |                 ~~~~~~~~~~~~~~^~~
In file included from /usr/include/gdkmm-2.4/gdkmm/colormap.h:39,
                 from /usr/include/gdkmm-2.4/gdkmm/image.h:33,
                 from /usr/include/gdkmm-2.4/gdkmm/drawable.h:35,
                 from /usr/include/gdkmm-2.4/gdkmm/gc.h:33,
                 from /usr/include/gdkmm-2.4/gdkmm.h:30,
                 from /usr/include/gtkmm-2.4/gtkmm.h:89,
                 from me-tv.h:30,
                 from main_window.cc:21:
/usr/include/gdkmm-2.4/gdkmm/color.h:264:6: note: candidate: 'bool Gdk::operator!=(const Gdk::Color&, const Gdk::Color&)'
  264 | bool operator!=(const Color& lhs, const Color& rhs);
      |      ^~~~~~~~
/usr/include/gdkmm-2.4/gdkmm/color.h:264:30: note:   no known conversion for argument 1 from 'Glib::RefPtr<Gdk::Window>' to 'const Gdk::Color&'
  264 | bool operator!=(const Color& lhs, const Color& rhs);
      |                 ~~~~~~~~~~~~~^~~
make[3]: *** [Makefile:676: main_window.o] Error 1
make[3]: Leaving directory '/<<PKGBUILDDIR>>/src'
make[2]: *** [Makefile:584: all-recursive] Error 1
make[2]: Leaving directory '/<<PKGBUILDDIR>>'
make[1]: *** [Makefile:419: all] Error 2
make[1]: Leaving directory '/<<PKGBUILDDIR>>'
dh_auto_build: make -j1 returned exit code 2
make: *** [debian/rules:3: build-arch] Error 255
dpkg-buildpackage: error: debian/rules build-arch subprocess returned exit status 2
--------------------------------------------------------------------------------
Build finished at 2020-01-25T13:35:34Z

Finished
--------


+------------------------------------------------------------------------------+
| Cleanup                                                                      |
+------------------------------------------------------------------------------+

Purging /<<BUILDDIR>>
Not cleaning session: cloned chroot in use
E: Build failure (dpkg-buildpackage died)

+------------------------------------------------------------------------------+
| Summary                                                                      |
+------------------------------------------------------------------------------+

Build Architecture: armhf
Build Type: any
Build-Space: 7008
Build-Time: 124
Distribution: bullseye-staging
Fail-Stage: build
Host Architecture: armhf
Install-Time: 1327
Job: me-tv_1.3.7-1
Machine Architecture: armhf
Package: me-tv
Package-Time: 1498
Source-Version: 1.3.7-1
Space: 7008
Status: attempted
Version: 1.3.7-1+b2
--------------------------------------------------------------------------------
Finished at 2020-01-25T13:35:34Z
Build needed 00:24:58, 7008k disk space