Raspbian Package Auto-Building

Build log for cypari2 (2.1.2-1) on armhf

cypari22.1.2-1armhf → 2020-11-12 08:12:57

sbuild (Debian sbuild) 0.72.0 (25 Oct 2016) on mb-lxc-01

+==============================================================================+
| cypari2 2.1.2-1 (armhf)                      Thu, 12 Nov 2020 08:00:39 +0000 |
+==============================================================================+

Package: cypari2
Version: 2.1.2-1
Source Version: 2.1.2-1
Distribution: bullseye-staging
Machine Architecture: armhf
Host Architecture: armhf
Build Architecture: armhf

I: NOTICE: Log filtering will replace 'var/lib/schroot/mount/bullseye-staging-armhf-sbuild-6e2bb32d-9333-4d27-b6e2-15bfb7393e58' with '<<CHROOT>>'

+------------------------------------------------------------------------------+
| Update chroot                                                                |
+------------------------------------------------------------------------------+

Get:1 http://172.17.0.1/private bullseye-staging InRelease [11.3 kB]
Get:2 http://172.17.0.1/private bullseye-staging/main Sources [11.8 MB]
Get:3 http://172.17.0.1/private bullseye-staging/main armhf Packages [12.8 MB]
Fetched 24.7 MB in 9s (2781 kB/s)
Reading package lists...
W: No sandbox user '_apt' on the system, can not drop privileges

+------------------------------------------------------------------------------+
| Fetch source files                                                           |
+------------------------------------------------------------------------------+


Check APT
---------

Checking available source versions...

Download source files with APT
------------------------------

Reading package lists...
NOTICE: 'cypari2' packaging is maintained in the 'Git' version control system at:
https://salsa.debian.org/science-team/cypari2.git
Please use:
git clone https://salsa.debian.org/science-team/cypari2.git
to retrieve the latest (possibly unreleased) updates to the package.
Need to get 2186 kB of source archives.
Get:1 http://172.17.0.1/private bullseye-staging/main cypari2 2.1.2-1 (dsc) [2247 B]
Get:2 http://172.17.0.1/private bullseye-staging/main cypari2 2.1.2-1 (tar) [2179 kB]
Get:3 http://172.17.0.1/private bullseye-staging/main cypari2 2.1.2-1 (diff) [4716 B]
Fetched 2186 kB in 0s (4760 kB/s)
Download complete and in download only mode
I: NOTICE: Log filtering will replace 'build/cypari2-Xy3FGj/cypari2-2.1.2' with '<<PKGBUILDDIR>>'
I: NOTICE: Log filtering will replace 'build/cypari2-Xy3FGj' with '<<BUILDDIR>>'

+------------------------------------------------------------------------------+
| Install build-essential                                                      |
+------------------------------------------------------------------------------+


Setup apt archive
-----------------

Merged Build-Depends: build-essential, fakeroot
Filtered Build-Depends: build-essential, fakeroot
dpkg-deb: building package 'sbuild-build-depends-core-dummy' in '/<<BUILDDIR>>/resolver-efSJHn/apt_archive/sbuild-build-depends-core-dummy.deb'.
dpkg-scanpackages: warning: Packages in archive but missing from override file:
dpkg-scanpackages: warning:   sbuild-build-depends-core-dummy
dpkg-scanpackages: info: Wrote 1 entries to output Packages file.
gpg: keybox '/<<BUILDDIR>>/resolver-efSJHn/gpg/pubring.kbx' created
gpg: /<<BUILDDIR>>/resolver-efSJHn/gpg/trustdb.gpg: trustdb created
gpg: key 37145E60F90AF620: public key "Sbuild Signer (Sbuild Build Dependency Archive Key) <buildd-tools-devel@lists.alioth.debian.org>" imported
gpg: Total number processed: 1
gpg:               imported: 1
gpg: key 37145E60F90AF620: "Sbuild Signer (Sbuild Build Dependency Archive Key) <buildd-tools-devel@lists.alioth.debian.org>" not changed
gpg: key 37145E60F90AF620: secret key imported
gpg: Total number processed: 1
gpg:              unchanged: 1
gpg:       secret keys read: 1
gpg:   secret keys imported: 1
gpg: using "Sbuild Signer" as default secret key for signing
Ign:1 copy:/<<BUILDDIR>>/resolver-efSJHn/apt_archive ./ InRelease
Get:2 copy:/<<BUILDDIR>>/resolver-efSJHn/apt_archive ./ Release [957 B]
Get:3 copy:/<<BUILDDIR>>/resolver-efSJHn/apt_archive ./ Release.gpg [370 B]
Get:4 copy:/<<BUILDDIR>>/resolver-efSJHn/apt_archive ./ Sources [349 B]
Get:5 copy:/<<BUILDDIR>>/resolver-efSJHn/apt_archive ./ Packages [429 B]
Fetched 2105 B in 0s (9429 B/s)
Reading package lists...
W: No sandbox user '_apt' on the system, can not drop privileges
Reading package lists...

Install core build dependencies (apt-based resolver)
----------------------------------------------------

Installing build dependencies
Reading package lists...
Building dependency tree...
Reading state information...
The following packages were automatically installed and are no longer required:
  bsdextrautils libpam-cap netbase sensible-utils
Use 'apt autoremove' to remove them.
The following NEW packages will be installed:
  sbuild-build-depends-core-dummy
0 upgraded, 1 newly installed, 0 to remove and 60 not upgraded.
Need to get 856 B of archives.
After this operation, 0 B of additional disk space will be used.
Get:1 copy:/<<BUILDDIR>>/resolver-efSJHn/apt_archive ./ sbuild-build-depends-core-dummy 0.invalid.0 [856 B]
debconf: delaying package configuration, since apt-utils is not installed
Fetched 856 B in 0s (65.1 kB/s)
Selecting previously unselected package sbuild-build-depends-core-dummy.
(Reading database ... 12498 files and directories currently installed.)
Preparing to unpack .../sbuild-build-depends-core-dummy_0.invalid.0_armhf.deb ...
Unpacking sbuild-build-depends-core-dummy (0.invalid.0) ...
Setting up sbuild-build-depends-core-dummy (0.invalid.0) ...
W: No sandbox user '_apt' on the system, can not drop privileges

+------------------------------------------------------------------------------+
| Check architectures                                                          |
+------------------------------------------------------------------------------+

Arch check ok (armhf included in any all)

+------------------------------------------------------------------------------+
| Install package build dependencies                                           |
+------------------------------------------------------------------------------+


Setup apt archive
-----------------

Merged Build-Depends: debhelper (>= 11), dh-python (>= 3.20180313), cython3 (>= 0.26), libgmp-dev, libpari-dev (>= 2.9), pari-doc (>= 2.9), pari-gp (>= 2.9), libjs-mathjax, python3-all-dev, python3-cysignals-pari (>= 1.8.1), python3-setuptools, python3-sphinx
Filtered Build-Depends: debhelper (>= 11), dh-python (>= 3.20180313), cython3 (>= 0.26), libgmp-dev, libpari-dev (>= 2.9), pari-doc (>= 2.9), pari-gp (>= 2.9), libjs-mathjax, python3-all-dev, python3-cysignals-pari (>= 1.8.1), python3-setuptools, python3-sphinx
dpkg-deb: building package 'sbuild-build-depends-cypari2-dummy' in '/<<BUILDDIR>>/resolver-efSJHn/apt_archive/sbuild-build-depends-cypari2-dummy.deb'.
dpkg-scanpackages: warning: Packages in archive but missing from override file:
dpkg-scanpackages: warning:   sbuild-build-depends-core-dummy sbuild-build-depends-cypari2-dummy
dpkg-scanpackages: info: Wrote 2 entries to output Packages file.
gpg: using "Sbuild Signer" as default secret key for signing
Ign:1 copy:/<<BUILDDIR>>/resolver-efSJHn/apt_archive ./ InRelease
Get:2 copy:/<<BUILDDIR>>/resolver-efSJHn/apt_archive ./ Release [963 B]
Get:3 copy:/<<BUILDDIR>>/resolver-efSJHn/apt_archive ./ Release.gpg [370 B]
Get:4 copy:/<<BUILDDIR>>/resolver-efSJHn/apt_archive ./ Sources [590 B]
Get:5 copy:/<<BUILDDIR>>/resolver-efSJHn/apt_archive ./ Packages [672 B]
Fetched 2595 B in 0s (11.7 kB/s)
Reading package lists...
W: No sandbox user '_apt' on the system, can not drop privileges
Reading package lists...

Install cypari2 build dependencies (apt-based resolver)
-------------------------------------------------------

Installing build dependencies
Reading package lists...
Building dependency tree...
Reading state information...
The following packages were automatically installed and are no longer required:
  libpam-cap netbase
Use 'apt autoremove' to remove them.
The following additional packages will be installed:
  autoconf automake autopoint autotools-dev ca-certificates cython3 debhelper
  dh-autoreconf dh-python dh-strip-nondeterminism docutils-common dwz file
  fonts-mathjax gettext gettext-base groff-base intltool-debian
  libarchive-zip-perl libbsd0 libcroco3 libdebhelper-perl libelf1 libexpat1
  libexpat1-dev libfile-stripnondeterminism-perl libglib2.0-0 libgmp-dev
  libgmpxx4ldbl libgssapi-krb5-2 libicu67 libjs-jquery libjs-mathjax
  libjs-sphinxdoc libjs-underscore libk5crypto3 libkeyutils1 libkrb5-3
  libkrb5support0 libmagic-mgc libmagic1 libnsl2 libpari-dev libpari-gmp-tls6
  libpipeline1 libpython3-all-dev libpython3-dev libpython3-stdlib
  libpython3.8 libpython3.8-dev libpython3.8-minimal libpython3.8-stdlib
  libpython3.9 libpython3.9-dev libpython3.9-minimal libpython3.9-stdlib
  libsigsegv2 libssl1.1 libsub-override-perl libtirpc-common libtirpc3 libtool
  libuchardet0 libx11-6 libx11-data libxau6 libxcb1 libxdmcp6 libxml2 m4
  man-db mime-support node-jquery openssl pari-doc pari-gp po-debconf
  python-babel-localedata python3 python3-alabaster python3-all
  python3-all-dev python3-babel python3-certifi python3-chardet
  python3-cysignals-pari python3-dev python3-distutils python3-docutils
  python3-idna python3-imagesize python3-jinja2 python3-lib2to3
  python3-markupsafe python3-minimal python3-packaging python3-pkg-resources
  python3-pygments python3-pyparsing python3-requests python3-roman
  python3-setuptools python3-six python3-snowballstemmer python3-sphinx
  python3-tz python3-urllib3 python3.8 python3.8-dev python3.8-minimal
  python3.9 python3.9-dev python3.9-minimal sgml-base sphinx-common xml-core
  zlib1g-dev
Suggested packages:
  autoconf-archive gnu-standards autoconf-doc cython-doc dh-make gettext-doc
  libasprintf-dev libgettextpo-dev groff gmp-doc libgmp10-doc libmpfr-dev
  krb5-doc krb5-user fonts-mathjax-extras fonts-stix libjs-mathjax-doc
  libpari-gmp-tls6-dbgsym pari-gp2c libtool-doc gfortran | fortran95-compiler
  gcj-jdk m4-doc apparmor less www-browser pari-galpol libmail-box-perl
  python3-doc python3-tk python3-venv python-cysignals-doc docutils-doc
  fonts-linuxlibertine | ttf-linux-libertine texlive-lang-french
  texlive-latex-base texlive-latex-recommended python-jinja2-doc
  python-pygments-doc ttf-bitstream-vera python-pyparsing-doc
  python3-cryptography python3-openssl python3-socks python-requests-doc
  python-setuptools-doc python3-stemmer dvipng fonts-freefont-otf
  imagemagick-6.q16 latexmk python3-sphinx-rtd-theme sphinx-doc
  texlive-fonts-recommended texlive-latex-extra texlive-plain-generic
  python3.8-venv python3.8-doc binfmt-support python3.9-venv python3.9-doc
  sgml-base-doc
Recommended packages:
  curl | wget | lynx libarchive-cpio-perl libglib2.0-data shared-mime-info
  xdg-user-dirs javascript-common krb5-locales libltdl-dev texlive-base
  pari-galdata pari-elldata pari-seadata libmail-sendmail-perl cysignals-tools
  libpaper-utils python3-pil
The following NEW packages will be installed:
  autoconf automake autopoint autotools-dev ca-certificates cython3 debhelper
  dh-autoreconf dh-python dh-strip-nondeterminism docutils-common dwz file
  fonts-mathjax gettext gettext-base groff-base intltool-debian
  libarchive-zip-perl libbsd0 libcroco3 libdebhelper-perl libelf1 libexpat1
  libexpat1-dev libfile-stripnondeterminism-perl libglib2.0-0 libgmp-dev
  libgmpxx4ldbl libgssapi-krb5-2 libicu67 libjs-jquery libjs-mathjax
  libjs-sphinxdoc libjs-underscore libk5crypto3 libkeyutils1 libkrb5-3
  libkrb5support0 libmagic-mgc libmagic1 libnsl2 libpari-dev libpari-gmp-tls6
  libpipeline1 libpython3-all-dev libpython3-dev libpython3-stdlib
  libpython3.8 libpython3.8-dev libpython3.8-minimal libpython3.8-stdlib
  libpython3.9 libpython3.9-dev libpython3.9-minimal libpython3.9-stdlib
  libsigsegv2 libssl1.1 libsub-override-perl libtirpc-common libtirpc3 libtool
  libuchardet0 libx11-6 libx11-data libxau6 libxcb1 libxdmcp6 libxml2 m4
  man-db mime-support node-jquery openssl pari-doc pari-gp po-debconf
  python-babel-localedata python3 python3-alabaster python3-all
  python3-all-dev python3-babel python3-certifi python3-chardet
  python3-cysignals-pari python3-dev python3-distutils python3-docutils
  python3-idna python3-imagesize python3-jinja2 python3-lib2to3
  python3-markupsafe python3-minimal python3-packaging python3-pkg-resources
  python3-pygments python3-pyparsing python3-requests python3-roman
  python3-setuptools python3-six python3-snowballstemmer python3-sphinx
  python3-tz python3-urllib3 python3.8 python3.8-dev python3.8-minimal
  python3.9 python3.9-dev python3.9-minimal sbuild-build-depends-cypari2-dummy
  sgml-base sphinx-common xml-core zlib1g-dev
0 upgraded, 118 newly installed, 0 to remove and 60 not upgraded.
Need to get 78.2 MB of archives.
After this operation, 302 MB of additional disk space will be used.
Get:1 copy:/<<BUILDDIR>>/resolver-efSJHn/apt_archive ./ sbuild-build-depends-cypari2-dummy 0.invalid.0 [960 B]
Get:2 http://172.17.0.1/private bullseye-staging/main armhf libuchardet0 armhf 0.0.7-1 [65.0 kB]
Get:3 http://172.17.0.1/private bullseye-staging/main armhf groff-base armhf 1.22.4-5 [783 kB]
Get:4 http://172.17.0.1/private bullseye-staging/main armhf libpipeline1 armhf 1.5.3-1 [29.9 kB]
Get:5 http://172.17.0.1/private bullseye-staging/main armhf man-db armhf 2.9.3-2 [1269 kB]
Get:6 http://172.17.0.1/private bullseye-staging/main armhf libssl1.1 armhf 1.1.1h-1 [1271 kB]
Get:7 http://172.17.0.1/private bullseye-staging/main armhf libpython3.8-minimal armhf 3.8.6-1 [752 kB]
Get:8 http://172.17.0.1/private bullseye-staging/main armhf libexpat1 armhf 2.2.10-1 [73.3 kB]
Get:9 http://172.17.0.1/private bullseye-staging/main armhf python3.8-minimal armhf 3.8.6-1 [1552 kB]
Get:10 http://172.17.0.1/private bullseye-staging/main armhf python3-minimal armhf 3.8.6-1 [37.7 kB]
Get:11 http://172.17.0.1/private bullseye-staging/main armhf mime-support all 3.64 [37.8 kB]
Get:12 http://172.17.0.1/private bullseye-staging/main armhf libpython3.8-stdlib armhf 3.8.6-1 [1654 kB]
Get:13 http://172.17.0.1/private bullseye-staging/main armhf python3.8 armhf 3.8.6-1 [422 kB]
Get:14 http://172.17.0.1/private bullseye-staging/main armhf libpython3-stdlib armhf 3.8.6-1 [20.9 kB]
Get:15 http://172.17.0.1/private bullseye-staging/main armhf python3 armhf 3.8.6-1 [64.0 kB]
Get:16 http://172.17.0.1/private bullseye-staging/main armhf libpython3.9-minimal armhf 3.9.0-5+rpi1 [788 kB]
Get:17 http://172.17.0.1/private bullseye-staging/main armhf python3.9-minimal armhf 3.9.0-5+rpi1 [1628 kB]
Get:18 http://172.17.0.1/private bullseye-staging/main armhf sgml-base all 1.30 [15.1 kB]
Get:19 http://172.17.0.1/private bullseye-staging/main armhf libmagic-mgc armhf 1:5.38-5 [262 kB]
Get:20 http://172.17.0.1/private bullseye-staging/main armhf libmagic1 armhf 1:5.38-5 [113 kB]
Get:21 http://172.17.0.1/private bullseye-staging/main armhf file armhf 1:5.38-5 [67.0 kB]
Get:22 http://172.17.0.1/private bullseye-staging/main armhf gettext-base armhf 0.19.8.1-10 [117 kB]
Get:23 http://172.17.0.1/private bullseye-staging/main armhf libsigsegv2 armhf 2.12-2 [32.3 kB]
Get:24 http://172.17.0.1/private bullseye-staging/main armhf m4 armhf 1.4.18-4 [185 kB]
Get:25 http://172.17.0.1/private bullseye-staging/main armhf autoconf all 2.69-11.1 [341 kB]
Get:26 http://172.17.0.1/private bullseye-staging/main armhf autotools-dev all 20180224.1 [77.0 kB]
Get:27 http://172.17.0.1/private bullseye-staging/main armhf automake all 1:1.16.2-4 [801 kB]
Get:28 http://172.17.0.1/private bullseye-staging/main armhf autopoint all 0.19.8.1-10 [435 kB]
Get:29 http://172.17.0.1/private bullseye-staging/main armhf openssl armhf 1.1.1h-1 [812 kB]
Get:30 http://172.17.0.1/private bullseye-staging/main armhf ca-certificates all 20200601 [158 kB]
Get:31 http://172.17.0.1/private bullseye-staging/main armhf cython3 armhf 0.29.21-3 [1258 kB]
Get:32 http://172.17.0.1/private bullseye-staging/main armhf libtool all 2.4.6-14 [513 kB]
Get:33 http://172.17.0.1/private bullseye-staging/main armhf dh-autoreconf all 19 [16.9 kB]
Get:34 http://172.17.0.1/private bullseye-staging/main armhf libdebhelper-perl all 13.2.1 [188 kB]
Get:35 http://172.17.0.1/private bullseye-staging/main armhf libarchive-zip-perl all 1.68-1 [104 kB]
Get:36 http://172.17.0.1/private bullseye-staging/main armhf libsub-override-perl all 0.09-2 [10.2 kB]
Get:37 http://172.17.0.1/private bullseye-staging/main armhf libfile-stripnondeterminism-perl all 1.9.0-1 [25.5 kB]
Get:38 http://172.17.0.1/private bullseye-staging/main armhf dh-strip-nondeterminism all 1.9.0-1 [15.2 kB]
Get:39 http://172.17.0.1/private bullseye-staging/main armhf libelf1 armhf 0.181-1 [161 kB]
Get:40 http://172.17.0.1/private bullseye-staging/main armhf dwz armhf 0.13-5 [142 kB]
Get:41 http://172.17.0.1/private bullseye-staging/main armhf libglib2.0-0 armhf 2.66.2-1 [1176 kB]
Get:42 http://172.17.0.1/private bullseye-staging/main armhf libicu67 armhf 67.1-4 [8289 kB]
Get:43 http://172.17.0.1/private bullseye-staging/main armhf libxml2 armhf 2.9.10+dfsg-6.1 [578 kB]
Get:44 http://172.17.0.1/private bullseye-staging/main armhf libcroco3 armhf 0.6.13-1 [133 kB]
Get:45 http://172.17.0.1/private bullseye-staging/main armhf gettext armhf 0.19.8.1-10 [1219 kB]
Get:46 http://172.17.0.1/private bullseye-staging/main armhf intltool-debian all 0.35.0+20060710.5 [26.8 kB]
Get:47 http://172.17.0.1/private bullseye-staging/main armhf po-debconf all 1.0.21 [248 kB]
Get:48 http://172.17.0.1/private bullseye-staging/main armhf debhelper all 13.2.1 [1007 kB]
Get:49 http://172.17.0.1/private bullseye-staging/main armhf python3-lib2to3 all 3.8.6-1 [78.4 kB]
Get:50 http://172.17.0.1/private bullseye-staging/main armhf python3-distutils all 3.8.6-1 [145 kB]
Get:51 http://172.17.0.1/private bullseye-staging/main armhf dh-python all 4.20201102 [99.3 kB]
Get:52 http://172.17.0.1/private bullseye-staging/main armhf xml-core all 0.18+nmu1 [23.8 kB]
Get:53 http://172.17.0.1/private bullseye-staging/main armhf docutils-common all 0.16+dfsg-3 [129 kB]
Get:54 http://172.17.0.1/private bullseye-staging/main armhf fonts-mathjax all 2.7.9+dfsg-1 [2210 kB]
Get:55 http://172.17.0.1/private bullseye-staging/main armhf libbsd0 armhf 0.10.0-1 [112 kB]
Get:56 http://172.17.0.1/private bullseye-staging/main armhf libexpat1-dev armhf 2.2.10-1 [121 kB]
Get:57 http://172.17.0.1/private bullseye-staging/main armhf libgmpxx4ldbl armhf 2:6.2.0+dfsg-6 [22.1 kB]
Get:58 http://172.17.0.1/private bullseye-staging/main armhf libgmp-dev armhf 2:6.2.0+dfsg-6 [587 kB]
Get:59 http://172.17.0.1/private bullseye-staging/main armhf libkrb5support0 armhf 1.17-10+b3 [62.0 kB]
Get:60 http://172.17.0.1/private bullseye-staging/main armhf libk5crypto3 armhf 1.17-10+b3 [112 kB]
Get:61 http://172.17.0.1/private bullseye-staging/main armhf libkeyutils1 armhf 1.6.1-2 [14.5 kB]
Get:62 http://172.17.0.1/private bullseye-staging/main armhf libkrb5-3 armhf 1.17-10+b3 [318 kB]
Get:63 http://172.17.0.1/private bullseye-staging/main armhf libgssapi-krb5-2 armhf 1.17-10+b3 [135 kB]
Get:64 http://172.17.0.1/private bullseye-staging/main armhf node-jquery all 3.5.1+dfsg+~3.5.4-1 [390 kB]
Get:65 http://172.17.0.1/private bullseye-staging/main armhf libjs-jquery all 3.5.1+dfsg+~3.5.4-1 [3844 B]
Get:66 http://172.17.0.1/private bullseye-staging/main armhf libjs-mathjax all 2.7.9+dfsg-1 [5667 kB]
Get:67 http://172.17.0.1/private bullseye-staging/main armhf libjs-underscore all 1.9.1~dfsg-1 [99.4 kB]
Get:68 http://172.17.0.1/private bullseye-staging/main armhf libjs-sphinxdoc all 3.2.1-2 [122 kB]
Get:69 http://172.17.0.1/private bullseye-staging/main armhf libtirpc-common all 1.2.6-3 [13.3 kB]
Get:70 http://172.17.0.1/private bullseye-staging/main armhf libtirpc3 armhf 1.2.6-3 [71.2 kB]
Get:71 http://172.17.0.1/private bullseye-staging/main armhf libnsl2 armhf 1.3.0-2 [33.2 kB]
Get:72 http://172.17.0.1/private bullseye-staging/main armhf libpari-gmp-tls6 armhf 2.11.4-3 [2792 kB]
Get:73 http://172.17.0.1/private bullseye-staging/main armhf libpari-dev armhf 2.11.4-3 [3329 kB]
Get:74 http://172.17.0.1/private bullseye-staging/main armhf libpython3.8 armhf 3.8.6-1 [1343 kB]
Get:75 http://172.17.0.1/private bullseye-staging/main armhf libpython3.8-dev armhf 3.8.6-1 [2887 kB]
Get:76 http://172.17.0.1/private bullseye-staging/main armhf libpython3-dev armhf 3.8.6-1 [21.1 kB]
Get:77 http://172.17.0.1/private bullseye-staging/main armhf libpython3.9-stdlib armhf 3.9.0-5+rpi1 [1654 kB]
Get:78 http://172.17.0.1/private bullseye-staging/main armhf libpython3.9 armhf 3.9.0-5+rpi1 [1411 kB]
Get:79 http://172.17.0.1/private bullseye-staging/main armhf libpython3.9-dev armhf 3.9.0-5+rpi1 [3053 kB]
Get:80 http://172.17.0.1/private bullseye-staging/main armhf libpython3-all-dev armhf 3.8.6-1 [1072 B]
Get:81 http://172.17.0.1/private bullseye-staging/main armhf libxau6 armhf 1:1.0.8-1+b2 [19.1 kB]
Get:82 http://172.17.0.1/private bullseye-staging/main armhf libxdmcp6 armhf 1:1.1.2-3 [25.0 kB]
Get:83 http://172.17.0.1/private bullseye-staging/main armhf libxcb1 armhf 1.14-2 [135 kB]
Get:84 http://172.17.0.1/private bullseye-staging/main armhf libx11-data all 2:1.6.12-1 [311 kB]
Get:85 http://172.17.0.1/private bullseye-staging/main armhf libx11-6 armhf 2:1.6.12-1 [700 kB]
Get:86 http://172.17.0.1/private bullseye-staging/main armhf pari-doc all 2.13.0-2 [7906 kB]
Get:87 http://172.17.0.1/private bullseye-staging/main armhf pari-gp armhf 2.11.4-3 [2485 kB]
Get:88 http://172.17.0.1/private bullseye-staging/main armhf python-babel-localedata all 2.8.0+dfsg.1-4 [4996 kB]
Get:89 http://172.17.0.1/private bullseye-staging/main armhf python3-alabaster all 0.7.8-1.1 [18.6 kB]
Get:90 http://172.17.0.1/private bullseye-staging/main armhf python3.9 armhf 3.9.0-5+rpi1 [455 kB]
Get:91 http://172.17.0.1/private bullseye-staging/main armhf python3-all armhf 3.8.6-1 [1060 B]
Get:92 http://172.17.0.1/private bullseye-staging/main armhf zlib1g-dev armhf 1:1.2.11.dfsg-2 [184 kB]
Get:93 http://172.17.0.1/private bullseye-staging/main armhf python3.8-dev armhf 3.8.6-1 [519 kB]
Get:94 http://172.17.0.1/private bullseye-staging/main armhf python3-dev armhf 3.8.6-1 [1164 B]
Get:95 http://172.17.0.1/private bullseye-staging/main armhf python3.9-dev armhf 3.9.0-5+rpi1 [501 kB]
Get:96 http://172.17.0.1/private bullseye-staging/main armhf python3-all-dev armhf 3.8.6-1 [1076 B]
Get:97 http://172.17.0.1/private bullseye-staging/main armhf python3-pkg-resources all 50.3.0-1 [187 kB]
Get:98 http://172.17.0.1/private bullseye-staging/main armhf python3-tz all 2020.1-2 [34.6 kB]
Get:99 http://172.17.0.1/private bullseye-staging/main armhf python3-babel all 2.8.0+dfsg.1-4 [99.9 kB]
Get:100 http://172.17.0.1/private bullseye-staging/main armhf python3-certifi all 2020.6.20-1 [151 kB]
Get:101 http://172.17.0.1/private bullseye-staging/main armhf python3-chardet all 3.0.4-7 [81.1 kB]
Get:102 http://172.17.0.1/private bullseye-staging/main armhf python3-cysignals-pari armhf 1.10.2+ds-4 [204 kB]
Get:103 http://172.17.0.1/private bullseye-staging/main armhf python3-roman all 2.0.0-5 [9064 B]
Get:104 http://172.17.0.1/private bullseye-staging/main armhf python3-docutils all 0.16+dfsg-3 [384 kB]
Get:105 http://172.17.0.1/private bullseye-staging/main armhf python3-idna all 2.10-1 [37.4 kB]
Get:106 http://172.17.0.1/private bullseye-staging/main armhf python3-imagesize all 1.2.0-2 [5824 B]
Get:107 http://172.17.0.1/private bullseye-staging/main armhf python3-markupsafe armhf 1.1.1-1 [15.0 kB]
Get:108 http://172.17.0.1/private bullseye-staging/main armhf python3-jinja2 all 2.11.2-1 [113 kB]
Get:109 http://172.17.0.1/private bullseye-staging/main armhf python3-pyparsing all 2.4.7-1 [109 kB]
Get:110 http://172.17.0.1/private bullseye-staging/main armhf python3-six all 1.15.0-1 [16.8 kB]
Get:111 http://172.17.0.1/private bullseye-staging/main armhf python3-packaging all 20.4-1 [30.4 kB]
Get:112 http://172.17.0.1/private bullseye-staging/main armhf python3-pygments all 2.3.1+dfsg-4 [596 kB]
Get:113 http://172.17.0.1/private bullseye-staging/main armhf python3-urllib3 all 1.25.9-1 [105 kB]
Get:114 http://172.17.0.1/private bullseye-staging/main armhf python3-requests all 2.24.0+dfsg-1 [71.7 kB]
Get:115 http://172.17.0.1/private bullseye-staging/main armhf python3-setuptools all 50.3.0-1 [511 kB]
Get:116 http://172.17.0.1/private bullseye-staging/main armhf python3-snowballstemmer all 2.0.0-2 [58.2 kB]
Get:117 http://172.17.0.1/private bullseye-staging/main armhf sphinx-common all 3.2.1-2 [574 kB]
Get:118 http://172.17.0.1/private bullseye-staging/main armhf python3-sphinx all 3.2.1-2 [534 kB]
debconf: delaying package configuration, since apt-utils is not installed
Fetched 78.2 MB in 12s (6414 kB/s)
Selecting previously unselected package libuchardet0:armhf.
(Reading database ... 12498 files and directories currently installed.)
Preparing to unpack .../0-libuchardet0_0.0.7-1_armhf.deb ...
Unpacking libuchardet0:armhf (0.0.7-1) ...
Selecting previously unselected package groff-base.
Preparing to unpack .../1-groff-base_1.22.4-5_armhf.deb ...
Unpacking groff-base (1.22.4-5) ...
Selecting previously unselected package libpipeline1:armhf.
Preparing to unpack .../2-libpipeline1_1.5.3-1_armhf.deb ...
Unpacking libpipeline1:armhf (1.5.3-1) ...
Selecting previously unselected package man-db.
Preparing to unpack .../3-man-db_2.9.3-2_armhf.deb ...
Unpacking man-db (2.9.3-2) ...
Selecting previously unselected package libssl1.1:armhf.
Preparing to unpack .../4-libssl1.1_1.1.1h-1_armhf.deb ...
Unpacking libssl1.1:armhf (1.1.1h-1) ...
Selecting previously unselected package libpython3.8-minimal:armhf.
Preparing to unpack .../5-libpython3.8-minimal_3.8.6-1_armhf.deb ...
Unpacking libpython3.8-minimal:armhf (3.8.6-1) ...
Selecting previously unselected package libexpat1:armhf.
Preparing to unpack .../6-libexpat1_2.2.10-1_armhf.deb ...
Unpacking libexpat1:armhf (2.2.10-1) ...
Selecting previously unselected package python3.8-minimal.
Preparing to unpack .../7-python3.8-minimal_3.8.6-1_armhf.deb ...
Unpacking python3.8-minimal (3.8.6-1) ...
Setting up libssl1.1:armhf (1.1.1h-1) ...
Setting up libpython3.8-minimal:armhf (3.8.6-1) ...
Setting up libexpat1:armhf (2.2.10-1) ...
Setting up python3.8-minimal (3.8.6-1) ...
Selecting previously unselected package python3-minimal.
(Reading database ... 13326 files and directories currently installed.)
Preparing to unpack .../python3-minimal_3.8.6-1_armhf.deb ...
Unpacking python3-minimal (3.8.6-1) ...
Selecting previously unselected package mime-support.
Preparing to unpack .../mime-support_3.64_all.deb ...
Unpacking mime-support (3.64) ...
Selecting previously unselected package libpython3.8-stdlib:armhf.
Preparing to unpack .../libpython3.8-stdlib_3.8.6-1_armhf.deb ...
Unpacking libpython3.8-stdlib:armhf (3.8.6-1) ...
Selecting previously unselected package python3.8.
Preparing to unpack .../python3.8_3.8.6-1_armhf.deb ...
Unpacking python3.8 (3.8.6-1) ...
Selecting previously unselected package libpython3-stdlib:armhf.
Preparing to unpack .../libpython3-stdlib_3.8.6-1_armhf.deb ...
Unpacking libpython3-stdlib:armhf (3.8.6-1) ...
Setting up python3-minimal (3.8.6-1) ...
Selecting previously unselected package python3.
(Reading database ... 13722 files and directories currently installed.)
Preparing to unpack .../000-python3_3.8.6-1_armhf.deb ...
Unpacking python3 (3.8.6-1) ...
Selecting previously unselected package libpython3.9-minimal:armhf.
Preparing to unpack .../001-libpython3.9-minimal_3.9.0-5+rpi1_armhf.deb ...
Unpacking libpython3.9-minimal:armhf (3.9.0-5+rpi1) ...
Selecting previously unselected package python3.9-minimal.
Preparing to unpack .../002-python3.9-minimal_3.9.0-5+rpi1_armhf.deb ...
Unpacking python3.9-minimal (3.9.0-5+rpi1) ...
Selecting previously unselected package sgml-base.
Preparing to unpack .../003-sgml-base_1.30_all.deb ...
Unpacking sgml-base (1.30) ...
Selecting previously unselected package libmagic-mgc.
Preparing to unpack .../004-libmagic-mgc_1%3a5.38-5_armhf.deb ...
Unpacking libmagic-mgc (1:5.38-5) ...
Selecting previously unselected package libmagic1:armhf.
Preparing to unpack .../005-libmagic1_1%3a5.38-5_armhf.deb ...
Unpacking libmagic1:armhf (1:5.38-5) ...
Selecting previously unselected package file.
Preparing to unpack .../006-file_1%3a5.38-5_armhf.deb ...
Unpacking file (1:5.38-5) ...
Selecting previously unselected package gettext-base.
Preparing to unpack .../007-gettext-base_0.19.8.1-10_armhf.deb ...
Unpacking gettext-base (0.19.8.1-10) ...
Selecting previously unselected package libsigsegv2:armhf.
Preparing to unpack .../008-libsigsegv2_2.12-2_armhf.deb ...
Unpacking libsigsegv2:armhf (2.12-2) ...
Selecting previously unselected package m4.
Preparing to unpack .../009-m4_1.4.18-4_armhf.deb ...
Unpacking m4 (1.4.18-4) ...
Selecting previously unselected package autoconf.
Preparing to unpack .../010-autoconf_2.69-11.1_all.deb ...
Unpacking autoconf (2.69-11.1) ...
Selecting previously unselected package autotools-dev.
Preparing to unpack .../011-autotools-dev_20180224.1_all.deb ...
Unpacking autotools-dev (20180224.1) ...
Selecting previously unselected package automake.
Preparing to unpack .../012-automake_1%3a1.16.2-4_all.deb ...
Unpacking automake (1:1.16.2-4) ...
Selecting previously unselected package autopoint.
Preparing to unpack .../013-autopoint_0.19.8.1-10_all.deb ...
Unpacking autopoint (0.19.8.1-10) ...
Selecting previously unselected package openssl.
Preparing to unpack .../014-openssl_1.1.1h-1_armhf.deb ...
Unpacking openssl (1.1.1h-1) ...
Selecting previously unselected package ca-certificates.
Preparing to unpack .../015-ca-certificates_20200601_all.deb ...
Unpacking ca-certificates (20200601) ...
Selecting previously unselected package cython3.
Preparing to unpack .../016-cython3_0.29.21-3_armhf.deb ...
Unpacking cython3 (0.29.21-3) ...
Selecting previously unselected package libtool.
Preparing to unpack .../017-libtool_2.4.6-14_all.deb ...
Unpacking libtool (2.4.6-14) ...
Selecting previously unselected package dh-autoreconf.
Preparing to unpack .../018-dh-autoreconf_19_all.deb ...
Unpacking dh-autoreconf (19) ...
Selecting previously unselected package libdebhelper-perl.
Preparing to unpack .../019-libdebhelper-perl_13.2.1_all.deb ...
Unpacking libdebhelper-perl (13.2.1) ...
Selecting previously unselected package libarchive-zip-perl.
Preparing to unpack .../020-libarchive-zip-perl_1.68-1_all.deb ...
Unpacking libarchive-zip-perl (1.68-1) ...
Selecting previously unselected package libsub-override-perl.
Preparing to unpack .../021-libsub-override-perl_0.09-2_all.deb ...
Unpacking libsub-override-perl (0.09-2) ...
Selecting previously unselected package libfile-stripnondeterminism-perl.
Preparing to unpack .../022-libfile-stripnondeterminism-perl_1.9.0-1_all.deb ...
Unpacking libfile-stripnondeterminism-perl (1.9.0-1) ...
Selecting previously unselected package dh-strip-nondeterminism.
Preparing to unpack .../023-dh-strip-nondeterminism_1.9.0-1_all.deb ...
Unpacking dh-strip-nondeterminism (1.9.0-1) ...
Selecting previously unselected package libelf1:armhf.
Preparing to unpack .../024-libelf1_0.181-1_armhf.deb ...
Unpacking libelf1:armhf (0.181-1) ...
Selecting previously unselected package dwz.
Preparing to unpack .../025-dwz_0.13-5_armhf.deb ...
Unpacking dwz (0.13-5) ...
Selecting previously unselected package libglib2.0-0:armhf.
Preparing to unpack .../026-libglib2.0-0_2.66.2-1_armhf.deb ...
Unpacking libglib2.0-0:armhf (2.66.2-1) ...
Selecting previously unselected package libicu67:armhf.
Preparing to unpack .../027-libicu67_67.1-4_armhf.deb ...
Unpacking libicu67:armhf (67.1-4) ...
Selecting previously unselected package libxml2:armhf.
Preparing to unpack .../028-libxml2_2.9.10+dfsg-6.1_armhf.deb ...
Unpacking libxml2:armhf (2.9.10+dfsg-6.1) ...
Selecting previously unselected package libcroco3:armhf.
Preparing to unpack .../029-libcroco3_0.6.13-1_armhf.deb ...
Unpacking libcroco3:armhf (0.6.13-1) ...
Selecting previously unselected package gettext.
Preparing to unpack .../030-gettext_0.19.8.1-10_armhf.deb ...
Unpacking gettext (0.19.8.1-10) ...
Selecting previously unselected package intltool-debian.
Preparing to unpack .../031-intltool-debian_0.35.0+20060710.5_all.deb ...
Unpacking intltool-debian (0.35.0+20060710.5) ...
Selecting previously unselected package po-debconf.
Preparing to unpack .../032-po-debconf_1.0.21_all.deb ...
Unpacking po-debconf (1.0.21) ...
Selecting previously unselected package debhelper.
Preparing to unpack .../033-debhelper_13.2.1_all.deb ...
Unpacking debhelper (13.2.1) ...
Selecting previously unselected package python3-lib2to3.
Preparing to unpack .../034-python3-lib2to3_3.8.6-1_all.deb ...
Unpacking python3-lib2to3 (3.8.6-1) ...
Selecting previously unselected package python3-distutils.
Preparing to unpack .../035-python3-distutils_3.8.6-1_all.deb ...
Unpacking python3-distutils (3.8.6-1) ...
Selecting previously unselected package dh-python.
Preparing to unpack .../036-dh-python_4.20201102_all.deb ...
Unpacking dh-python (4.20201102) ...
Selecting previously unselected package xml-core.
Preparing to unpack .../037-xml-core_0.18+nmu1_all.deb ...
Unpacking xml-core (0.18+nmu1) ...
Selecting previously unselected package docutils-common.
Preparing to unpack .../038-docutils-common_0.16+dfsg-3_all.deb ...
Unpacking docutils-common (0.16+dfsg-3) ...
Selecting previously unselected package fonts-mathjax.
Preparing to unpack .../039-fonts-mathjax_2.7.9+dfsg-1_all.deb ...
Unpacking fonts-mathjax (2.7.9+dfsg-1) ...
Selecting previously unselected package libbsd0:armhf.
Preparing to unpack .../040-libbsd0_0.10.0-1_armhf.deb ...
Unpacking libbsd0:armhf (0.10.0-1) ...
Selecting previously unselected package libexpat1-dev:armhf.
Preparing to unpack .../041-libexpat1-dev_2.2.10-1_armhf.deb ...
Unpacking libexpat1-dev:armhf (2.2.10-1) ...
Selecting previously unselected package libgmpxx4ldbl:armhf.
Preparing to unpack .../042-libgmpxx4ldbl_2%3a6.2.0+dfsg-6_armhf.deb ...
Unpacking libgmpxx4ldbl:armhf (2:6.2.0+dfsg-6) ...
Selecting previously unselected package libgmp-dev:armhf.
Preparing to unpack .../043-libgmp-dev_2%3a6.2.0+dfsg-6_armhf.deb ...
Unpacking libgmp-dev:armhf (2:6.2.0+dfsg-6) ...
Selecting previously unselected package libkrb5support0:armhf.
Preparing to unpack .../044-libkrb5support0_1.17-10+b3_armhf.deb ...
Unpacking libkrb5support0:armhf (1.17-10+b3) ...
Selecting previously unselected package libk5crypto3:armhf.
Preparing to unpack .../045-libk5crypto3_1.17-10+b3_armhf.deb ...
Unpacking libk5crypto3:armhf (1.17-10+b3) ...
Selecting previously unselected package libkeyutils1:armhf.
Preparing to unpack .../046-libkeyutils1_1.6.1-2_armhf.deb ...
Unpacking libkeyutils1:armhf (1.6.1-2) ...
Selecting previously unselected package libkrb5-3:armhf.
Preparing to unpack .../047-libkrb5-3_1.17-10+b3_armhf.deb ...
Unpacking libkrb5-3:armhf (1.17-10+b3) ...
Selecting previously unselected package libgssapi-krb5-2:armhf.
Preparing to unpack .../048-libgssapi-krb5-2_1.17-10+b3_armhf.deb ...
Unpacking libgssapi-krb5-2:armhf (1.17-10+b3) ...
Selecting previously unselected package node-jquery.
Preparing to unpack .../049-node-jquery_3.5.1+dfsg+~3.5.4-1_all.deb ...
Unpacking node-jquery (3.5.1+dfsg+~3.5.4-1) ...
Selecting previously unselected package libjs-jquery.
Preparing to unpack .../050-libjs-jquery_3.5.1+dfsg+~3.5.4-1_all.deb ...
Unpacking libjs-jquery (3.5.1+dfsg+~3.5.4-1) ...
Selecting previously unselected package libjs-mathjax.
Preparing to unpack .../051-libjs-mathjax_2.7.9+dfsg-1_all.deb ...
Unpacking libjs-mathjax (2.7.9+dfsg-1) ...
Selecting previously unselected package libjs-underscore.
Preparing to unpack .../052-libjs-underscore_1.9.1~dfsg-1_all.deb ...
Unpacking libjs-underscore (1.9.1~dfsg-1) ...
Selecting previously unselected package libjs-sphinxdoc.
Preparing to unpack .../053-libjs-sphinxdoc_3.2.1-2_all.deb ...
Unpacking libjs-sphinxdoc (3.2.1-2) ...
Selecting previously unselected package libtirpc-common.
Preparing to unpack .../054-libtirpc-common_1.2.6-3_all.deb ...
Unpacking libtirpc-common (1.2.6-3) ...
Selecting previously unselected package libtirpc3:armhf.
Preparing to unpack .../055-libtirpc3_1.2.6-3_armhf.deb ...
Unpacking libtirpc3:armhf (1.2.6-3) ...
Selecting previously unselected package libnsl2:armhf.
Preparing to unpack .../056-libnsl2_1.3.0-2_armhf.deb ...
Unpacking libnsl2:armhf (1.3.0-2) ...
Selecting previously unselected package libpari-gmp-tls6:armhf.
Preparing to unpack .../057-libpari-gmp-tls6_2.11.4-3_armhf.deb ...
Unpacking libpari-gmp-tls6:armhf (2.11.4-3) ...
Selecting previously unselected package libpari-dev:armhf.
Preparing to unpack .../058-libpari-dev_2.11.4-3_armhf.deb ...
Unpacking libpari-dev:armhf (2.11.4-3) ...
Selecting previously unselected package libpython3.8:armhf.
Preparing to unpack .../059-libpython3.8_3.8.6-1_armhf.deb ...
Unpacking libpython3.8:armhf (3.8.6-1) ...
Selecting previously unselected package libpython3.8-dev:armhf.
Preparing to unpack .../060-libpython3.8-dev_3.8.6-1_armhf.deb ...
Unpacking libpython3.8-dev:armhf (3.8.6-1) ...
Selecting previously unselected package libpython3-dev:armhf.
Preparing to unpack .../061-libpython3-dev_3.8.6-1_armhf.deb ...
Unpacking libpython3-dev:armhf (3.8.6-1) ...
Selecting previously unselected package libpython3.9-stdlib:armhf.
Preparing to unpack .../062-libpython3.9-stdlib_3.9.0-5+rpi1_armhf.deb ...
Unpacking libpython3.9-stdlib:armhf (3.9.0-5+rpi1) ...
Selecting previously unselected package libpython3.9:armhf.
Preparing to unpack .../063-libpython3.9_3.9.0-5+rpi1_armhf.deb ...
Unpacking libpython3.9:armhf (3.9.0-5+rpi1) ...
Selecting previously unselected package libpython3.9-dev:armhf.
Preparing to unpack .../064-libpython3.9-dev_3.9.0-5+rpi1_armhf.deb ...
Unpacking libpython3.9-dev:armhf (3.9.0-5+rpi1) ...
Selecting previously unselected package libpython3-all-dev:armhf.
Preparing to unpack .../065-libpython3-all-dev_3.8.6-1_armhf.deb ...
Unpacking libpython3-all-dev:armhf (3.8.6-1) ...
Selecting previously unselected package libxau6:armhf.
Preparing to unpack .../066-libxau6_1%3a1.0.8-1+b2_armhf.deb ...
Unpacking libxau6:armhf (1:1.0.8-1+b2) ...
Selecting previously unselected package libxdmcp6:armhf.
Preparing to unpack .../067-libxdmcp6_1%3a1.1.2-3_armhf.deb ...
Unpacking libxdmcp6:armhf (1:1.1.2-3) ...
Selecting previously unselected package libxcb1:armhf.
Preparing to unpack .../068-libxcb1_1.14-2_armhf.deb ...
Unpacking libxcb1:armhf (1.14-2) ...
Selecting previously unselected package libx11-data.
Preparing to unpack .../069-libx11-data_2%3a1.6.12-1_all.deb ...
Unpacking libx11-data (2:1.6.12-1) ...
Selecting previously unselected package libx11-6:armhf.
Preparing to unpack .../070-libx11-6_2%3a1.6.12-1_armhf.deb ...
Unpacking libx11-6:armhf (2:1.6.12-1) ...
Selecting previously unselected package pari-doc.
Preparing to unpack .../071-pari-doc_2.13.0-2_all.deb ...
Unpacking pari-doc (2.13.0-2) ...
Selecting previously unselected package pari-gp.
Preparing to unpack .../072-pari-gp_2.11.4-3_armhf.deb ...
Unpacking pari-gp (2.11.4-3) ...
Selecting previously unselected package python-babel-localedata.
Preparing to unpack .../073-python-babel-localedata_2.8.0+dfsg.1-4_all.deb ...
Unpacking python-babel-localedata (2.8.0+dfsg.1-4) ...
Selecting previously unselected package python3-alabaster.
Preparing to unpack .../074-python3-alabaster_0.7.8-1.1_all.deb ...
Unpacking python3-alabaster (0.7.8-1.1) ...
Selecting previously unselected package python3.9.
Preparing to unpack .../075-python3.9_3.9.0-5+rpi1_armhf.deb ...
Unpacking python3.9 (3.9.0-5+rpi1) ...
Selecting previously unselected package python3-all.
Preparing to unpack .../076-python3-all_3.8.6-1_armhf.deb ...
Unpacking python3-all (3.8.6-1) ...
Selecting previously unselected package zlib1g-dev:armhf.
Preparing to unpack .../077-zlib1g-dev_1%3a1.2.11.dfsg-2_armhf.deb ...
Unpacking zlib1g-dev:armhf (1:1.2.11.dfsg-2) ...
Selecting previously unselected package python3.8-dev.
Preparing to unpack .../078-python3.8-dev_3.8.6-1_armhf.deb ...
Unpacking python3.8-dev (3.8.6-1) ...
Selecting previously unselected package python3-dev.
Preparing to unpack .../079-python3-dev_3.8.6-1_armhf.deb ...
Unpacking python3-dev (3.8.6-1) ...
Selecting previously unselected package python3.9-dev.
Preparing to unpack .../080-python3.9-dev_3.9.0-5+rpi1_armhf.deb ...
Unpacking python3.9-dev (3.9.0-5+rpi1) ...
Selecting previously unselected package python3-all-dev.
Preparing to unpack .../081-python3-all-dev_3.8.6-1_armhf.deb ...
Unpacking python3-all-dev (3.8.6-1) ...
Selecting previously unselected package python3-pkg-resources.
Preparing to unpack .../082-python3-pkg-resources_50.3.0-1_all.deb ...
Unpacking python3-pkg-resources (50.3.0-1) ...
Selecting previously unselected package python3-tz.
Preparing to unpack .../083-python3-tz_2020.1-2_all.deb ...
Unpacking python3-tz (2020.1-2) ...
Selecting previously unselected package python3-babel.
Preparing to unpack .../084-python3-babel_2.8.0+dfsg.1-4_all.deb ...
Unpacking python3-babel (2.8.0+dfsg.1-4) ...
Selecting previously unselected package python3-certifi.
Preparing to unpack .../085-python3-certifi_2020.6.20-1_all.deb ...
Unpacking python3-certifi (2020.6.20-1) ...
Selecting previously unselected package python3-chardet.
Preparing to unpack .../086-python3-chardet_3.0.4-7_all.deb ...
Unpacking python3-chardet (3.0.4-7) ...
Selecting previously unselected package python3-cysignals-pari.
Preparing to unpack .../087-python3-cysignals-pari_1.10.2+ds-4_armhf.deb ...
Unpacking python3-cysignals-pari (1.10.2+ds-4) ...
Selecting previously unselected package python3-roman.
Preparing to unpack .../088-python3-roman_2.0.0-5_all.deb ...
Unpacking python3-roman (2.0.0-5) ...
Selecting previously unselected package python3-docutils.
Preparing to unpack .../089-python3-docutils_0.16+dfsg-3_all.deb ...
Unpacking python3-docutils (0.16+dfsg-3) ...
Selecting previously unselected package python3-idna.
Preparing to unpack .../090-python3-idna_2.10-1_all.deb ...
Unpacking python3-idna (2.10-1) ...
Selecting previously unselected package python3-imagesize.
Preparing to unpack .../091-python3-imagesize_1.2.0-2_all.deb ...
Unpacking python3-imagesize (1.2.0-2) ...
Selecting previously unselected package python3-markupsafe.
Preparing to unpack .../092-python3-markupsafe_1.1.1-1_armhf.deb ...
Unpacking python3-markupsafe (1.1.1-1) ...
Selecting previously unselected package python3-jinja2.
Preparing to unpack .../093-python3-jinja2_2.11.2-1_all.deb ...
Unpacking python3-jinja2 (2.11.2-1) ...
Selecting previously unselected package python3-pyparsing.
Preparing to unpack .../094-python3-pyparsing_2.4.7-1_all.deb ...
Unpacking python3-pyparsing (2.4.7-1) ...
Selecting previously unselected package python3-six.
Preparing to unpack .../095-python3-six_1.15.0-1_all.deb ...
Unpacking python3-six (1.15.0-1) ...
Selecting previously unselected package python3-packaging.
Preparing to unpack .../096-python3-packaging_20.4-1_all.deb ...
Unpacking python3-packaging (20.4-1) ...
Selecting previously unselected package python3-pygments.
Preparing to unpack .../097-python3-pygments_2.3.1+dfsg-4_all.deb ...
Unpacking python3-pygments (2.3.1+dfsg-4) ...
Selecting previously unselected package python3-urllib3.
Preparing to unpack .../098-python3-urllib3_1.25.9-1_all.deb ...
Unpacking python3-urllib3 (1.25.9-1) ...
Selecting previously unselected package python3-requests.
Preparing to unpack .../099-python3-requests_2.24.0+dfsg-1_all.deb ...
Unpacking python3-requests (2.24.0+dfsg-1) ...
Selecting previously unselected package python3-setuptools.
Preparing to unpack .../100-python3-setuptools_50.3.0-1_all.deb ...
Unpacking python3-setuptools (50.3.0-1) ...
Selecting previously unselected package python3-snowballstemmer.
Preparing to unpack .../101-python3-snowballstemmer_2.0.0-2_all.deb ...
Unpacking python3-snowballstemmer (2.0.0-2) ...
Selecting previously unselected package sphinx-common.
Preparing to unpack .../102-sphinx-common_3.2.1-2_all.deb ...
Unpacking sphinx-common (3.2.1-2) ...
Selecting previously unselected package python3-sphinx.
Preparing to unpack .../103-python3-sphinx_3.2.1-2_all.deb ...
Unpacking python3-sphinx (3.2.1-2) ...
Selecting previously unselected package sbuild-build-depends-cypari2-dummy.
Preparing to unpack .../104-sbuild-build-depends-cypari2-dummy_0.invalid.0_armhf.deb ...
Unpacking sbuild-build-depends-cypari2-dummy (0.invalid.0) ...
Setting up libpipeline1:armhf (1.5.3-1) ...
Setting up libxau6:armhf (1:1.0.8-1+b2) ...
Setting up libkeyutils1:armhf (1.6.1-2) ...
Setting up fonts-mathjax (2.7.9+dfsg-1) ...
Setting up mime-support (3.64) ...
Setting up libjs-mathjax (2.7.9+dfsg-1) ...
Setting up libicu67:armhf (67.1-4) ...
Setting up libmagic-mgc (1:5.38-5) ...
Setting up libarchive-zip-perl (1.68-1) ...
Setting up libglib2.0-0:armhf (2.66.2-1) ...
No schema files found: doing nothing.
Setting up libpython3.9-minimal:armhf (3.9.0-5+rpi1) ...
Setting up libtirpc-common (1.2.6-3) ...
Setting up libdebhelper-perl (13.2.1) ...
Setting up libmagic1:armhf (1:5.38-5) ...
Setting up gettext-base (0.19.8.1-10) ...
Setting up file (1:5.38-5) ...
Setting up python-babel-localedata (2.8.0+dfsg.1-4) ...
Setting up libkrb5support0:armhf (1.17-10+b3) ...
Setting up autotools-dev (20180224.1) ...
Setting up libgmpxx4ldbl:armhf (2:6.2.0+dfsg-6) ...
Setting up libexpat1-dev:armhf (2.2.10-1) ...
Setting up libx11-data (2:1.6.12-1) ...
Setting up libsigsegv2:armhf (2.12-2) ...
Setting up autopoint (0.19.8.1-10) ...
Setting up libk5crypto3:armhf (1.17-10+b3) ...
Setting up zlib1g-dev:armhf (1:1.2.11.dfsg-2) ...
Setting up pari-doc (2.13.0-2) ...
Setting up libuchardet0:armhf (0.0.7-1) ...
Setting up libsub-override-perl (0.09-2) ...
Setting up sgml-base (1.30) ...
Setting up libkrb5-3:armhf (1.17-10+b3) ...
Setting up python3.9-minimal (3.9.0-5+rpi1) ...
Setting up libpython3.8-stdlib:armhf (3.8.6-1) ...
Setting up python3.8 (3.8.6-1) ...
Setting up libpari-gmp-tls6:armhf (2.11.4-3) ...
Setting up openssl (1.1.1h-1) ...
Setting up libbsd0:armhf (0.10.0-1) ...
Setting up libelf1:armhf (0.181-1) ...
Setting up libxml2:armhf (2.9.10+dfsg-6.1) ...
Setting up node-jquery (3.5.1+dfsg+~3.5.4-1) ...
Setting up libpython3-stdlib:armhf (3.8.6-1) ...
Setting up libjs-underscore (1.9.1~dfsg-1) ...
Setting up libfile-stripnondeterminism-perl (1.9.0-1) ...
Setting up libxdmcp6:armhf (1:1.1.2-3) ...
Setting up libxcb1:armhf (1.14-2) ...
Setting up libgmp-dev:armhf (2:6.2.0+dfsg-6) ...
Setting up libtool (2.4.6-14) ...
Setting up m4 (1.4.18-4) ...
Setting up python3 (3.8.6-1) ...
Setting up python3-cysignals-pari (1.10.2+ds-4) ...
Setting up python3-markupsafe (1.1.1-1) ...
Setting up python3-tz (2020.1-2) ...
Setting up python3-six (1.15.0-1) ...
Setting up libpari-dev:armhf (2.11.4-3) ...
Setting up ca-certificates (20200601) ...
Updating certificates in /etc/ssl/certs...
126 added, 0 removed; done.
Setting up python3-roman (2.0.0-5) ...
Setting up python3-jinja2 (2.11.2-1) ...
Setting up python3-pyparsing (2.4.7-1) ...
Setting up python3-certifi (2020.6.20-1) ...
Setting up python3-snowballstemmer (2.0.0-2) ...
Setting up libpython3.8:armhf (3.8.6-1) ...
Setting up libgssapi-krb5-2:armhf (1.17-10+b3) ...
Setting up python3-idna (2.10-1) ...
Setting up cython3 (0.29.21-3) ...
Setting up libcroco3:armhf (0.6.13-1) ...
Setting up autoconf (2.69-11.1) ...
Setting up python3-urllib3 (1.25.9-1) ...
Setting up dh-strip-nondeterminism (1.9.0-1) ...
Setting up dwz (0.13-5) ...
Setting up groff-base (1.22.4-5) ...
Setting up xml-core (0.18+nmu1) ...
Setting up libx11-6:armhf (2:1.6.12-1) ...
Setting up libjs-jquery (3.5.1+dfsg+~3.5.4-1) ...
Setting up python3-lib2to3 (3.8.6-1) ...
Setting up pari-gp (2.11.4-3) ...
Setting up python3-imagesize (1.2.0-2) ...
Setting up python3-pkg-resources (50.3.0-1) ...
Setting up automake (1:1.16.2-4) ...
update-alternatives: using /usr/bin/automake-1.16 to provide /usr/bin/automake (automake) in auto mode
Setting up python3-distutils (3.8.6-1) ...
Setting up dh-python (4.20201102) ...
Setting up libtirpc3:armhf (1.2.6-3) ...
Setting up gettext (0.19.8.1-10) ...
Setting up python3-setuptools (50.3.0-1) ...
Setting up python3-babel (2.8.0+dfsg.1-4) ...
update-alternatives: using /usr/bin/pybabel-python3 to provide /usr/bin/pybabel (pybabel) in auto mode
Setting up python3-alabaster (0.7.8-1.1) ...
Setting up man-db (2.9.3-2) ...
Not building database; man-db/auto-update is not 'true'.
Setting up intltool-debian (0.35.0+20060710.5) ...
Setting up python3-pygments (2.3.1+dfsg-4) ...
Setting up python3-packaging (20.4-1) ...
Setting up python3-chardet (3.0.4-7) ...
Setting up libpython3.8-dev:armhf (3.8.6-1) ...
Setting up python3-requests (2.24.0+dfsg-1) ...
Setting up libjs-sphinxdoc (3.2.1-2) ...
Setting up python3.8-dev (3.8.6-1) ...
Setting up libnsl2:armhf (1.3.0-2) ...
Setting up libpython3.9-stdlib:armhf (3.9.0-5+rpi1) ...
Setting up libpython3-dev:armhf (3.8.6-1) ...
Setting up po-debconf (1.0.21) ...
Setting up libpython3.9:armhf (3.9.0-5+rpi1) ...
Setting up sphinx-common (3.2.1-2) ...
Setting up python3-dev (3.8.6-1) ...
Setting up python3.9 (3.9.0-5+rpi1) ...
Setting up libpython3.9-dev:armhf (3.9.0-5+rpi1) ...
Setting up python3-all (3.8.6-1) ...
Setting up libpython3-all-dev:armhf (3.8.6-1) ...
Setting up python3.9-dev (3.9.0-5+rpi1) ...
Setting up python3-all-dev (3.8.6-1) ...
Setting up dh-autoreconf (19) ...
Setting up debhelper (13.2.1) ...
Processing triggers for libc-bin (2.31-3+rpi1) ...
Processing triggers for sgml-base (1.30) ...
Setting up docutils-common (0.16+dfsg-3) ...
Processing triggers for sgml-base (1.30) ...
Setting up python3-docutils (0.16+dfsg-3) ...
update-alternatives: using /usr/share/docutils/scripts/python3/rst-buildhtml to provide /usr/bin/rst-buildhtml (rst-buildhtml) in auto mode
update-alternatives: using /usr/share/docutils/scripts/python3/rst2html to provide /usr/bin/rst2html (rst2html) in auto mode
update-alternatives: using /usr/share/docutils/scripts/python3/rst2html4 to provide /usr/bin/rst2html4 (rst2html4) in auto mode
update-alternatives: using /usr/share/docutils/scripts/python3/rst2html5 to provide /usr/bin/rst2html5 (rst2html5) in auto mode
update-alternatives: using /usr/share/docutils/scripts/python3/rst2latex to provide /usr/bin/rst2latex (rst2latex) in auto mode
update-alternatives: using /usr/share/docutils/scripts/python3/rst2man to provide /usr/bin/rst2man (rst2man) in auto mode
update-alternatives: using /usr/share/docutils/scripts/python3/rst2odt to provide /usr/bin/rst2odt (rst2odt) in auto mode
update-alternatives: using /usr/share/docutils/scripts/python3/rst2odt_prepstyles to provide /usr/bin/rst2odt_prepstyles (rst2odt_prepstyles) in auto mode
update-alternatives: using /usr/share/docutils/scripts/python3/rst2pseudoxml to provide /usr/bin/rst2pseudoxml (rst2pseudoxml) in auto mode
update-alternatives: using /usr/share/docutils/scripts/python3/rst2s5 to provide /usr/bin/rst2s5 (rst2s5) in auto mode
update-alternatives: using /usr/share/docutils/scripts/python3/rst2xetex to provide /usr/bin/rst2xetex (rst2xetex) in auto mode
update-alternatives: using /usr/share/docutils/scripts/python3/rst2xml to provide /usr/bin/rst2xml (rst2xml) in auto mode
update-alternatives: using /usr/share/docutils/scripts/python3/rstpep2html to provide /usr/bin/rstpep2html (rstpep2html) in auto mode
Setting up python3-sphinx (3.2.1-2) ...
Setting up sbuild-build-depends-cypari2-dummy (0.invalid.0) ...
Processing triggers for ca-certificates (20200601) ...
Updating certificates in /etc/ssl/certs...
0 added, 0 removed; done.
Running hooks in /etc/ca-certificates/update.d...
done.
W: No sandbox user '_apt' on the system, can not drop privileges

+------------------------------------------------------------------------------+
| Build environment                                                            |
+------------------------------------------------------------------------------+

Kernel: Linux 4.15.0-76-generic armhf (armv8l)
Toolchain package versions: binutils_2.35-2+rpi1 dpkg-dev_1.20.5+rpi1 g++-10_10.2.0-5+rpi1 gcc-10_10.2.0-5+rpi1 libc6-dev_2.31-3+rpi1 libstdc++-10-dev_10.2.0-5+rpi1 libstdc++6_10.2.0-5+rpi1 linux-libc-dev_5.7.10-1+rpi1
Package versions: adduser_3.118 apt_2.1.10 aptitude_0.8.13-2 aptitude-common_0.8.13-2 autoconf_2.69-11.1 automake_1:1.16.2-4 autopoint_0.19.8.1-10 autotools-dev_20180224.1 base-files_11+rpi1 base-passwd_3.5.47 bash_5.0-7 binutils_2.35-2+rpi1 binutils-arm-linux-gnueabihf_2.35-2+rpi1 binutils-common_2.35-2+rpi1 bsdextrautils_2.36-3 bsdutils_1:2.36-3 build-essential_12.8 bzip2_1.0.8-4 ca-certificates_20200601 coreutils_8.30-3 cpp_4:10.1.0-1+rpi1 cpp-10_10.2.0-5+rpi1 cython3_0.29.21-3 dash_0.5.10.2-7 debconf_1.5.74 debhelper_13.2.1 debianutils_4.9.1 dh-autoreconf_19 dh-python_4.20201102 dh-strip-nondeterminism_1.9.0-1 diffutils_1:3.7-3 dirmngr_2.2.20-1 docutils-common_0.16+dfsg-3 dpkg_1.20.5+rpi1 dpkg-dev_1.20.5+rpi1 dwz_0.13-5 e2fsprogs_1.45.6-1 fakeroot_1.24-1 fdisk_2.36-3 file_1:5.38-5 findutils_4.7.0-1 fonts-mathjax_2.7.9+dfsg-1 g++_4:10.1.0-1+rpi1 g++-10_10.2.0-5+rpi1 gcc_4:10.1.0-1+rpi1 gcc-10_10.2.0-5+rpi1 gcc-10-base_10.2.0-5+rpi1 gettext_0.19.8.1-10 gettext-base_0.19.8.1-10 gnupg_2.2.20-1 gnupg-l10n_2.2.20-1 gnupg-utils_2.2.20-1 gpg_2.2.20-1 gpg-agent_2.2.20-1 gpg-wks-client_2.2.20-1 gpg-wks-server_2.2.20-1 gpgconf_2.2.20-1 gpgsm_2.2.20-1 gpgv_2.2.20-1 grep_3.4-1 groff-base_1.22.4-5 gzip_1.10-2 hostname_3.23 init-system-helpers_1.58 intltool-debian_0.35.0+20060710.5 iputils-ping_3:20200821-2 libacl1_2.2.53-8 libapt-pkg6.0_2.1.10 libarchive-zip-perl_1.68-1 libasan6_10.2.0-5+rpi1 libassuan0_2.5.3-7.1 libatomic1_10.2.0-5+rpi1 libattr1_1:2.4.48-5 libaudit-common_1:2.8.5-3 libaudit1_1:2.8.5-3 libbinutils_2.35-2+rpi1 libblkid1_2.36-3 libboost-iostreams1.71.0_1.71.0-6+b1 libbsd0_0.10.0-1 libbz2-1.0_1.0.8-4 libc-bin_2.31-3+rpi1 libc-dev-bin_2.31-3+rpi1 libc6_2.31-3+rpi1 libc6-dev_2.31-3+rpi1 libcap-ng0_0.7.9-2.2 libcap2_1:2.43-1 libcap2-bin_1:2.43-1 libcc1-0_10.2.0-5+rpi1 libcom-err2_1.45.6-1 libcroco3_0.6.13-1 libcrypt-dev_1:4.4.17-1 libcrypt1_1:4.4.17-1 libctf-nobfd0_2.35-2+rpi1 libctf0_2.35-2+rpi1 libcwidget4_0.5.18-5 libdb5.3_5.3.28+dfsg1-0.6 libdebconfclient0_0.253 libdebhelper-perl_13.2.1 libdpkg-perl_1.20.5+rpi1 libelf1_0.181-1 libexpat1_2.2.10-1 libexpat1-dev_2.2.10-1 libext2fs2_1.45.6-1 libfakeroot_1.24-1 libfdisk1_2.36-3 libffi7_3.3-4 libfile-stripnondeterminism-perl_1.9.0-1 libgcc-10-dev_10.2.0-5+rpi1 libgcc-s1_10.2.0-5+rpi1 libgcrypt20_1.8.6-2 libgdbm-compat4_1.18.1-5.1 libgdbm6_1.18.1-5.1 libglib2.0-0_2.66.2-1 libgmp-dev_2:6.2.0+dfsg-6 libgmp10_2:6.2.0+dfsg-6 libgmpxx4ldbl_2:6.2.0+dfsg-6 libgnutls30_3.6.14-2+b1 libgomp1_10.2.0-5+rpi1 libgpg-error0_1.38-2 libgssapi-krb5-2_1.17-10+b3 libhogweed6_3.6-2 libicu67_67.1-4 libidn2-0_2.3.0-1 libisl22_0.22.1-1 libjs-jquery_3.5.1+dfsg+~3.5.4-1 libjs-mathjax_2.7.9+dfsg-1 libjs-sphinxdoc_3.2.1-2 libjs-underscore_1.9.1~dfsg-1 libk5crypto3_1.17-10+b3 libkeyutils1_1.6.1-2 libkrb5-3_1.17-10+b3 libkrb5support0_1.17-10+b3 libksba8_1.4.0-2 libldap-2.4-2_2.4.51+dfsg-1 libldap-common_2.4.51+dfsg-1 liblz4-1_1.9.2-2 liblzma5_5.2.4-1 libmagic-mgc_1:5.38-5 libmagic1_1:5.38-5 libmount1_2.36-3 libmpc3_1.2.0~rc1-1 libmpfr6_4.1.0-3 libncursesw6_6.2-1 libnettle8_3.6-2 libnpth0_1.6-2 libnsl2_1.3.0-2 libp11-kit0_0.23.21-2 libpam-cap_1:2.43-1 libpam-modules_1.3.1-5 libpam-modules-bin_1.3.1-5 libpam-runtime_1.3.1-5 libpam0g_1.3.1-5 libpari-dev_2.11.4-3 libpari-gmp-tls6_2.11.4-3 libpcre2-8-0_10.34-7 libpcre3_2:8.39-13 libperl5.30_5.30.3-4 libpipeline1_1.5.3-1 libpython3-all-dev_3.8.6-1 libpython3-dev_3.8.6-1 libpython3-stdlib_3.8.6-1 libpython3.8_3.8.6-1 libpython3.8-dev_3.8.6-1 libpython3.8-minimal_3.8.6-1 libpython3.8-stdlib_3.8.6-1 libpython3.9_3.9.0-5+rpi1 libpython3.9-dev_3.9.0-5+rpi1 libpython3.9-minimal_3.9.0-5+rpi1 libpython3.9-stdlib_3.9.0-5+rpi1 libreadline8_8.0-4 libsasl2-2_2.1.27+dfsg-2 libsasl2-modules-db_2.1.27+dfsg-2 libseccomp2_2.4.3-1+rpi1 libselinux1_3.1-2 libsemanage-common_3.1-1 libsemanage1_3.1-1 libsepol1_3.1-1 libsigc++-2.0-0v5_2.10.2-1 libsigsegv2_2.12-2 libsmartcols1_2.36-3 libsqlite3-0_3.33.0-1 libss2_1.45.6-1 libssl1.1_1.1.1h-1 libstdc++-10-dev_10.2.0-5+rpi1 libstdc++6_10.2.0-5+rpi1 libsub-override-perl_0.09-2 libsystemd0_246.2-1+rpi1 libtasn1-6_4.16.0-2 libtinfo6_6.2-1 libtirpc-common_1.2.6-3 libtirpc3_1.2.6-3 libtool_2.4.6-14 libubsan1_10.2.0-5+rpi1 libuchardet0_0.0.7-1 libudev1_246.2-1+rpi1 libunistring2_0.9.10-4 libuuid1_2.36-3 libx11-6_2:1.6.12-1 libx11-data_2:1.6.12-1 libxapian30_1.4.17-1 libxau6_1:1.0.8-1+b2 libxcb1_1.14-2 libxdmcp6_1:1.1.2-3 libxml2_2.9.10+dfsg-6.1 libzstd1_1.4.5+dfsg-4+rpi1 linux-libc-dev_5.7.10-1+rpi1 login_1:4.8.1-1 logsave_1.45.6-1 lsb-base_11.1.0+rpi1 m4_1.4.18-4 make_4.3-4 man-db_2.9.3-2 mawk_1.3.4.20200120-2 mime-support_3.64 mount_2.36-3 ncurses-base_6.2-1 ncurses-bin_6.2-1 netbase_6.1 node-jquery_3.5.1+dfsg+~3.5.4-1 openssl_1.1.1h-1 pari-doc_2.13.0-2 pari-gp_2.11.4-3 passwd_1:4.8.1-1 patch_2.7.6-6 perl_5.30.3-4 perl-base_5.30.3-4 perl-modules-5.30_5.30.3-4 pinentry-curses_1.1.0-4 po-debconf_1.0.21 python-babel-localedata_2.8.0+dfsg.1-4 python3_3.8.6-1 python3-alabaster_0.7.8-1.1 python3-all_3.8.6-1 python3-all-dev_3.8.6-1 python3-babel_2.8.0+dfsg.1-4 python3-certifi_2020.6.20-1 python3-chardet_3.0.4-7 python3-cysignals-pari_1.10.2+ds-4 python3-dev_3.8.6-1 python3-distutils_3.8.6-1 python3-docutils_0.16+dfsg-3 python3-idna_2.10-1 python3-imagesize_1.2.0-2 python3-jinja2_2.11.2-1 python3-lib2to3_3.8.6-1 python3-markupsafe_1.1.1-1 python3-minimal_3.8.6-1 python3-packaging_20.4-1 python3-pkg-resources_50.3.0-1 python3-pygments_2.3.1+dfsg-4 python3-pyparsing_2.4.7-1 python3-requests_2.24.0+dfsg-1 python3-roman_2.0.0-5 python3-setuptools_50.3.0-1 python3-six_1.15.0-1 python3-snowballstemmer_2.0.0-2 python3-sphinx_3.2.1-2 python3-tz_2020.1-2 python3-urllib3_1.25.9-1 python3.8_3.8.6-1 python3.8-dev_3.8.6-1 python3.8-minimal_3.8.6-1 python3.9_3.9.0-5+rpi1 python3.9-dev_3.9.0-5+rpi1 python3.9-minimal_3.9.0-5+rpi1 raspbian-archive-keyring_20120528.2 readline-common_8.0-4 sbuild-build-depends-core-dummy_0.invalid.0 sbuild-build-depends-cypari2-dummy_0.invalid.0 sed_4.7-1 sensible-utils_0.0.12+nmu1 sgml-base_1.30 sphinx-common_3.2.1-2 sysvinit-utils_2.96-4 tar_1.30+dfsg-7 tzdata_2020a-1 util-linux_2.36-3 xml-core_0.18+nmu1 xz-utils_5.2.4-1 zlib1g_1:1.2.11.dfsg-2 zlib1g-dev_1:1.2.11.dfsg-2

+------------------------------------------------------------------------------+
| Build                                                                        |
+------------------------------------------------------------------------------+


Unpack source
-------------

gpgv: unknown type of key resource 'trustedkeys.kbx'
gpgv: keyblock resource '/tmp/dpkg-verify-sig.Z8KlTW0u/trustedkeys.kbx': General error
gpgv: Signature made Sat Nov  7 11:17:19 2020 UTC
gpgv:                using RSA key A07E3AA25DCCDAEDA6628D248C82169D8ECECD2A
gpgv: Can't check signature: No public key
dpkg-source: warning: failed to verify signature on ./cypari2_2.1.2-1.dsc
dpkg-source: info: extracting cypari2 in /<<PKGBUILDDIR>>
dpkg-source: info: unpacking cypari2_2.1.2.orig.tar.gz
dpkg-source: info: unpacking cypari2_2.1.2-1.debian.tar.xz
dpkg-source: info: using patch list from debian/patches/series
dpkg-source: info: applying local-mathjax.patch
dpkg-source: info: applying doctest-find-module.patch
dpkg-source: info: applying disable-test-with-pari-bug.patch
dpkg-source: info: applying use-py3k-sphinx.patch

Check disk space
----------------

Sufficient free space for build

User Environment
----------------

APT_CONFIG=/var/lib/sbuild/apt.conf
DEB_BUILD_OPTIONS=parallel=4
HOME=/sbuild-nonexistent
LC_ALL=POSIX
LOGNAME=buildd
PATH=/usr/local/sbin:/usr/local/bin:/usr/sbin:/usr/bin:/sbin:/bin:/usr/games
SCHROOT_ALIAS_NAME=bullseye-staging-armhf-sbuild
SCHROOT_CHROOT_NAME=bullseye-staging-armhf-sbuild
SCHROOT_COMMAND=env
SCHROOT_GID=112
SCHROOT_GROUP=buildd
SCHROOT_SESSION_ID=bullseye-staging-armhf-sbuild-6e2bb32d-9333-4d27-b6e2-15bfb7393e58
SCHROOT_UID=107
SCHROOT_USER=buildd
SHELL=/bin/sh
USER=buildd

dpkg-buildpackage
-----------------

dpkg-buildpackage: info: source package cypari2
dpkg-buildpackage: info: source version 2.1.2-1
dpkg-buildpackage: info: source distribution unstable
 dpkg-source --before-build .
dpkg-buildpackage: info: host architecture armhf
 fakeroot debian/rules clean
dh clean --with autoreconf --with python3,sphinxdoc  --buildsystem=pybuild
   dh_auto_clean -O--buildsystem=pybuild
I: pybuild base:232: python3.9 setup.py clean 
running clean
removing '/<<PKGBUILDDIR>>/.pybuild/cpython3_3.9_cypari2/build' (and everything under it)
'build/bdist.linux-armhf' does not exist -- can't clean it
'build/scripts-3.9' does not exist -- can't clean it
I: pybuild base:232: python3.8 setup.py clean 
running clean
removing '/<<PKGBUILDDIR>>/.pybuild/cpython3_3.8_cypari2/build' (and everything under it)
'build/bdist.linux-armhf' does not exist -- can't clean it
'build/scripts-3.8' does not exist -- can't clean it
   dh_autoreconf_clean -O--buildsystem=pybuild
   dh_clean -O--buildsystem=pybuild
 debian/rules build-arch
dh build-arch --with autoreconf --with python3,sphinxdoc  --buildsystem=pybuild
   dh_update_autotools_config -a -O--buildsystem=pybuild
   dh_autoreconf -a -O--buildsystem=pybuild
   dh_auto_configure -a -O--buildsystem=pybuild
I: pybuild base:232: python3.9 setup.py config 
running config
I: pybuild base:232: python3.8 setup.py config 
running config
   debian/rules override_dh_auto_build
make[1]: Entering directory '/<<PKGBUILDDIR>>'
dh_auto_build
I: pybuild base:232: /usr/bin/python3.9 setup.py build 
running build
running build_py
creating /<<PKGBUILDDIR>>/.pybuild/cpython3_3.9_cypari2/build/cypari2
copying cypari2/__init__.py -> /<<PKGBUILDDIR>>/.pybuild/cpython3_3.9_cypari2/build/cypari2
copying cypari2/closure.pxd -> /<<PKGBUILDDIR>>/.pybuild/cpython3_3.9_cypari2/build/cypari2
copying cypari2/convert.pxd -> /<<PKGBUILDDIR>>/.pybuild/cpython3_3.9_cypari2/build/cypari2
copying cypari2/gen.pxd -> /<<PKGBUILDDIR>>/.pybuild/cpython3_3.9_cypari2/build/cypari2
copying cypari2/handle_error.pxd -> /<<PKGBUILDDIR>>/.pybuild/cpython3_3.9_cypari2/build/cypari2
copying cypari2/pari_instance.pxd -> /<<PKGBUILDDIR>>/.pybuild/cpython3_3.9_cypari2/build/cypari2
copying cypari2/paridecl.pxd -> /<<PKGBUILDDIR>>/.pybuild/cpython3_3.9_cypari2/build/cypari2
copying cypari2/paripriv.pxd -> /<<PKGBUILDDIR>>/.pybuild/cpython3_3.9_cypari2/build/cypari2
copying cypari2/stack.pxd -> /<<PKGBUILDDIR>>/.pybuild/cpython3_3.9_cypari2/build/cypari2
copying cypari2/string_utils.pxd -> /<<PKGBUILDDIR>>/.pybuild/cpython3_3.9_cypari2/build/cypari2
copying cypari2/types.pxd -> /<<PKGBUILDDIR>>/.pybuild/cpython3_3.9_cypari2/build/cypari2
copying cypari2/cypari.h -> /<<PKGBUILDDIR>>/.pybuild/cpython3_3.9_cypari2/build/cypari2
running build_ext
Generating PARI functions: (!_) (#_) (%) (%#) (+_) (-_) Catalan Col Colrev (DEBUGLEVEL) Euler I List Map Mat Mod (O) (O(_^_)) Pi Pol Polrev Qfb Ser Set Str Strchr Strexpand Strprintf Strtex Vec Vecrev Vecsmall ([_.._]) ([_|_<-_,_;_]) ([_|_<-_,_]) (_!) (_!=_) (_%=_) (_%_) (_&&_) (_') (_(_)) (_*=_) (_*_) (_++) (_+=_) (_+_) (_--) (_-=_) (_-_) (_.a1) (_.a2) (_.a3) (_.a4) (_.a6) (_.area) (_.b2) (_.b4) (_.b6) (_.b8) (_.bid) (_.bnf) (_.c4) (_.c6) (_.clgp) (_.codiff) (_.cyc) (_.diff) (_.disc) (_.e) (_.eta) (_.f) (_.fu) (_.futu) (_.gen) (_.group) (_.index) (_.j) (_.mod) (_.nf) (_.no) (_.omega) (_.orders) (_.p) (_.pol) (_.polabs) (_.r1) (_.r2) (_.reg) (_.roots) (_.sign) (_.t2) (_.tate) (_.tu) (_.tufu) (_.zk) (_.zkst) (_/=_) (_/_) (_<<=_) (_<<_) (_<=_) (_<_) (_===_) (_==_) (_>=_) (_>>=_) (_>>_) (_>_) (_F2xq_log_Coppersmith_worker) (_Flxq_log_Coppersmith_worker) (_Fp_log_sieve_worker) (_ZM_det_worker) (_ZM_inv_worker) (_ZX_ZXY_resultant_worker) (_ZX_resultant_worker) (_ZabM_inv_worker) (_[_,]) (_[_,_]) (_[_.._,_.._]) (_[_.._]) (_\/=_) (_\/_) (_\=_) (_\_) (_^_) (_^s) (__) (_aprcl_step4_worker) (_aprcl_step6_worker) (_avma) (_badtype) (_cast) (_cgetg) (_const_expr) (_const_quote) (_const_real) (_const_smallreal) (_decl_base) (_decl_ext) (_def_TeXstyle) (_def_breakloop) (_def_colors) (_def_compatible) (_def_datadir) (_def_debug) (_def_debugfiles) (_def_debugmem) (_def_echo) (_def_factor_add_primes) (_def_factor_proven) (_def_format) (_def_graphcolormap) (_def_graphcolors) (_def_help) (_def_histfile) (_def_histsize) (_def_lines) (_def_linewrap) (_def_log) (_def_logfile) (_def_nbthreads) (_def_new_galois_format) (_def_output) (_def_parisize) (_def_parisizemax) (_def_path) (_def_plothsizes) (_def_prettyprinter) (_def_primelimit) (_def_prompt) (_def_prompt_cont) (_def_psfile) (_def_readline) (_def_realbitprecision) (_def_realprecision) (_def_recover) (_def_secure) (_def_seriesprecision) (_def_simplify) (_def_sopath) (_def_strictargs) (_def_strictmatch) (_def_threadsize) (_def_threadsizemax) (_def_timer) (_default_check) (_default_marker) (_derivfun) (_diffptr) (_err_primes) (_err_type) (_eval_mnemonic) (_factor_Aurifeuille) (_factor_Aurifeuille_prime) (_forcomposite_init) (_forcomposite_next) (_formatcode) (_forpart_init) (_forpart_next) (_forperm_init) (_forperm_next) (_forprime_init) (_forprime_next) (_forprime_next_) (_forprimestep_init) (_forsubset_init) (_forsubset_next) (_forvec_init) (_forvec_next) (_gc_needed) (_gerepileall) (_gerepileupto) (_header_algebras) (_header_combinatorics) (_header_conversions) (_header_default) (_header_elliptic_curves) (_header_graphic) (_header_l_functions) (_header_linear_algebra) (_header_modular_forms) (_header_modular_symbols) (_header_number_fields) (_header_number_theoretical) (_header_operators) (_header_polynomials) (_header_programming/control) (_header_programming/parallel) (_header_programming/specific) (_header_sums) (_header_transcendental) (_iferr_CATCH) (_iferr_CATCH_reset) (_iferr_ENDCATCH) (_iferr_error) (_iferr_rethrow) (_low_stack_lim) (_maxprime) (_multi_if) (_ndec2nbits) (_ndec2prec) (_norange) (_nxMV_polint_worker) (_pareval_worker) (_parfor_worker) (_parselect_worker) (_parvector_worker) (_polint_worker) (_polmodular_worker) (_proto_code) (_proto_max_args) (_proto_ret) (_safecoeff) (_stack_lim) (_strtoclosure) (_tovec) (_tovecprec) (_type_preorder) (_typedef) (_u_forprime_init) (_u_forprime_next) (_void_if) (_wrap_G) (_wrap_GG) (_wrap_Gp) (_wrap_bG) (_wrap_vG) (_||_) (_~) abs acos acosh addhelp addprimes agm alarm algadd algalgtobasis algaut algb algbasis algbasistoalg algcenter algcentralproj algchar algcharpoly algdegree algdep algdim algdisc algdivl algdivr alggroup alggroupcenter alghasse alghassef alghassei algindex alginit alginv alginvbasis algisassociative algiscommutative algisdivision algisdivl algisinv algisramified algissemisimple algissimple algissplit alglatadd alglatcontains alglatelement alglathnf alglatindex alglatinter alglatlefttransporter alglatmul alglatrighttransporter alglatsubset algmakeintegral algmul algmultable algneg algnorm algpoleval algpow algprimesubalg algquotient algradical algramifiedplaces algrandom algrelmultable algsimpledec algsplit algsplittingdata algsplittingfield algsqr algsub algsubalg algtableinit algtensor algtomatrix algtrace algtype (alias) (allocatemem) apply arg asin asinh asympnum atan atanh bernfrac bernpol bernreal bernvec besselh1 besselh2 besseli besselj besseljh besselk besseln bestappr bestapprPade bestapprnf bezout bezoutres bigomega binary binomial bitand bitneg bitnegimply bitor bitprecision bittest bitxor bnfcertify bnfcompressTraceback (most recent call last):
  File "/<<PKGBUILDDIR>>/setup.py", line 66, in <module>
    setup(
  File "/usr/lib/python3/dist-packages/setuptools/__init__.py", line 153, in setup
    return distutils.core.setup(**attrs)
  File "/usr/lib/python3.9/distutils/core.py", line 148, in setup
    dist.run_commands()
  File "/usr/lib/python3.9/distutils/dist.py", line 966, in run_commands
    self.run_command(cmd)
  File "/usr/lib/python3.9/distutils/dist.py", line 985, in run_command
    cmd_obj.run()
  File "/usr/lib/python3.9/distutils/command/build.py", line 135, in run
    self.run_command(cmd_name)
  File "/usr/lib/python3.9/distutils/cmd.py", line 313, in run_command
    self.distribution.run_command(command)
  File "/usr/lib/python3.9/distutils/dist.py", line 984, in run_command
    cmd_obj.ensure_finalized()
  File "/usr/lib/python3.9/distutils/cmd.py", line 107, in ensure_finalized
    self.finalize_options()
  File "/<<PKGBUILDDIR>>/setup.py", line 32, in finalize_options
    rebuild()
  File "/<<PKGBUILDDIR>>/autogen/__init__.py", line 26, in rebuild
    G()
  File "/<<PKGBUILDDIR>>/autogen/generator.py", line 341, in __call__
    self.handle_pari_function(**v)
  File "/<<PKGBUILDDIR>>/autogen/generator.py", line 234, in handle_pari_function
    doc = get_rest_doc(function)
  File "/<<PKGBUILDDIR>>/autogen/doc.py", line 340, in get_rest_doc
    raw = get_raw_doc(function)
  File "/<<PKGBUILDDIR>>/autogen/doc.py", line 274, in get_raw_doc
    raise RuntimeError("no help found for '{}'".format(function))
RuntimeError: no help found for 'bnfcompress'
E: pybuild pybuild:353: build: plugin distutils failed with: exit code=1: /usr/bin/python3.9 setup.py build 
I: pybuild base:232: /usr/bin/python3 setup.py build 
running build
running build_py
creating /<<PKGBUILDDIR>>/.pybuild/cpython3_3.8_cypari2/build/cypari2
copying cypari2/__init__.py -> /<<PKGBUILDDIR>>/.pybuild/cpython3_3.8_cypari2/build/cypari2
copying cypari2/closure.pxd -> /<<PKGBUILDDIR>>/.pybuild/cpython3_3.8_cypari2/build/cypari2
copying cypari2/convert.pxd -> /<<PKGBUILDDIR>>/.pybuild/cpython3_3.8_cypari2/build/cypari2
copying cypari2/gen.pxd -> /<<PKGBUILDDIR>>/.pybuild/cpython3_3.8_cypari2/build/cypari2
copying cypari2/handle_error.pxd -> /<<PKGBUILDDIR>>/.pybuild/cpython3_3.8_cypari2/build/cypari2
copying cypari2/pari_instance.pxd -> /<<PKGBUILDDIR>>/.pybuild/cpython3_3.8_cypari2/build/cypari2
copying cypari2/paridecl.pxd -> /<<PKGBUILDDIR>>/.pybuild/cpython3_3.8_cypari2/build/cypari2
copying cypari2/paripriv.pxd -> /<<PKGBUILDDIR>>/.pybuild/cpython3_3.8_cypari2/build/cypari2
copying cypari2/stack.pxd -> /<<PKGBUILDDIR>>/.pybuild/cpython3_3.8_cypari2/build/cypari2
copying cypari2/string_utils.pxd -> /<<PKGBUILDDIR>>/.pybuild/cpython3_3.8_cypari2/build/cypari2
copying cypari2/types.pxd -> /<<PKGBUILDDIR>>/.pybuild/cpython3_3.8_cypari2/build/cypari2
copying cypari2/cypari.h -> /<<PKGBUILDDIR>>/.pybuild/cpython3_3.8_cypari2/build/cypari2
running build_ext
Generating PARI functions: (!_) (#_) (%) (%#) (+_) (-_) Catalan Col Colrev (DEBUGLEVEL) Euler I List Map Mat Mod (O) (O(_^_)) Pi Pol Polrev Qfb Ser Set Str Strchr Strexpand Strprintf Strtex Vec Vecrev Vecsmall ([_.._]) ([_|_<-_,_;_]) ([_|_<-_,_]) (_!) (_!=_) (_%=_) (_%_) (_&&_) (_') (_(_)) (_*=_) (_*_) (_++) (_+=_) (_+_) (_--) (_-=_) (_-_) (_.a1) (_.a2) (_.a3) (_.a4) (_.a6) (_.area) (_.b2) (_.b4) (_.b6) (_.b8) (_.bid) (_.bnf) (_.c4) (_.c6) (_.clgp) (_.codiff) (_.cyc) (_.diff) (_.disc) (_.e) (_.eta) (_.f) (_.fu) (_.futu) (_.gen) (_.group) (_.index) (_.j) (_.mod) (_.nf) (_.no) (_.omega) (_.orders) (_.p) (_.pol) (_.polabs) (_.r1) (_.r2) (_.reg) (_.roots) (_.sign) (_.t2) (_.tate) (_.tu) (_.tufu) (_.zk) (_.zkst) (_/=_) (_/_) (_<<=_) (_<<_) (_<=_) (_<_) (_===_) (_==_) (_>=_) (_>>=_) (_>>_) (_>_) (_F2xq_log_Coppersmith_worker) (_Flxq_log_Coppersmith_worker) (_Fp_log_sieve_worker) (_ZM_det_worker) (_ZM_inv_worker) (_ZX_ZXY_resultant_worker) (_ZX_resultant_worker) (_ZabM_inv_worker) (_[_,]) (_[_,_]) (_[_.._,_.._]) (_[_.._]) (_\/=_) (_\/_) (_\=_) (_\_) (_^_) (_^s) (__) (_aprcl_step4_worker) (_aprcl_step6_worker) (_avma) (_badtype) (_cast) (_cgetg) (_const_expr) (_const_quote) (_const_real) (_const_smallreal) (_decl_base) (_decl_ext) (_def_TeXstyle) (_def_breakloop) (_def_colors) (_def_compatible) (_def_datadir) (_def_debug) (_def_debugfiles) (_def_debugmem) (_def_echo) (_def_factor_add_primes) (_def_factor_proven) (_def_format) (_def_graphcolormap) (_def_graphcolors) (_def_help) (_def_histfile) (_def_histsize) (_def_lines) (_def_linewrap) (_def_log) (_def_logfile) (_def_nbthreads) (_def_new_galois_format) (_def_output) (_def_parisize) (_def_parisizemax) (_def_path) (_def_plothsizes) (_def_prettyprinter) (_def_primelimit) (_def_prompt) (_def_prompt_cont) (_def_psfile) (_def_readline) (_def_realbitprecision) (_def_realprecision) (_def_recover) (_def_secure) (_def_seriesprecision) (_def_simplify) (_def_sopath) (_def_strictargs) (_def_strictmatch) (_def_threadsize) (_def_threadsizemax) (_def_timer) (_default_check) (_default_marker) (_derivfun) (_diffptr) (_err_primes) (_err_type) (_eval_mnemonic) (_factor_Aurifeuille) (_factor_Aurifeuille_prime) (_forcomposite_init) (_forcomposite_next) (_formatcode) (_forpart_init) (_forpart_next) (_forperm_init) (_forperm_next) (_forprime_init) (_forprime_next) (_forprime_next_) (_forprimestep_init) (_forsubset_init) (_forsubset_next) (_forvec_init) (_forvec_next) (_gc_needed) (_gerepileall) (_gerepileupto) (_header_algebras) (_header_combinatorics) (_header_conversions) (_header_default) (_header_elliptic_curves) (_header_graphic) (_header_l_functions) (_header_linear_algebra) (_header_modular_forms) (_header_modular_symbols) (_header_number_fields) (_header_number_theoretical) (_header_operators) (_header_polynomials) (_header_programming/control) (_header_programming/parallel) (_header_programming/specific) (_header_sums) (_header_transcendental) (_iferr_CATCH) (_iferr_CATCH_reset) (_iferr_ENDCATCH) (_iferr_error) (_iferr_rethrow) (_low_stack_lim) (_maxprime) (_multi_if) (_ndec2nbits) (_ndec2prec) (_norange) (_nxMV_polint_worker) (_pareval_worker) (_parfor_worker) (_parselect_worker) (_parvector_worker) (_polint_worker) (_polmodular_worker) (_proto_code) (_proto_max_args) (_proto_ret) (_safecoeff) (_stack_lim) (_strtoclosure) (_tovec) (_tovecprec) (_type_preorder) (_typedef) (_u_forprime_init) (_u_forprime_next) (_void_if) (_wrap_G) (_wrap_GG) (_wrap_Gp) (_wrap_bG) (_wrap_vG) (_||_) (_~) abs acos acosh addhelp addprimes agm alarm algadd algalgtobasis algaut algb algbasis algbasistoalg algcenter algcentralproj algchar algcharpoly algdegree algdep algdim algdisc algdivl algdivr alggroup alggroupcenter alghasse alghassef alghassei algindex alginit alginv alginvbasis algisassociative algiscommutative algisdivision algisdivl algisinv algisramified algissemisimple algissimple algissplit alglatadd alglatcontains alglatelement alglathnf alglatindex alglatinter alglatlefttransporter alglatmul alglatrighttransporter alglatsubset algmakeintegral algmul algmultable algneg algnorm algpoleval algpow algprimesubalg algquotient algradical algramifiedplaces algrandom algrelmultable algsimpledec algsplit algsplittingdata algsplittingfield algsqr algsub algsubalg algtableinit algtensor algtomatrix algtrace algtype (alias) (allocatemem) apply arg asin asinh asympnum atan atanh bernfrac bernpol bernreal bernvec besselh1 besselh2 besseli besselj besseljh besselk besseln bestappr bestapprPade bestapprnf bezout bezoutres bigomega binary binomial bitand bitneg bitnegimply bitor bitprecision bittest bitxor bnfcertify bnfcompressTraceback (most recent call last):
  File "setup.py", line 66, in <module>
    setup(
  File "/usr/lib/python3/dist-packages/setuptools/__init__.py", line 153, in setup
    return distutils.core.setup(**attrs)
  File "/usr/lib/python3.8/distutils/core.py", line 148, in setup
    dist.run_commands()
  File "/usr/lib/python3.8/distutils/dist.py", line 966, in run_commands
    self.run_command(cmd)
  File "/usr/lib/python3.8/distutils/dist.py", line 985, in run_command
    cmd_obj.run()
  File "/usr/lib/python3.8/distutils/command/build.py", line 135, in run
    self.run_command(cmd_name)
  File "/usr/lib/python3.8/distutils/cmd.py", line 313, in run_command
    self.distribution.run_command(command)
  File "/usr/lib/python3.8/distutils/dist.py", line 984, in run_command
    cmd_obj.ensure_finalized()
  File "/usr/lib/python3.8/distutils/cmd.py", line 107, in ensure_finalized
    self.finalize_options()
  File "setup.py", line 32, in finalize_options
    rebuild()
  File "/<<PKGBUILDDIR>>/autogen/__init__.py", line 26, in rebuild
    G()
  File "/<<PKGBUILDDIR>>/autogen/generator.py", line 341, in __call__
    self.handle_pari_function(**v)
  File "/<<PKGBUILDDIR>>/autogen/generator.py", line 234, in handle_pari_function
    doc = get_rest_doc(function)
  File "/<<PKGBUILDDIR>>/autogen/doc.py", line 340, in get_rest_doc
    raw = get_raw_doc(function)
  File "/<<PKGBUILDDIR>>/autogen/doc.py", line 274, in get_raw_doc
    raise RuntimeError("no help found for '{}'".format(function))
RuntimeError: no help found for 'bnfcompress'
E: pybuild pybuild:353: build: plugin distutils failed with: exit code=1: /usr/bin/python3 setup.py build 
dh_auto_build: error: pybuild --build -i python{version} -p "3.9 3.8" returned exit code 13
make[1]: *** [debian/rules:12: override_dh_auto_build] Error 25
make[1]: Leaving directory '/<<PKGBUILDDIR>>'
make: *** [debian/rules:7: build-arch] Error 2
dpkg-buildpackage: error: debian/rules build-arch subprocess returned exit status 2
--------------------------------------------------------------------------------
Build finished at 2020-11-12T08:12:55Z

Finished
--------


+------------------------------------------------------------------------------+
| Cleanup                                                                      |
+------------------------------------------------------------------------------+

Purging /<<BUILDDIR>>
Not cleaning session: cloned chroot in use
E: Build failure (dpkg-buildpackage died)

+------------------------------------------------------------------------------+
| Summary                                                                      |
+------------------------------------------------------------------------------+

Build Architecture: armhf
Build-Space: 12148
Build-Time: 29
Distribution: bullseye-staging
Fail-Stage: build
Host Architecture: armhf
Install-Time: 690
Job: cypari2_2.1.2-1
Machine Architecture: armhf
Package: cypari2
Package-Time: 736
Source-Version: 2.1.2-1
Space: 12148
Status: attempted
Version: 2.1.2-1
--------------------------------------------------------------------------------
Finished at 2020-11-12T08:12:55Z
Build needed 00:12:16, 12148k disk space